jenkins没有deploy war/ear to a container插件怎么弄?

今天第一次使用jenkins,跟着别人的教程做的,但是别人点出来的这个插件我这里没有,在设置里面也找不到这个插件
如下图 搜索不到
图片说明
百度查了下这个插件叫做Deploy Plugin 我能不能在其他地方直接下载这个插件然后复制到jenkins根目录里面,能否告知下载网址以及jenkins到插件目录,我下载了以后放在哪一个目录里面

5个回答

可以通过手动安装插件的方式:https://www.cnblogs.com/ziyuyuyu/p/9237636.html

jenkins ,不按照插件,通过脚本部署应用:https://blog.csdn.net/yszd2017/article/details/78039702

deploy to container 插件

输入字数少了要输入Deploy to才有搜索结果

Csdn user default icon
上传中...
上传图片
插入图片
抄袭、复制答案,以达到刷声望分或其他目的的行为,在CSDN问答是严格禁止的,一经发现立刻封号。是时候展现真正的技术了!
其他相关推荐
关于jenkins发布项目到weblogic的问题
ERROR: Build step failed with exception java.lang.NullPointerException at hudson.plugins.deploy.DeployPublisher.perform(DeployPublisher.java:60) at hudson.tasks.BuildStepMonitor$3.perform(BuildStepMonitor.java:45) at hudson.model.AbstractBuild$AbstractBuildExecution.perform(AbstractBuild.java:779) at hudson.model.AbstractBuild$AbstractBuildExecution.performAllBuildSteps(AbstractBuild.java:726) at hudson.model.Build$BuildExecution.post2(Build.java:185) at hudson.model.AbstractBuild$AbstractBuildExecution.post(AbstractBuild.java:671) at hudson.model.Run.execute(Run.java:1766) at hudson.model.FreeStyleBuild.run(FreeStyleBuild.java:43) at hudson.model.ResourceController.execute(ResourceController.java:98) at hudson.model.Executor.run(Executor.java:408) Build step 'Deploy war/ear to a container' marked build as failure Finished: FAILURE,但是war已经发布到了weblogic,jenkins显示错误,求大神指导。以上。
Jenkins 2.73.3 版本自动部署到Tomcat报错
这是我的配置:![图片说明](https://img-ask.csdn.net/upload/201711/13/1510557566_437248.png) 这是tomcat-users.xml配置: <role rolename="manager"/> <role rolename="manager-script"/> <role rolename="manager-gui"/> <role rolename="manager-jmx"/> <role rolename="manager-status"/> <user username="admin" password="admin" roles="manager,manager-gui,manager-script,manager-jmx,manager-status"/> 以下是报错信息: Deploying C:\Users\Administrator\.jenkins\workspace\demo\target\dfs.war to container Tomcat 8.x Remote with context ERROR: Build step failed with exception org.codehaus.cargo.container.ContainerException: The [cargo.remote.username] and [cargo.remote.password] properties are mandatory and need to be defined in your configuration. at org.codehaus.cargo.container.tomcat.internal.AbstractTomcatManagerDeployer.createManager(AbstractTomcatManagerDeployer.java:318) at org.codehaus.cargo.container.tomcat.internal.AbstractTomcatManagerDeployer.getTomcatManager(AbstractTomcatManagerDeployer.java:83) at org.codehaus.cargo.container.tomcat.internal.AbstractTomcatManagerDeployer.redeploy(AbstractTomcatManagerDeployer.java:173) at hudson.plugins.deploy.CargoContainerAdapter.deploy(CargoContainerAdapter.java:77) at hudson.plugins.deploy.CargoContainerAdapter$DeployCallable.invoke(CargoContainerAdapter.java:147) at hudson.plugins.deploy.CargoContainerAdapter$DeployCallable.invoke(CargoContainerAdapter.java:117) at hudson.FilePath.act(FilePath.java:998) at hudson.FilePath.act(FilePath.java:976) at hudson.plugins.deploy.CargoContainerAdapter.redeploy(CargoContainerAdapter.java:114) at hudson.plugins.deploy.PasswordProtectedAdapterCargo.redeploy(PasswordProtectedAdapterCargo.java:93) at hudson.plugins.deploy.DeployPublisher.perform(DeployPublisher.java:64) at hudson.tasks.BuildStepMonitor$3.perform(BuildStepMonitor.java:45) at hudson.model.AbstractBuild$AbstractBuildExecution.perform(AbstractBuild.java:736) at hudson.model.AbstractBuild$AbstractBuildExecution.performAllBuildSteps(AbstractBuild.java:682) at hudson.maven.MavenModuleSetBuild$MavenModuleSetBuildExecution.post2(MavenModuleSetBuild.java:1073) at hudson.model.AbstractBuild$AbstractBuildExecution.post(AbstractBuild.java:627) at hudson.model.Run.execute(Run.java:1762) at hudson.maven.MavenModuleSetBuild.run(MavenModuleSetBuild.java:543) at hudson.model.ResourceController.execute(ResourceController.java:97) at hudson.model.Executor.run(Executor.java:421) Build step 'Deploy war/ear to a container' marked build as failure Finished: FAILURE
jenkins 插件开发 js/css/图片等静态文件的引入问题
本人尝试将 js文件放入到 与类文件相同名称的 src/main/resources 下没用,放入src/main/webapp下还是没用,总是报404 找不到文件。有没有 懂jenkins插件开发的大佬 指点一下的? 主要问题: jenkins plugin 开发静态文件应该放在那里?在jelly中怎么引用? ![图片说明](https://img-ask.csdn.net/upload/201807/16/1531712307_956431.png) ![图片说明](https://img-ask.csdn.net/upload/201807/16/1531711936_831817.png)
Jenkins构建失败,没有生成jtl
报错日志: Started by user anonymous Building on master in workspace /Users/Shared/Jenkins/Home/job/extras [extras] $ /Users/lixiuming/Ant/bin/ant Buildfile: /Users/Shared/Jenkins/Home/job/extras/build.xml run: [echo] funcMode = false [jmeter] Executing test plan: /Users/Shared/Jenkins/Home/job/script/TestSentence1.jmx ==> /Users/Shared/Jenkins/Home/job/extras/result/Test201801020249.jtl [jmeter] 2018-01-02 14:49:32,219 main ERROR FileManager (jmeter.log) java.io.FileNotFoundException: jmeter.log (Permission denied) java.io.FileNotFoundException: jmeter.log (Permission denied) 。。。。。。。。。。 _message_xalan: xslt-report: BUILD FAILED /Users/Shared/Jenkins/Home/job/extras/build.xml:150: input file /Users/Shared/Jenkins/Home/job/extras/result/Test201801020249.jtl does not exist
使用jenkins进行自动化部署到tomcat deploy-to 插件,未打印任务后续操作日志?
![图片说明](https://img-ask.csdn.net/upload/201901/03/1546503413_43859.png)我已经配置了构建后操作,但问题是我的日志? ![图片说明](https://img-ask.csdn.net/upload/201901/03/1546503524_603795.png) 直接就没有任何构建后操作,然后就结束了...这是什么情况?没搞明白。 插件是deploy-to tomcat 是8 有配置7 和8都不行。 现在我感觉就是插件有问题,因为构建后操作都未打印,如果有报错这个还好说,哪里配置出错,先行就是直接提示成功,但未做我想要做的事情。求jenkins高手指点一下。
jenkins windowx环境 ruby插件安装失败 提示 no such file to load -- haml
``` ruby-runtime 失败 - org.jruby.exceptions.RaiseException: (LoadError) no such file to load -- haml at org.jruby.RubyKernel.require(org/jruby/RubyKernel.java:1027) at RUBY.require(jar:file:/D:/Program%2520Files/Jenkins/plugins/ruby-runtime/WEB-INF/lib/jruby-complete-1.7.3.jar!/META-INF/jruby.home/lib/ruby/shared/rubygems/custom_require.rb:36) at RUBY.(root)(file:/D:/Program%20Files/Jenkins/plugins/ruby-runtime/WEB-INF/lib/stapler-jruby-1.209.jar!/org/kohsuke/stapler/jelly/jruby/haml/JRubyJellyHamlScript.rb:1) at org.jruby.RubyKernel.require(org/jruby/RubyKernel.java:1027) at RUBY.(root)(jar:file:/D:/Program%2520Files/Jenkins/plugins/ruby-runtime/WEB-INF/lib/jruby-complete-1.7.3.jar!/META-INF/jruby.home/lib/ruby/shared/rubygems/custom_require.rb:1) at RUBY.require(jar:file:/D:/Program%2520Files/Jenkins/plugins/ruby-runtime/WEB-INF/lib/jruby-complete-1.7.3.jar!/META-INF/jruby.home/lib/ruby/shared/rubygems/custom_require.rb:36) Caused: org.jruby.embed.EvalFailedException: (LoadError) no such file to load -- haml at org.jruby.embed.internal.EmbedEvalUnitImpl.run(EmbedEvalUnitImpl.java:133) at org.jruby.embed.ScriptingContainer.runUnit(ScriptingContainer.java:1264) at org.jruby.embed.ScriptingContainer.runScriptlet(ScriptingContainer.java:1257) at org.kohsuke.stapler.jelly.jruby.haml.HamlLanguage.createContainer(HamlLanguage.java:28) at org.kohsuke.stapler.jelly.jruby.JRubyFacet.<init>(JRubyFacet.java:71) at ruby.RubyRuntimePlugin.registerJRubyFacet(RubyRuntimePlugin.java:39) at ruby.RubyRuntimePlugin.start(RubyRuntimePlugin.java:30) at hudson.ClassicPluginStrategy.startPlugin(ClassicPluginStrategy.java:401) at hudson.ClassicPluginStrategy.load(ClassicPluginStrategy.java:390) Caused: java.io.IOException: Failed to initialize at hudson.ClassicPluginStrategy.load(ClassicPluginStrategy.java:393) at hudson.PluginManager.dynamicLoad(PluginManager.java:929) Caused: java.io.IOException: Failed to install ruby-runtime plugin at hudson.PluginManager.dynamicLoad(PluginManager.java:941) at hudson.model.UpdateCenter$InstallationJob._run(UpdateCenter.java:2052) Caused: java.io.IOException: Failed to dynamically deploy this plugin at hudson.model.UpdateCenter$InstallationJob._run(UpdateCenter.java:2056) at hudson.model.UpdateCenter$DownloadJob.run(UpdateCenter.java:1740) at java.util.concurrent.Executors$RunnableAdapter.call(Unknown Source) at java.util.concurrent.FutureTask.run(Unknown Source) at hudson.remoting.AtmostOneThreadExecutor$Worker.run(AtmostOneThreadExecutor.java:112) at java.lang.Thread.run(Unknown Source) ``` 求助 ,谢谢。 ------------------------------------------------------- 搞定了 换了个版本 之前是2.190 现在用 2.200 没问题了 马勒个巴子
jenkins安装完成以后尴尬了,该怎么解决?
**按照官方网站一步步安装,解决个别错误,修改端口号启动** udo wget -O /etc/yum.repos.d/jenkins.repo https://pkg.jenkins.io/redhat/jenkins.repo sudo rpm --import https://pkg.jenkins.io/redhat/jenkins.io.key yum install jenkins 安装完成后,有如下相关目录: (1)/usr/lib/jenkins/:jenkins安装目录,WAR包会放在这里。 (2) /etc/sysconfig/jenkins:jenkins配置文件,“端口”,“JENKINS_HOME”等都可以在这里配置。 (3)/var/lib/jenkins/:默认的JENKINS_HOME。 (4)/var/log/jenkins/jenkins.log:Jenkins日志文件。 第一种启动方法,切换到jenkins.war存放的目录,输入如下命令: $ java -jar jenkins.war 修改端口号8089 java -jar jenkins.war --httpPort=8089 ## **然后。。。** ![图片说明](https://img-ask.csdn.net/upload/201709/28/1506591192_44316.png) **我做了什么,谁能告诉我密码是什么,在哪修改**
从JENKINS创建了MAVEN项目在build之后如何deploy到kubernetes
我有个问题请教大学身,从JENKINS创建了MAVEN项目在build之后如何deploy到kubernetes,配置的插件提示缺少~/.kube/config,如何破
jenkins容器中使用docker,提示权限错误。
我按照官网的步骤: 创建容器 sudo docker run -u root -d --rm -p 8080:8080 -v jenkins-data:/var/jenkins_home -v /var/run/docker.sock:/var/run/docker.sock jenkinsci/blueocean 然而进入容器还是报了如下错误 Got permission denied while trying to connect to the Docker daemon socket at unix:///var/run/docker.sock: Get http://%2Fvar%2Frun%2Fdocker.sock/v1.39/containers/json: dial unix /var/run/docker.sock: connect: permission denied ![图片说明](https://img-ask.csdn.net/upload/201910/15/1571124630_534565.png)
jenkins maven android项目打包apk
RT,在jenkins如何打包maven管理的android项目。 ant打包已经试过,没有效果,这个只能打包自由风格的项目吧; maven应该可以打包android项目的,只要配置好pom.xml文件,结果报错了 我是根据这篇文章配置的pom.xml,命令行运行mvn clean package报错 unknown <packaging>apk</packaging> 在jenkins报错: [INFO] /bin/sh: /root/android-sdk-macosx/build-tools/19.1.0/aapt: cannot execute binary file [ERROR] Error when generating sources. org.apache.maven.plugin.MojoExecutionException: at com.jayway.maven.plugins.android.phase01generatesources.GenerateSourcesMojo.generateR(GenerateSourcesMojo.java:745) 。。。 Caused by: com.jayway.maven.plugins.android.ExecutionException: ANDROID-040-001: Could not execute: Command = /bin/sh -c cd /root/.jenkins/workspace/apos && /root/android-sdk-macosx/build-tools/19.1.0/aapt package -m -J /root/.jenkins/workspace/apos/target/generated-sources/r -f --no-crunch -M /root/.jenkins/workspace/apos/AndroidManifest.xml -S /root/.jenkins/workspace/apos/res --auto-add-overlay -A /root/.jenkins/workspace/apos/target/generated-sources/combined-assets -I /root/android-sdk-macosx/platforms/android-17/android.jar --output-text-symbols /root/.jenkins/workspace/apos/target, Result = 126 为什么jenkins会报错无法执行命令,而在命令行运行mvn clean package时却unknown apk。。 求教~
Jenkins plugin安装后如何使用
在Jenkins界面http://localhost:1080---manage jenkins--manage plugins--安装pugin--回到jenkins首页---new item,如何在这个item配置中用到plugin?或者说安装的plugin怎么用?
jenkins中S3-publisher插件出现安装完启动不了的问题。
在我安装完S3-publisher的时候,去启动它,日志中报错,报错如下: ``` Failed to load hudson.plugins.s3.Entry com.amazonaws.SdkClientException: Unable to load partition metadata from com/amazonaws/partitions/endpoints.json at com.amazonaws.partitions.PartitionsLoader.build(PartitionsLoader.java:82) at com.amazonaws.regions.RegionMetadataFactory.create(RegionMetadataFactory.java:30) at com.amazonaws.regions.RegionUtils.initialize(RegionUtils.java:65) at com.amazonaws.regions.RegionUtils.getRegionMetadata(RegionUtils.java:53) at com.amazonaws.regions.RegionUtils.getRegionsForService(RegionUtils.java:98) at hudson.plugins.s3.Entry.<clinit>(Entry.java:41) Caused: java.lang.ExceptionInInitializerError at sun.misc.Unsafe.ensureClassInitialized(Native Method) at sun.reflect.UnsafeFieldAccessorFactory.newFieldAccessor(UnsafeFieldAccessorFactory.java:43) at sun.reflect.ReflectionFactory.newFieldAccessor(ReflectionFactory.java:156) at java.lang.reflect.Field.acquireFieldAccessor(Field.java:1088) at java.lang.reflect.Field.getFieldAccessor(Field.java:1069) at java.lang.reflect.Field.get(Field.java:393) at net.java.sezpoz.IndexItem.instance(IndexItem.java:185) Caused: java.lang.InstantiationException at net.java.sezpoz.IndexItem.instance(IndexItem.java:193) at hudson.ExtensionFinder$GuiceFinder.instantiate(ExtensionFinder.java:369) at hudson.ExtensionFinder$GuiceFinder.access$700(ExtensionFinder.java:240) at hudson.ExtensionFinder$GuiceFinder$SezpozModule$1.get(ExtensionFinder.java:557) at com.google.inject.internal.ProviderInternalFactory.provision(ProviderInternalFactory.java:81) at com.google.inject.internal.InternalFactoryToInitializableAdapter.provision(InternalFactoryToInitializableAdapter.java:53) at com.google.inject.internal.ProviderInternalFactory$1.call(ProviderInternalFactory.java:65) at com.google.inject.internal.ProvisionListenerStackCallback$Provision.provision(ProvisionListenerStackCallback.java:115) at hudson.ExtensionFinder$GuiceFinder$SezpozModule.onProvision(ExtensionFinder.java:577) at com.google.inject.internal.ProvisionListenerStackCallback$Provision.provision(ProvisionListenerStackCallback.java:126) at com.google.inject.internal.ProvisionListenerStackCallback.provision(ProvisionListenerStackCallback.java:68) at com.google.inject.internal.ProviderInternalFactory.circularGet(ProviderInternalFactory.java:63) at com.google.inject.internal.InternalFactoryToInitializableAdapter.get(InternalFactoryToInitializableAdapter.java:45) at com.google.inject.internal.ProviderToInternalFactoryAdapter$1.call(ProviderToInternalFactoryAdapter.java:46) at com.google.inject.internal.InjectorImpl.callInContext(InjectorImpl.java:1103) at com.google.inject.internal.ProviderToInternalFactoryAdapter.get(ProviderToInternalFactoryAdapter.java:40) at com.google.inject.internal.SingletonScope$1.get(SingletonScope.java:145) at hudson.ExtensionFinder$GuiceFinder$FaultTolerantScope$1.get(ExtensionFinder.java:440) at com.google.inject.internal.InternalFactoryToProviderAdapter.get(InternalFactoryToProviderAdapter.java:41) at com.google.inject.internal.InjectorImpl$2$1.call(InjectorImpl.java:1016) at com.google.inject.internal.InjectorImpl.callInContext(InjectorImpl.java:1092) at com.google.inject.internal.InjectorImpl$2.get(InjectorImpl.java:1012) at hudson.ExtensionFinder$GuiceFinder._find(ExtensionFinder.java:402) at hudson.ExtensionFinder$GuiceFinder.find(ExtensionFinder.java:393) at hudson.ClassicPluginStrategy.findComponents(ClassicPluginStrategy.java:344) at hudson.ExtensionList.load(ExtensionList.java:381) at hudson.ExtensionList.ensureLoaded(ExtensionList.java:317) at hudson.ExtensionList.iterator(ExtensionList.java:172) at jenkins.model.Jenkins.getDescriptorByType(Jenkins.java:1599) at hudson.plugins.git.GitSCM.onLoaded(GitSCM.java:1870) at sun.reflect.NativeMethodAccessorImpl.invoke0(Native Method) at sun.reflect.NativeMethodAccessorImpl.invoke(NativeMethodAccessorImpl.java:62) at sun.reflect.DelegatingMethodAccessorImpl.invoke(DelegatingMethodAccessorImpl.java:43) at java.lang.reflect.Method.invoke(Method.java:498) at hudson.init.TaskMethodFinder.invoke(TaskMethodFinder.java:104) at hudson.init.TaskMethodFinder$TaskImpl.run(TaskMethodFinder.java:175) at org.jvnet.hudson.reactor.Reactor.runTask(Reactor.java:296) at jenkins.model.Jenkins$5.runTask(Jenkins.java:1142) at org.jvnet.hudson.reactor.Reactor$2.run(Reactor.java:214) at org.jvnet.hudson.reactor.Reactor$Node.run(Reactor.java:117) at java.util.concurrent.ThreadPoolExecutor.runWorker(ThreadPoolExecutor.java:1149) at java.util.concurrent.ThreadPoolExecutor$Worker.run(ThreadPoolExecutor.java:624) at java.lang.Thread.run(Thread.java:748) Jan 08, 2020 3:21:05 AM WARNING hudson.ExtensionFinder$GuiceFinder instantiate Failed to load hudson.plugins.s3.S3BucketPublisher java.lang.NoClassDefFoundError: Could not initialize class hudson.plugins.s3.Entry at hudson.plugins.s3.S3BucketPublisher$DescriptorImpl.<init>(S3BucketPublisher.java:404) at hudson.plugins.s3.S3BucketPublisher$DescriptorImpl.<init>(S3BucketPublisher.java:409) at hudson.plugins.s3.S3BucketPublisher.<clinit>(S3BucketPublisher.java:41) at sun.misc.Unsafe.ensureClassInitialized(Native Method) at sun.reflect.UnsafeFieldAccessorFactory.newFieldAccessor(UnsafeFieldAccessorFactory.java:43) at sun.reflect.ReflectionFactory.newFieldAccessor(ReflectionFactory.java:156) at java.lang.reflect.Field.acquireFieldAccessor(Field.java:1088) at java.lang.reflect.Field.getFieldAccessor(Field.java:1069) at java.lang.reflect.Field.get(Field.java:393) at net.java.sezpoz.IndexItem.instance(IndexItem.java:185) Caused: java.lang.InstantiationException at net.java.sezpoz.IndexItem.instance(IndexItem.java:193) at hudson.ExtensionFinder$GuiceFinder.instantiate(ExtensionFinder.java:369) at hudson.ExtensionFinder$GuiceFinder.access$700(ExtensionFinder.java:240) at hudson.ExtensionFinder$GuiceFinder$SezpozModule$1.get(ExtensionFinder.java:557) at com.google.inject.internal.ProviderInternalFactory.provision(ProviderInternalFactory.java:81) at com.google.inject.internal.InternalFactoryToInitializableAdapter.provision(InternalFactoryToInitializableAdapter.java:53) at com.google.inject.internal.ProviderInternalFactory$1.call(ProviderInternalFactory.java:65) at com.google.inject.internal.ProvisionListenerStackCallback$Provision.provision(ProvisionListenerStackCallback.java:115) at hudson.ExtensionFinder$GuiceFinder$SezpozModule.onProvision(ExtensionFinder.java:577) at com.google.inject.internal.ProvisionListenerStackCallback$Provision.provision(ProvisionListenerStackCallback.java:126) at com.google.inject.internal.ProvisionListenerStackCallback.provision(ProvisionListenerStackCallback.java:68) at com.google.inject.internal.ProviderInternalFactory.circularGet(ProviderInternalFactory.java:63) at com.google.inject.internal.InternalFactoryToInitializableAdapter.get(InternalFactoryToInitializableAdapter.java:45) at com.google.inject.internal.ProviderToInternalFactoryAdapter$1.call(ProviderToInternalFactoryAdapter.java:46) at com.google.inject.internal.InjectorImpl.callInContext(InjectorImpl.java:1103) at com.google.inject.internal.ProviderToInternalFactoryAdapter.get(ProviderToInternalFactoryAdapter.java:40) at com.google.inject.internal.SingletonScope$1.get(SingletonScope.java:145) at hudson.ExtensionFinder$GuiceFinder$FaultTolerantScope$1.get(ExtensionFinder.java:440) at com.google.inject.internal.InternalFactoryToProviderAdapter.get(InternalFactoryToProviderAdapter.java:41) at com.google.inject.internal.InjectorImpl$2$1.call(InjectorImpl.java:1016) at com.google.inject.internal.InjectorImpl.callInContext(InjectorImpl.java:1092) at com.google.inject.internal.InjectorImpl$2.get(InjectorImpl.java:1012) at hudson.ExtensionFinder$GuiceFinder._find(ExtensionFinder.java:402) at hudson.ExtensionFinder$GuiceFinder.find(ExtensionFinder.java:393) at hudson.ClassicPluginStrategy.findComponents(ClassicPluginStrategy.java:344) at hudson.ExtensionList.load(ExtensionList.java:381) at hudson.ExtensionList.ensureLoaded(ExtensionList.java:317) at hudson.ExtensionList.iterator(ExtensionList.java:172) at jenkins.model.Jenkins.getDescriptorByType(Jenkins.java:1599) at hudson.plugins.git.GitSCM.onLoaded(GitSCM.java:1870) at sun.reflect.NativeMethodAccessorImpl.invoke0(Native Method) at sun.reflect.NativeMethodAccessorImpl.invoke(NativeMethodAccessorImpl.java:62) at sun.reflect.DelegatingMethodAccessorImpl.invoke(DelegatingMethodAccessorImpl.java:43) at java.lang.reflect.Method.invoke(Method.java:498) at hudson.init.TaskMethodFinder.invoke(TaskMethodFinder.java:104) at hudson.init.TaskMethodFinder$TaskImpl.run(TaskMethodFinder.java:175) at org.jvnet.hudson.reactor.Reactor.runTask(Reactor.java:296) at jenkins.model.Jenkins$5.runTask(Jenkins.java:1142) at org.jvnet.hudson.reactor.Reactor$2.run(Reactor.java:214) at org.jvnet.hudson.reactor.Reactor$Node.run(Reactor.java:117) at java.util.concurrent.ThreadPoolExecutor.runWorker(ThreadPoolExecutor.java:1149) at java.util.concurrent.ThreadPoolExecutor$Worker.run(ThreadPoolExecutor.java:624) at java.lang.Thread.run(Thread.java:748) ``` 我不知道这是为什么,谁能帮帮我。
Jenkins打包项目报错,JDK1.8
``` [INFO] BUILD FAILURE [INFO] ------------------------------------------------------------------------ [INFO] Total time: 6.400 s [INFO] Finished at: 2019-12-31T17:08:37+08:00 [INFO] Final Memory: 32M/117M [INFO] ------------------------------------------------------------------------ [ERROR] Failed to execute goal org.apache.maven.plugins:maven-compiler-plugin:3.8.1:compile (default-compile) on project cmdbunion_eureka: Execution default-compile of goal org.apache.maven.plugins:maven-compiler-plugin:3.8.1:compile failed: A required class was missing while executing org.apache.maven.plugins:maven-compiler-plugin:3.8.1:compile: org/codehaus/plexus/compiler/util/scan/InclusionScanException [ERROR] ----------------------------------------------------- [ERROR] realm = plugin>org.apache.maven.plugins:maven-compiler-plugin:3.8.1 [ERROR] strategy = org.codehaus.plexus.classworlds.strategy.SelfFirstStrategy [ERROR] urls[0] = file:/DATA/repo/repository/org/apache/maven/plugins/maven-compiler-plugin/3.8.1/maven-compiler-plugin-3.8.1.jar [ERROR] urls[1] = file:/DATA/repo/repository/org/codehaus/plexus/plexus-utils/1.1/plexus-utils-1.1.jar [JENKINS] Archiving /DATA/var/lib/jenkins/workspace/cmdbunion_parent/cmdbunion_eureka/pom.xml to com.travelsky/cmdbunion_eureka/0.0.1-SNAPSHOT/cmdbunion_eureka-0.0.1-SNAPSHOT.pom [ERROR] Number of foreign imports: 1 [ERROR] import: Entry[import from realm ClassRealm[maven.api, parent: null]] [ERROR] [ERROR] -----------------------------------------------------: org.codehaus.plexus.compiler.util.scan.InclusionScanException [ERROR] -> [Help 1] [ERROR] [ERROR] To see the full stack trace of the errors, re-run Maven with the -e switch. [ERROR] Re-run Maven using the -X switch to enable full debug logging. [JENKINS] Archiving /DATA/var/lib/jenkins/workspace/cmdbunion_parent/cmdbunion_titsm/pom.xml to com.travelsky/cmdbunion_titsm/0.0.1-SNAPSHOT/cmdbunion_titsm-0.0.1-SNAPSHOT.pom [ERROR] [ERROR] For more information about the errors and possible solutions, please read the following articles: [ERROR] [Help 1] http://cwiki.apache.org/confluence/display/MAVEN/PluginContainerException [ERROR] [ERROR] After correcting the problems, you can resume the build with the command [ERROR] mvn <goals> -rf :cmdbunion_eureka ``` ![图片说明](https://img-ask.csdn.net/upload/201912/31/1577783774_342114.png) ![图片说明](https://img-ask.csdn.net/upload/201912/31/1577783814_821416.png)
jenkins 项目构建成功, 但是构建后操作deploy没有执行信息
![图片说明](https://img-ask.csdn.net/upload/201904/03/1554260315_308663.png) 这是构建信息,提示success , 但是正常应该后面会有deploy信息, 但是没有. ..![图片说明](https://img-ask.csdn.net/upload/201904/03/1554260351_133100.png) 这是jenkins构建后操作配置信息
jenkins拉取svn代码安装ant插件部署到tomcat,总是打war成功但推不倒tomcat目录上
jenkins拉取svn代码安装ant插件部署到tomcat,总是打war成功但推不倒tomcat目录上? 图1: ![图片说明](https://img-ask.csdn.net/upload/201907/18/1563446639_510526.png) 图2: ![图片说明](https://img-ask.csdn.net/upload/201907/18/1563446675_64666.png)
Centos7搭建jenkins的问题
Centos7搭建jenkins时出现:java.io.IOException: /home/linux/apache-tomcat-8.5.34/webapps/jenkins.war exists and is neither a directory nor a symlink to a directory ![图片说明](https://img-ask.csdn.net/upload/201809/20/1537433119_820144.png) 参照一篇博客进行Jenkins的搭建,装好JDK、Maven、设置好Tomcat后, 将jenkins.war,放入Tomcat的webapps下,然后启动jenkins,发现有一个离线安装插件什么的,按照博客的方法先选择了略过 ![图片说明](https://img-ask.csdn.net/upload/201809/20/1537433645_840304.png) ,然后管理插件时发现没办法装,然后就搁置了下午再打开jenkins的时候就发现了上面的错误,百度了一圈还是懵闭的,求大佬们指点一下
jenkins具体插件怎么安装
jenkins 稳定版本,支持jdk1.7 的是是那个。好多版本,与插件版本不匹配。插件安装不了。很恼火
jenkins中如何安装maven插件
jenkins中如何安装maven插件,请问应该选择哪个插件安装呢,我装的是最新版的jenkins
jenkins 打war包默认工作空间 可以打包到服务器里或者指定位置吗
jenkins 打war包默认工作空间 可以打包到服务器里或者指定位置吗
相见恨晚的超实用网站
搞学习 知乎:www.zhihu.com 简答题:http://www.jiandati.com/ 网易公开课:https://open.163.com/ted/ 网易云课堂:https://study.163.com/ 中国大学MOOC:www.icourse163.org 网易云课堂:study.163.com 哔哩哔哩弹幕网:www.bilibili.com 我要自学网:www.51zxw
爬虫福利二 之 妹子图网MM批量下载
爬虫福利一:27报网MM批量下载    点击 看了本文,相信大家对爬虫一定会产生强烈的兴趣,激励自己去学习爬虫,在这里提前祝:大家学有所成! 目标网站:妹子图网 环境:Python3.x 相关第三方模块:requests、beautifulsoup4 Re:各位在测试时只需要将代码里的变量 path 指定为你当前系统要保存的路径,使用 python xxx.py 或IDE运行即可。
字节跳动视频编解码面经
引言 本文主要是记录一下面试字节跳动的经历。 三四月份投了字节跳动的实习(图形图像岗位),然后hr打电话过来问了一下会不会opengl,c++,shador,当时只会一点c++,其他两个都不会,也就直接被拒了。 七月初内推了字节跳动的提前批,因为内推没有具体的岗位,hr又打电话问要不要考虑一下图形图像岗,我说实习投过这个岗位不合适,不会opengl和shador,然后hr就说秋招更看重基础。我当时
开源一个功能完整的SpringBoot项目框架
福利来了,给大家带来一个福利。 最近想了解一下有关Spring Boot的开源项目,看了很多开源的框架,大多是一些demo或者是一个未成形的项目,基本功能都不完整,尤其是用户权限和菜单方面几乎没有完整的。 想到我之前做的框架,里面通用模块有:用户模块,权限模块,菜单模块,功能模块也齐全了,每一个功能都是完整的。 打算把这个框架分享出来,供大家使用和学习。 为什么用框架? 框架可以学习整体
小白如何学习java?
在博主认为,对于入门级学习java的最佳学习方法莫过于视频+博客+书籍+总结,前三者博主将淋漓尽致地挥毫于这篇博客文章中,至于总结在于个人,实际上越到后面你会发现学习的最好方式就是阅读参考官方文档其次就是国内的书籍,博客次之,这又是一个层次了,这里暂时不提后面再谈。博主将为各位入门java保驾护航,各位只管冲鸭!!!上天是公平的,只要不辜负时间,时间自然不会辜负你。 何谓学习?博主所理解的学习,它
程序员必须掌握的核心算法有哪些?
由于我之前一直强调数据结构以及算法学习的重要性,所以就有一些读者经常问我,数据结构与算法应该要学习到哪个程度呢?,说实话,这个问题我不知道要怎么回答你,主要取决于你想学习到哪些程度,不过针对这个问题,我稍微总结一下我学过的算法知识点,以及我觉得值得学习的算法。这些算法与数据结构的学习大多数是零散的,并没有一本把他们全部覆盖的书籍。下面是我觉得值得学习的一些算法以及数据结构,当然,我也会整理一些看过
比特币原理详解
一、什么是比特币 比特币是一种电子货币,是一种基于密码学的货币,在2008年11月1日由中本聪发表比特币白皮书,文中提出了一种去中心化的电子记账系统,我们平时的电子现金是银行来记账,因为银行的背后是国家信用。去中心化电子记账系统是参与者共同记账。比特币可以防止主权危机、信用风险。其好处不多做赘述,这一层面介绍的文章很多,本文主要从更深层的技术原理角度进行介绍。 二、问题引入  假设现有4个人
【C++】C++11的std::array的详细剖析
当学习C++的时候,数组是最基本的结构之一,通常通过以下的方式来定义: int a[5]; int *b = new int[5]; 上面一句是在栈上定义了一个长度为5的数组,下面一句是在堆上定义了一个长度为5的数组,并用一个指针指向它。 在C++11中,引入了一种新的数组定义方式std::array。 std::array的特性 std::array是具有固定大小的数组。因此,它并不支持添加...
Python 基础(一):入门必备知识
目录1 标识符2 关键字3 引号4 编码5 输入输出6 缩进7 多行8 注释9 数据类型10 运算符10.1 常用运算符10.2 运算符优先级 1 标识符 标识符是编程时使用的名字,用于给变量、函数、语句块等命名,Python 中标识符由字母、数字、下划线组成,不能以数字开头,区分大小写。 以下划线开头的标识符有特殊含义,单下划线开头的标识符,如:_xxx ,表示不能直接访问的类属性,需通过类提供
程序员接私活怎样防止做完了不给钱?
首先跟大家说明一点,我们做 IT 类的外包开发,是非标品开发,所以很有可能在开发过程中会有这样那样的需求修改,而这种需求修改很容易造成扯皮,进而影响到费用支付,甚至出现做完了项目收不到钱的情况。 那么,怎么保证自己的薪酬安全呢? 我们在开工前,一定要做好一些证据方面的准备(也就是“讨薪”的理论依据),这其中最重要的就是需求文档和验收标准。一定要让需求方提供这两个文档资料作为开发的基础。之后开发
Python十大装B语法
Python 是一种代表简单思想的语言,其语法相对简单,很容易上手。不过,如果就此小视 Python 语法的精妙和深邃,那就大错特错了。本文精心筛选了最能展现 Python 语法之精妙的十个知识点,并附上详细的实例代码。如能在实战中融会贯通、灵活使用,必将使代码更为精炼、高效,同时也会极大提升代码B格,使之看上去更老练,读起来更优雅。 1. for - else 什么?不是 if 和 else 才
数据库优化 - SQL优化
前面一篇文章从实例的角度进行数据库优化,通过配置一些参数让数据库性能达到最优。但是一些“不好”的SQL也会导致数据库查询变慢,影响业务流程。本文从SQL角度进行数据库优化,提升SQL运行效率。 判断问题SQL 判断SQL是否有问题时可以通过两个表象进行判断: 系统级别表象 CPU消耗严重 IO等待严重 页面响应时间过长
2019年11月中国编程语言排行榜
2019年11月2日,我统计了某招聘网站,获得有效程序员招聘数据9万条。针对招聘信息,提取编程语言关键字,并统计如下: 编程语言比例 rank pl_ percentage 1 java 33.62% 2 c/c++ 16.42% 3 c_sharp 12.82% 4 javascript 12.31% 5 python 7.93% 6 go 7.25% 7
写了很久,这是一份最适合/贴切普通大众/科班/非科班的『学习路线』
说实话,对于学习路线这种文章我一般是不写的,大家看我的文章也知道,我是很少写建议别人怎么样怎么样的文章,更多的是,写自己的真实经历,然后供大家去参考,这样子,我内心也比较踏实,也不怕误导他人。 但是,最近好多人问我学习路线,而且很多大一大二的,说自己很迷茫,看到我那篇 普普通通,我的三年大学 之后很受激励,觉得自己也能行,(是的,别太浪,你一定能行)希望我能给他个学习路线,说
腾讯算法面试题:64匹马8个跑道需要多少轮才能选出最快的四匹?
昨天,有网友私信我,说去阿里面试,彻底的被打击到了。问了为什么网上大量使用ThreadLocal的源码都会加上private static?他被难住了,因为他从来都没有考虑过这个问题。无独有偶,今天笔者又发现有网友吐槽了一道腾讯的面试题,我们一起来看看。 腾讯算法面试题:64匹马8个跑道需要多少轮才能选出最快的四匹? 在互联网职场论坛,一名程序员发帖求助到。二面腾讯,其中一个算法题:64匹
面试官:你连RESTful都不知道我怎么敢要你?
面试官:了解RESTful吗? 我:听说过。 面试官:那什么是RESTful? 我:就是用起来很规范,挺好的 面试官:是RESTful挺好的,还是自我感觉挺好的 我:都挺好的。 面试官:… 把门关上。 我:… 要干嘛?先关上再说。 面试官:我说出去把门关上。 我:what ?,夺门而去 文章目录01 前言02 RESTful的来源03 RESTful6大原则1. C-S架构2. 无状态3.统一的接
为啥国人偏爱Mybatis,而老外喜欢Hibernate/JPA呢?
关于SQL和ORM的争论,永远都不会终止,我也一直在思考这个问题。昨天又跟群里的小伙伴进行了一番讨论,感触还是有一些,于是就有了今天这篇文。 声明:本文不会下关于Mybatis和JPA两个持久层框架哪个更好这样的结论。只是摆事实,讲道理,所以,请各位看官勿喷。 一、事件起因 关于Mybatis和JPA孰优孰劣的问题,争论已经很多年了。一直也没有结论,毕竟每个人的喜好和习惯是大不相同的。我也看
SQL-小白最佳入门sql查询一
一 说明 如果是初学者,建议去网上寻找安装Mysql的文章安装,以及使用navicat连接数据库,以后的示例基本是使用mysql数据库管理系统; 二 准备前提 需要建立一张学生表,列分别是id,名称,年龄,学生信息;本示例中文章篇幅原因SQL注释略; 建表语句: CREATE TABLE `student` ( `id` int(11) NOT NULL AUTO_INCREMENT, `
项目中的if else太多了,该怎么重构?
介绍 最近跟着公司的大佬开发了一款IM系统,类似QQ和微信哈,就是聊天软件。我们有一部分业务逻辑是这样的 if (msgType = "文本") { // dosomething } else if(msgType = "图片") { // doshomething } else if(msgType = "视频") { // doshomething } else { // dosho
致 Python 初学者
文章目录1. 前言2. 明确学习目标,不急于求成,不好高骛远3. 在开始学习 Python 之前,你需要做一些准备2.1 Python 的各种发行版2.2 安装 Python2.3 选择一款趁手的开发工具3. 习惯使用IDLE,这是学习python最好的方式4. 严格遵从编码规范5. 代码的运行、调试5. 模块管理5.1 同时安装了py2/py35.2 使用Anaconda,或者通过IDE来安装模
“狗屁不通文章生成器”登顶GitHub热榜,分分钟写出万字形式主义大作
一、垃圾文字生成器介绍 最近在浏览GitHub的时候,发现了这样一个骨骼清奇的雷人项目,而且热度还特别高。 项目中文名:狗屁不通文章生成器 项目英文名:BullshitGenerator 根据作者的介绍,他是偶尔需要一些中文文字用于GUI开发时测试文本渲染,因此开发了这个废话生成器。但由于生成的废话实在是太过富于哲理,所以最近已经被小伙伴们给玩坏了。 他的文风可能是这样的: 你发现,
程序员:我终于知道post和get的区别
IT界知名的程序员曾说:对于那些月薪三万以下,自称IT工程师的码农们,其实我们从来没有把他们归为我们IT工程师的队伍。他们虽然总是以IT工程师自居,但只是他们一厢情愿罢了。 此话一出,不知激起了多少(码农)程序员的愤怒,却又无可奈何,于是码农问程序员。 码农:你知道get和post请求到底有什么区别? 程序员:你看这篇就知道了。 码农:你月薪三万了? 程序员:嗯。 码农:你是怎么做到的? 程序员:
羞,Java 字符串拼接竟然有这么多姿势
二哥,我今年大二,看你分享的《阿里巴巴 Java 开发手册》上有一段内容说:“循环体内,拼接字符串最好使用 StringBuilder 的 append 方法,而不是 + 号操作符。”到底为什么啊,我平常一直就用的‘+’号操作符啊!二哥有空的时候能否写一篇文章分析一下呢? 就在昨天,一位叫小菜的读者微信我说了上面这段话。 我当时看到这条微信的第一感觉是:小菜你也太菜了吧,这都不知道为啥啊!我估
"狗屁不通文章生成器"登顶GitHub热榜,分分钟写出万字形式主义大作
GitHub 被誉为全球最大的同性交友网站,……,陪伴我们已经走过 10+ 年时间,它托管了大量的软件代码,同时也承载了程序员无尽的欢乐。 万字申请,废话报告,魔幻形式主义大作怎么写?兄dei,狗屁不通文章生成器了解一下。这个富有灵魂的项目名吸引了众人的目光。项目仅仅诞生一周,便冲上了GitHub趋势榜榜首(Js中文网 -前端进阶资源教程)、是榜首哦
推荐几款比较实用的工具,网站
1.盘百度PanDownload   这个云盘工具是免费的,可以进行资源搜索,提速(偶尔会抽风......) 不要去某站买付费的......   PanDownload下载地址   2.BeJSON 这是一款拥有各种在线工具的网站,推荐它的主要原因是网站简洁,功能齐全,广告相比其他广告好太多了     bejson网站   3.二维码美化 这个网站的二维码美化很好看,网站界面
《程序人生》系列-这个程序员只用了20行代码就拿了冠军
你知道的越多,你不知道的越多 点赞再看,养成习惯GitHub上已经开源https://github.com/JavaFamily,有一线大厂面试点脑图,欢迎Star和完善 前言 这一期不算《吊打面试官》系列的,所有没前言我直接开始。 絮叨 本来应该是没有这期的,看过我上期的小伙伴应该是知道的嘛,双十一比较忙嘛,要值班又要去帮忙拍摄年会的视频素材,还得搞个程序员一天的Vlog,还要写BU
程序员把地府后台管理系统做出来了,还有3.0版本!12月7号最新消息:已在开发中有github地址
第一幕:缘起 听说阎王爷要做个生死簿后台管理系统,我们派去了一个程序员…… 996程序员做的梦: 第一场:团队招募 为了应对地府管理危机,阎王打算找“人”开发一套地府后台管理系统,于是就在地府总经办群中发了项目需求。 话说还是中国电信的信号好,地府都是满格,哈哈!!! 经常会有外行朋友问:看某网站做的不错,功能也简单,你帮忙做一下? 而这次,面对这样的需求,这个程序员
网易云6亿用户音乐推荐算法
网易云音乐是音乐爱好者的集聚地,云音乐推荐系统致力于通过 AI 算法的落地,实现用户千人千面的个性化推荐,为用户带来不一样的听歌体验。 本次分享重点介绍 AI 算法在音乐推荐中的应用实践,以及在算法落地过程中遇到的挑战和解决方案。 将从如下两个部分展开: AI 算法在音乐推荐中的应用 音乐场景下的 AI 思考 从 2013 年 4 月正式上线至今,网易云音乐平台持续提供着:乐屏社区、UGC
8年经验面试官详解 Java 面试秘诀
    作者 | 胡书敏 责编 | 刘静 出品 | CSDN(ID:CSDNnews) 本人目前在一家知名外企担任架构师,而且最近八年来,在多家外企和互联网公司担任Java技术面试官,前后累计面试了有两三百位候选人。在本文里,就将结合本人的面试经验,针对Java初学者、Java初级开发和Java开发,给出若干准备简历和准备面试的建议。   Java程序员准备和投递简历的实
面试官如何考察你的思维方式?
1.两种思维方式在求职面试中,经常会考察这种问题:北京有多少量特斯拉汽车? 某胡同口的煎饼摊一年能卖出多少个煎饼? 深圳有多少个产品经理? 一辆公交车里能装下多少个乒乓球? 一
相关热词 c#处理浮点数 c# 生成字母数字随机数 c# 动态曲线 控件 c# oracle 开发 c#选择字体大小的控件 c# usb 批量传输 c#10进制转8进制 c#转base64 c# 科学计算 c#下拉列表获取串口
立即提问