在windows环境下安装python3.5.6遇到了的问题 5C

图片说明
不知道为什么会出现这个情况,

7个回答

1.右击以管理员身份运行安装
2.确定是64位没问题
3.重新下载python安装包

xingjianfengaa
xingjianfengaa 回复baidu_40582876:可能是你系统有问题缺少什么dll或者是更新时出现了什么错误,要么更新系统要么就安装个虚拟机来使用python
大约一年之前 回复
baidu_40582876
学习中的青年 老哥,这是64位,我确认过,我试过了3.5.2,3.5.4,3.5.6三个版本,以管理员运行也试过了,还是不行呀
大约一年之前 回复

用的是啥系统,如果是win10记得更新一下系统,然后安装试试

看看 log file 怎么提示先吧

错误代码:0x80070005”,即使重新安 装也无法安装的情况。出现这种情况一般是许可证未同步更新、SoftwareDistribution文件夹出现故障或者网络防火墙问题,建议下载Windows x86 executable installer版本安装,或者消除网络防火墙的影响设置:
按Win+X组合键,在快捷菜单中点击选择“计算机管理”,然后依次点击“服务和应用程序→服务”,查看Windows Firewall是否开启,之后通过控制面板打开Windows防火墙,关闭安装的第三方杀毒软件和反间谍软件。再到应商店中测试是否可以安装应用。

windows下安装python时,最好不要将其安装到系统盘的Program Files或Program Files (x86) 目录。
因为python安装路径存在空格可能会有问题,并且上面两个目录有写入权限问题。
解决办法:
1. 卸载已安装的有问题的python。
2. 再次安装时将python安装到其他盘不带空格的目录下(最好是安装软件默认的目录,因为如果修改了目录,还有一部分也会安装到默认目录下)。

你好,请问是否做到了三个对应:
下载的Python位数要和操作系统位数对应

下载的whl要和python版本对应

运行的pip要和python版本对应

我用心回答,如果满意,恳请采纳,谢谢!

换成3.5以下的版本

Csdn user default icon
上传中...
上传图片
插入图片
抄袭、复制答案,以达到刷声望分或其他目的的行为,在CSDN问答是严格禁止的,一经发现立刻封号。是时候展现真正的技术了!
其他相关推荐
在WIN2000PRO环境下安装SQL SERVER2000企业版遇到了问题。。。
在WIN2000PRO环境下安装SQL SERVER2000企业版遇到了如下的系统提示:rnMicrosoft SQL Server 2000 Enterprise Edition服务器组件在此操作系统上不受支持。只有客户端组件才可用于安装。rnrn请问在win2000 pro环境下是否能安装SQL Server2000企业版,以上的问题该如何解决呢?
安装eclipse3.1遇到了麻烦
下载了eclipse3.1,解压后双击eclipse.exe之后出现了对话框:[img=D:\01.bmp][/img]rn点击确定之后,又出现:[img=D:\02.bmp][/img]rnrn请教大家!
在opensuse11.4安装ase1502_linx86_32.tgz的遇到了问题
虚拟机:VMware 6.5.2 build0156735rnlinux系统:openSUSE 11.4 "Celadon" - Kernel 2.6.37.1-1.2-desktoprn其安装文件:openSUSE-11.4-DVD-i586.isornASE安装文件:ase1502_linx86_32.tgzrnrn安装ASE到最后一步,报错如下:rnerror while loading shared libraries: libstdc++.so.5: cannot open shared object file: No such file or directoryrnrn然后自己解决了上面的错误,解决如下:rn在/usr/lib目录下,执行以下命令:rnln -s /usr/lib/libstdc++.so.6.0.3 /usr/lib/libstdc++.so.5 rn试了不行rn然后下载:http://mirror.centos.org/centos/4/os/i386/CentOS/RPMS/compat-libstdc++-33-3.2.3-47.3.i386.rpmrn再执行命令:rpm -ivh compat-libstdc++-33-3.2.3-47.3.i386rn又报了另外的错误,最终还是没有安装sybase服务器,如下rnsh: line 1: 7444 Segmenation faul /home/sybase......rn...rnusing licenses from :/home/sybase/SYSAM-2_0/licensesrnChecked out license for ASE_CORErnThis product is licenses to : ASE Developer Edition - For Developmet and Test use only rnChecked out license ASE_CORErnrnrn麻烦各位分析是什么原因?rn
安装VS2005时遇到了问题
出现这样一段话:rn 错误1325.BootStrapper不是一个有效的短文件名rnrn这是什么原因啊?
C++primer遇到了问题
C++primer 第六章 6.14 使用预处理器进行调试rn这里有点不明白是什么意思,里面有一段程序时这样的 习题6.25rn#include rn#include rnrnusing namespace std;rnrnint main()rnrn cout << "Enter some strings:" << endl;rn string prestr,currenstr;rn while( cin >> currenstr)rn rn #ifndef NDEBUGrn cout << currenstr << " ";rn #endifrn if(currenstr == prestr && isupper( currenstr[0] ) )rn break;rn elsern prestr = currenstr;rn rn //输出结果rn if( currenstr == prestr && ! currenstr.empty() )rn cout << "\nThe repeated string: " << currenstr << endl;rn elsern cout << "There is no repeated string! " << endl;rnrn return 0;rnrn其中说到分别在打开和关闭调试器的情况下编译和运行该程序rn这里的打开和关闭调试器是什么意思呢?是怎样打开和关闭?我使用的是Visual Studio 2010rn我先是“启动调试 按F5”,然后用另一种方式“开始执行(不调试) 按Ctrl+F5”,这样的两种方式是不是就是所谓的打开和关闭调试器编译运行程序?可是这两种方式得到的结果是一样的,这是为什么?请各位给点指导吧!
遇到了这个问题
IMP-00017: 由于 ORACLE 错误 922, 以下语句失败:rn "CREATE TABLE "CADASTRAL_QSJZX" ("OBJECTID" NUMBER(*,0) NOT NULL ENABLE, "ID"rn "" NUMBER(*,0), "MPLENGTH" NUMBER(38, 8), "标识码" NUMBER(*,0), "要素代码" N"rn "VARCHAR2(10), "界址线长度" NUMBER(38, 8), "界址线类别" NVARCHAR2(2), "界址线"rn "性质" NVARCHAR2(6), "界址线位置" NVARCHAR2(1), "权属界线协" NVARCHAR2(30), "rn ""权属争议原" NVARCHAR2(30), "变更记录号" NVARCHAR2(100), "邻宗左宗地" NVARC"rn "HAR2(19), "邻宗右宗地" NVARCHAR2(19), "界址线描述" NVARCHAR2(255), "项目号""rn " NVARCHAR2(20), "FROM_STATE" NUMBER(*,0), "TO_STATEID" NUMBER(*,0), "SHAPE""rn " "SDE"."ST_GEOMETRY") PCTFREE 0 PCTUSED 40 INITRANS 4 MAXTRANS 255 STORAGE"rn "(INITIAL 28311552 FREELISTS 1 FREELIST GROUPS 1 BUFFER_POOL DEFAULT) TABLES"rn "PACE "YQDJSDEBZ" LOGGING NOCOMPRESS LOB ("SHAPE"."POINTS") STORE AS (TABLE"rn "SPACE "YQDJSDEBZ" ENABLE STORAGE IN ROW CHUNK 8192 PCTVERSION 10 CACHE STO"rn "RAGE(INITIAL 65536 FREELISTS 1 FREELIST GROUPS 1 BUFFER_POOL DEFAULT))"rn "INSERT INTO "CADASTRAL_QSJZX" ("OBJECTID", "ID", "MPLENGTH", "标识码", "要素"rn "代码", "界址线长度", "界址线类别", "界址线性质", "界址线位置", "权属界线协""rn ", "权属争议原", "变更记录号", "邻宗左宗地", "邻宗右宗地", "界址线描述", "项"rn "目号", "FROM_STATE", "TO_STATEID", "SHAPE") VALUES (:1, :2, :3, :4, :5, :6,"rn " :7, :8, :9, :10, :11, :12, :13, :14, :15, :16, :17, :18, :19)
关于.NET安装遇到了问题
村友们,我是位初学者,想请教些几个问题rn我买了一套.NET安装盘,我得系统安装得WINXP,IE6 SP1,rn我把安装盘放进去后,第一步安装就无法点击,我看了安装说明,安装了IIS等操作,但是还是点击不了安装,不知道是怎么回事了?rn请教大哥该如何安装啊?您有没有安装文档啊?
安装SQL server2005数据库遇到了问题????
最近做项目要用SQLserver2005自带的Reporting service,我在Microsoft的网站上下载了“具有高级服务的 Microsoft SQL Server 2005 Express Edition”,概述上说可以运行本地关系数据的 SQL Server Reporting Services 报表,同时我也安装了Microsoft SQL Server 2005 Express Edition 工具包,安装完成后,在配置工具里有Reporting Services 配置,我按照微软官方的说明文档配置了,配置也成功了。我的问题是在打开SQL Server Management Studio时,服务器类型列表中没有Reporting Services选项,文档上也有相应的说明,说“如果 Reporting Services 不在列表中,则没有安装 Reporting Services”,这就奇怪了,我在安装“具有高级服务的 Microsoft SQL Server 2005 Express Edition”时它显示安装了Reporting service,怎么在这里就出现问题了,希望大家来帮帮我???rn
在centos7安装docker遇到了无法启动的问题
cetnos 7下面安装docker 要求系统为64位、系统内核版本为 3.10 以上unmae -r 查看第一种方法: 一键安装yum -y install docker  (自己采用)第二种方法:采用网络命令行去抓取curl -fsSL https://get.docker.com/ | sh启动systemctl start docker.service  查看状态systemctl sta...
在XP下安装PHP遇到了问题
我按照在2000下的方法,安装module模式,加上rnLoadModule php4_module c:/php/sapi/php4apache2.dllrnAddType application/x-httpd-php .php后,把ini文件和dll文件放到相应的文件下,结果还是不能访问localhost,不知道为什么,是不是在XP下和2000下的安装不一样?
小菜遇到了问题
要学ASP.NET 这些是书上的列子 可按它的步骤弄好后 第一页还能登陆 可就不跳转了直接出现下面这些 我看不懂 请帮我看下 谢谢rn我的连接是http://localhost/MisAsset/Default.aspxrnrn“/MisAsset”应用程序中的服务器错误。rn--------------------------------------------------------------------------------rnrnExecuteReader 要求已打开且可用的连接。连接的当前状态为已关闭。rn说明: 执行当前 Web 请求期间,出现未处理的异常。请检查堆栈跟踪信息,以了解有关该错误以及代码中导致错误的出处的详细信息。rnrn异常详细信息: System.InvalidOperationException: ExecuteReader 要求已打开且可用的连接。连接的当前状态为已关闭。rnrn源错误:rnrn执行当前 Web 请求期间生成了未处理的异常。可以使用下面的异常堆栈跟踪信息确定有关异常原因和发生位置的信息。rnrn堆栈跟踪:rnrnrn[InvalidOperationException: ExecuteReader 要求已打开且可用的连接。连接的当前状态为已关闭。]rnSystem.Data.SqlClient.SqlConnection.GetOpenConnection(String method) +856980rnSystem.Data.SqlClient.SqlConnection.ValidateConnectionForExecute(String method, SqlCommand command) +9rnSystem.Data.SqlClient.SqlCommand.ValidateCommand(String method, Boolean async) +56rnSystem.Data.SqlClient.SqlCommand.RunExecuteReader(CommandBehavior cmdBehavior, RunBehavior runBehavior, Boolean returnStream, String method, DbAsyncResult result) +73rnSystem.Data.SqlClient.SqlCommand.RunExecuteReader(CommandBehavior cmdBehavior, RunBehavior runBehavior, Boolean returnStream, String method) +32rnSystem.Data.SqlClient.SqlCommand.ExecuteReader(CommandBehavior behavior, String method) +122rnSystem.Data.SqlClient.SqlCommand.ExecuteReader(CommandBehavior behavior) +62rnSQLHelper.SQLHelper.RunProc(String procName, SqlParameter[] prams, SqlDataReader& dataReader) +63rnMisAsset.Components.User.GetUserLogin(String sUserName, String sPassword) in D:\ASP.NETMIS\MisAsset\Components\User.cs:36rnrn[Exception: ExecuteReader 要求已打开且可用的连接。连接的当前状态为已关闭。]rnMisAsset.Components.User.GetUserLogin(String sUserName, String sPassword) in D:\ASP.NETMIS\MisAsset\Components\User.cs:42rnMisAsset.Default.LoginBtn_Click(Object sender, EventArgs e) in D:\ASP.NETMIS\MisAsset\Default.aspx.cs:72rnSystem.Web.UI.WebControls.Button.OnClick(EventArgs e) +105rnSystem.Web.UI.WebControls.Button.RaisePostBackEvent(String eventArgument) +107rnSystem.Web.UI.WebControls.Button.System.Web.UI.IPostBackEventHandler.RaisePostBackEvent(String eventArgument) +7rnSystem.Web.UI.Page.RaisePostBackEvent(IPostBackEventHandler sourceControl, String eventArgument) +11rnSystem.Web.UI.Page.RaisePostBackEvent(NameValueCollection postData) +33rnSystem.Web.UI.Page.ProcessRequestMain(Boolean includeStagesBeforeAsyncPoint, Boolean includeStagesAfterAsyncPoint) +5102rnrnrnrnrn--------------------------------------------------------------------------------rn版本信息: Microsoft .NET Framework 版本:2.0.50727.42; ASP.NET 版本:2.0.50727.210
在学时遇到了问题
我是struts的初学者,在学时遇到了问题,rn我做了个index.jsp页,在页中用了一下代码rnrnrnrn输出来是乱码,那位高手给帮忙解决,多谢rn另外我的页中有<%@ page contentType = "text/html;charset = gb2312" language = "java"%>和<% request.setCharacterEncoding("gb2312");%>
抓取网页遇到了问题!
刚开始用WebClient将指定网页下载下来,在本机运行正常,上传到服务器后正常运行了一段时间,但是后来在去访问的时候就怎么也运行不成功了返回错误:The operation has timed out ;为什么总是超时呢怎么处理呢?为什么前面运行是正常的呢,接着我又用HttpWebRequest想达到相同的目的但是怎么也抓取不完那个网页,只能取得一部分,这又应该如何解决呢?rn下面是用HttpWebRequest的方法:rn HttpWebRequest myHttpWebRequest = (HttpWebRequest)WebRequest.Create("http://www.caotingna.com/item/webclient__229080.aspx");rnrn HttpWebResponse myHttpWebResponse = (HttpWebResponse)myHttpWebRequest.GetResponse();rn Stream st = myHttpWebResponse.GetResponseStream();rnrn byte[] buf = new byte[myHttpWebResponse.ContentLength];rn int count = st.Read(buf, 0, buf.Length);rn Console.WriteLine(Encoding.UTF8.GetString(buf, 0, count));
模拟按键遇到了问题。
我用delphi已成功向WinKawaks游戏模拟器发送模拟按键,但遇到这样一个问题:比如当按住了键盘A键时,这时我发送一个连招的模拟按键,但模拟器会一直响应我按住的A键,导致我的连招没效果,但当没有操作键盘的时候,这里发送模拟按键能100%成功。我也试过先模拟发送A键的抬起,但是抬起后还是继续响应按住的A键。请问有什么方法可以实现先交出键盘的控制权,等我的模拟按键结束后再响应回实际的键盘按键?最好可以给出代码哈,本人较菜。
初学Android遇到了问题
刚刚看了《第一行代码》照着上面打了一遍,报了错误,我仔细看了代码发现有个文件夹名打错了,就是drawable-xhdpi打成了drawable__xhdpi,这个时候这里报错n(这里出了错误)n我想问文件夹名的短横 - 有什么用?n还有既然图片放在drawable-xhdpi里,为什么@drawable而不是@drawable-xhdpi?
遇到了删除图片的问题
一张数据库表有2个字段内有编辑器上传的图片,现在实现的代码只能删除一个字段("nr")内的图片...而("pic")字段内的图片如何同时删除?rnrn请高手指导!rnrn代码如下:rn<%rnFunction RegExp_Execute(patrn,strng)rnDim regEx,Match,Matches,values'建立变量rnSet regEx=New RegExp'建立正则表达式rnregEx.Pattern=patrn'设置模式rnregEx.IgnoreCase=true'设置是否区分字符大小写rnregEx.Global=True'设置全局可用性rnSet Matches=regEx.Execute(strng)'执行搜索rnFor Each Match in Matches'遍历匹配集合rnvalues=values&Match.Value&","rnNextrnRegExp_Execute=valuesrnEnd Functionrn%>rn<%rndim srcrncontent=(Recordset1.Fields.Item("nr").Value)rnregstr="src\=.+?\.(gif|jpg)"rnurl=Replace(Replace(Replace(RegExp_Execute(regstr,content),"'",""),"""",""),"src=","")rnsrc=split(url,",")rnif url<>""thenrnfor i=0 to ubound(src)-1rn'删除文件rnset fso=Server.CreateObject("scripting.filesystemobject")rnfileName=src(i)rnmyFile=Server.MapPath(fileName)rnif fso.FileExists(myFile)thenrnfso.DeleteFile myFilernend ifrnset fso=Nothingrn%>rn<%nextrnelsern%>rn<%end if%>rnrn<%rnDim Command2__varNamernCommand2__varName = "defaultValue"rnIf (runtimeValue <> "") Then rn Command2__varName = runtimeValuernEnd Ifrn%>rn<%rnrnSet Command2 = Server.CreateObject ("ADODB.Command")rnCommand2.ActiveConnection = MM_Abocnon_STRINGrnCommand2.CommandText = "DELETE FROM Abo_ShangPinZLK WHERE spid =?"rnCommand2.Parameters.Append Command2.CreateParameter("id", 3, 1, -1, MM_IIF(Request("wzid"), Request("wzid"), Command2__id & ""))rnCommand2.CommandType = 1rnCommand2.CommandTimeout = 0rnCommand2.Prepared = truernCommand2.Execute()rn%>
excel sum 遇到了问题
例如: sum(A1,B2,C3)rn如果删除了C3 或者其中任意一个列。这个公式就错误 #VALUE!rnrn如何实现,如果删除了其中一列,继续统计A1,B1,把删除的那一列忽略掉或者认为value=0呢?rn达人们 感谢。
学生党遇到了问题
在sqlserver建立一个家长表,一个费用表,当家长表中的家长类型为双职工时,费用表中的住宿费为60,当为单职工时,住宿费为80,非职工住宿费为100,现在要建立一个触发器,当学生家长的类型改变时,自动改变费用表中的住宿费。我的触发器写好了也执行成功了,但是当我用语句改家长表的一个类型时,费用表中的住宿费不改变,然后自动有一个只有一列住宿费的表,表中出现了改变后的值。[img=https://img-bbs.csdn.net/upload/201806/13/1528903466_542802.jpg][/img]
读取文件遇到了一个问题
记事本写的文本文件是以什么编码存的?rn我从文件中读取一个ushort 值到变量C中,rn然后 textBox1.Text=((char)C).ToString();rn显示的是乱码。rn但是rnushort C;rnC=(ushort)'李';rntextBox1.Text=((char)C).ToString();rn显示为“李”;rnrn还有:在C#中怎么一次读一个结构读取文件。rn如一个结构体 struct a rn rn public int x;rn public char[10] s;rn rn怎么样一次把文件中的数据读到这个结构体中?
写个类,遇到了问题
写个类,遇到了问题rnpublic class WebPagern public static void ShowModalDialog(string url,object dialogarguments)rn rn string strScript="";rn if (! IsClientScriptBlockRegistered("clientScript"))rn strScript = " ";rn RegisterClientScriptBlock("clientScript", strScript);rn rnrn提示“IsClientScriptBlockRegistered”在类或命名空间不存在rn
我遇到了麻烦问题
如何捕捉鼠标的单击事件(左键和右键),在任何窗体上,在任何位置上
遇到了个奇怪问题
rnrn很多时候安装的PHP程序在后台管理设置后不能马上生效,最后重启APACHE才能生效,程序在本机测试没有问题,服务器上有这个情况,请问这是什么原因造成的呢?rnrn服务器配置:centos + lampp rn rn谢谢
初学,遇到了问题,求助
Build target 'Target 1'rnassembling my test3.asm...rnA51 MACRO ASSEMBLER V8.02 - SN: K1JMC-TVZJ4CrnCOPYRIGHT KEIL ELEKTRONIK GmbH 1987 - 2008rn*** ERROR: COMMAND-FILE '' NOT FOUNDrnTarget not createdrnrnrnkeil中这样显示,各位老师,我应该怎么弄?
jquery遇到了个问题
自定义了一个[color=#99CC00]验证码刷新函数[/color],如下:rn[code=JScript]rn //验证码刷新函数rn function captchaRefresh() rn rn alert( "captchaRefresh" );rn $( "#img-captcha" ).src = $( "#img-captcha" ).src +"?random="+ Math.random();rn captchaIsTrue = false;rn rn $( "#captcha" ).attr( "value", "" );rn $( "#info" ).html( "请输入验证码" );rn rn[/code]rnrn程序里在这两个地方调用了这段[color=#99CC00]验证码刷新函数[/color]:rn[color=#99CC00]此处的调用标记为①[/color]rn[code=JScript]rn //验证码刷新事件rn $( "#img-captcha" ).bind( "click", captchaRefresh );rn[/code]rn[color=#99CC00]此处的调用标记为②[/color]rn[code=JScript]rn //登陆验证-回调函数rn function loginCallback( xml ) rn rn var output = $( xml ).find( "root" ).find( "result" ).text();rnrn if( output == "登陆成功" )rn rn location.href = "DrawCaptcha";rn rn elsern rn $( "#info" ).html( output );rn captchaRefresh();rn rn rn[/code]rn-------------------------------------------------------------------------------------------------------rnrn①②都调用这段调用[color=#99CC00]验证码刷新函数[/color]rn都只弹出"captchaRefresh"的对话框,rn$( "#img-captcha" ).src = $( "#img-captcha" ).src +"?random="+ Math.random();rn这段图片刷新代码不起作用rnrn修改这段代码为:rnthis.src = this.src +"?random="+ Math.random();rn①处可以刷新,②处不能,因为②处调用的this没有给定。rnrn要怎么改才能让两处都能刷新呢?rn为什么rn$( "#img-captcha" ).src = $( "#img-captcha" ).src +"?random="+ Math.random();rn这样写不起作用呢?rn本人初学,有很多不懂的地方…
toFixed遇到了奇怪的问题
今天客户打电话来说网页上有个地方计算不四舍五入了……rnrn结果调试发现,4.25*13531.3=57508.025 ,.toFixed(2)结果竟然是57508.02rn4.25*13531.42=57508.535 结果又是57508.54rnrn……[img=https://forum.csdn.net/PointForum/ui/scripts/csdn/Plugin/003/monkey/25.gif][/img]rnrn这尼玛是玩我么……
MFC线程处理遇到了问题
rn 小弟是新手,对MFC也不是很熟悉,想请大家帮帮忙rn 最近遇到一个问题,关于线程调用的,debug的时候出现如下错误:rn Cxx0017:Error:symbol "this" not found rn rn 还会出现如下:rn Loaded 'ntdll.dll', no matching symbolic information found.rnLoaded 'C:\WINDOWS\system32\kernel32.dll', no matching symbolic information found.rnLoaded 'C:\WINDOWS\system32\setupapi.dll', no matching symbolic information found.rnLoaded 'C:\WINDOWS\system32\advapi32.dll', no matching symbolic information found.rnLoaded 'C:\WINDOWS\system32\rpcrt4.dll', no matching symbolic information found.rnLoaded 'C:\WINDOWS\system32\secur32.dll', no matching symbolic information found.rnLoaded 'C:\WINDOWS\system32\gdi32.dll', no matching symbolic information found.rnLoaded 'C:\WINDOWS\system32\user32.dll', no matching symbolic information found.rnLoaded 'C:\WINDOWS\system32\msvcrt.dll', no matching symbolic information found.rnLoaded symbols for 'C:\WINDOWS\system32\MFC42D.DLL'rnLoaded symbols for 'C:\WINDOWS\system32\MSVCRTD.DLL'rnLoaded symbols for 'C:\WINDOWS\system32\MFCO42D.DLL'rnLoaded 'C:\WINDOWS\system32\imm32.dll', no matching symbolic information found.rnLoaded 'C:\WINDOWS\system32\lpk.dll', no matching symbolic information found.rnLoaded 'C:\WINDOWS\system32\usp10.dll', no matching symbolic information found.rnLoaded 'C:\WINDOWS\system32\mfc42loc.dll', no matching symbolic information found.rnLoaded 'C:\WINDOWS\system32\comctl32.dll', no matching symbolic information found.rnLoaded 'C:\WINDOWS\system32\uxtheme.dll', no matching symbolic information found.rnLoaded 'C:\WINDOWS\system32\MSCTF.dll', no matching symbolic information found.rnLoaded 'C:\Program Files\Tencent\SSPlus\SPlus.dll', no matching symbolic information found.rnLoaded 'C:\WINDOWS\system32\ole32.dll', no matching symbolic information found.rnLoaded 'C:\WINDOWS\system32\oleaut32.dll', no matching symbolic information found.rnLoaded 'C:\WINDOWS\system32\shlwapi.dll', no matching symbolic information found.rnLoaded 'C:\WINDOWS\system32\ws2_32.dll', no matching symbolic information found.rnLoaded 'C:\WINDOWS\system32\ws2help.dll', no matching symbolic information found.rnLoaded 'C:\WINDOWS\system32\version.dll', no matching symbolic information found.rnLoaded 'C:\WINDOWS\system32\shell32.dll', no matching symbolic information found.rnLoaded 'C:\WINDOWS\WinSxS\x86_Microsoft.Windows.Common-Controls_6595b64144ccf1df_6.0.2600.5512_x-ww_35d4ce83\comctl32.dll', no matching symbolic information found.rnLoaded 'C:\WINDOWS\system32\MSCTFIME.IME', no matching symbolic information found.rnLoaded 'C:\WINDOWS\system32\wintrust.dll', no matching symbolic information found.rnLoaded 'C:\WINDOWS\system32\crypt32.dll', no matching symbolic information found.rnLoaded 'C:\WINDOWS\system32\msasn1.dll', no matching symbolic information found.rnLoaded 'C:\WINDOWS\system32\imagehlp.dll', no matching symbolic information found.rnDetected memory leaks!rnDumping objects ->rnE:\usb\SJCJVC\SJCJVCDlg.cpp(394) : 115 normal block at 0x003D6150, 2 bytes long.rn Data: < > B1 82 rnE:\usb\SJCJVC\SJCJVCDlg.cpp(370) : 112 normal block at 0x003D6080, 2 bytes long.rn Data: < > B1 A2 rnE:\usb\SJCJVC\SJCJVCDlg.cpp(347) : 109 normal block at 0x003D5C68, 2 bytes long.rn Data: < > B1 00 rnE:\usb\SJCJVC\SJCJVCDlg.cpp(265) : 106 normal block at 0x003D5E28, 256 bytes long.rn Data: < > CD CD CD CD CD CD CD CD CD CD CD CD CD CD CD CD rnE:\usb\SJCJVC\SJCJVCDlg.cpp(265) : 103 normal block at 0x003D5CE0, 256 bytes long.rn Data: < > CD CD CD CD CD CD CD CD CD CD CD CD CD CD CD CD rnE:\usb\SJCJVC\SJCJVCDlg.cpp(188) : 76 normal block at 0x003D4E58, 2200 bytes long.rn Data: < W= > 98 57 3D 00 00 00 00 00 00 00 00 00 00 00 00 00 rnObject dump complete.rnThe thread 0xDBC has exited with code 2 (0x2).rnThe program 'E:\usb\SJCJVC\Debug\SJCJVC.exe' has exited with code 2 (0x2).rnrnrn程序如下:rnvoid CSJCJVCDlg::OnButton2() rn rn // TODO: Add your control notification handler code herern if (ReadThread)rn rn ReadThreadLooping = false;rn ReadThread=NULL; //线程结束rn SetDlgItemText(IDC_EDIT1,"传输完毕!");rn rn else rn rn if (USBDevice->IsOpen()) //检测USB是否打开rn ReadThreadLooping = true;rn // DWORD dwParam;rn ReadThread = AfxBeginThread(ReadThreadLoop,this); //开启线程rn SetDlgItemText(IDC_EDIT1,"正在传输!");rn rn rnrnrnUINT ReadThreadLoop( LPVOID params ) //线程处理rn bool okin;rn CSJCJVCDlg *dlg = (CSJCJVCDlg *) params;rn OVERLAPPED inOvLap;rn PUCHAR inData = new UCHAR[512]; //数据缓冲区rn ZeroMemory(inData,1024);rn inOvLap.hEvent = CreateEvent(NULL, false, false, "CYUSB_IN"); rn UCHAR eptAddr = 0x82;rn dlg->InEndpt=dlg->USBDevice->EndPointOf(eptAddr);rn dlg->InEndpt->TimeOut = 10;rnrn for (;dlg->ReadThreadLooping;) //循环rn rn LONG inlen=512;rn //异步读数据rn UCHAR *inContext = dlg->InEndpt->BeginDataXfer(inData,inlen,&inOvLap);rn dlg->InEndpt->WaitForXfer(&inOvLap,200);rn okin = dlg->InEndpt->FinishDataXfer(inData,inlen, &inOvLap,inContext);rn if (okin) //如果读取成功,则保存数据rn rn mFile.SeekToEnd();rn mFile.Write(inData,inlen);rn rn rn //结束Startrn ept->Target = TGT_DEVICE; rn ept->ReqType = REQ_VENDOR; rn ept->Direction = DIR_TO_DEVICE; rn ept->ReqCode = 0xB1; //请求码rn ept->Value = 0; rn ept->Index = 0; rnrn PUCHAR buf=new UCHAR[2]; rn ZeroMemory(buf, 2); rn LONG buflen = 2; rn buf[0]=0xB1;rn buf[1]=0x00; //结束Start rn ept->XferData(buf,buflen);rnrn CloseHandle(inOvLap.hEvent); rnrn delete [] inData;rn dlg->ReadThread = NULL; //线程结束rnrn dlg->USBDevice->Close(); //关闭USB设备rnrn mFile.Flush(); //关闭文件rn mFile.Close();rnrn return true;rn
php 上传遇到了问题
在做文件上传的时候rn如果客户端上传 比较大的文件 比如1000m rnphp.ini 里面 我设置的是upload_max_filesize =5m post_max_size = 8mrn所以肯定就传不上去rnrn我以为可以被rn$_FILES["file"]["error"] 打印出错误rn发现根本打印不了 一直卡在那里,rn有时候不开了 打印print_r($_FILES)也是空的rnrnrn一般怎么处理这种情况呀 (就是给个友情提示文件过大,上传不了,限制在5m以下)rnrnrn我在网上查了下资料 如果在前端限制 非ie 下 可以用input.files来取文件的大小rnrn但是ie下却始终找不到合适的办法 看到说的最多的是image的dynsrc ie, 7,8,9都不成rn难道只能用flash?rnrnrn只有14分了 哈哈 可怜呀.....
发布应用程序遇到了问题
新建了一个发布项目,生成的时候就有以下的提示:rn“dotNETFXRedist_x86_chs.msm 不能用于重新发布 .NET 框架。请排除此合并模块。”rn生成完了,在另一台机器上安装,安装程序提示我在必须另外安装.net框架……rn请问怎么办?rn
遇到了一个奇怪的问题
今天我改了几处代码,在界面上屏蔽删除了一些东西,在模拟器上运行没问题,但是部署到真机上后,竟然是没改代码前的效果,那些删掉的屏蔽掉的东西竟然还在。这是怎么回事? 试了好几次都这样,把真机上的app删掉重装还是这样。
遇到了一个棘手的问题
[code=C#] while (collireader.Read())rn rnrn string collivluesql = "select " + collireader[0] + " from dip_data_cwbb where ehid=" + ehid;//通过EHID以及指标 来取得指标对应的值rn cmd.CommandText = collivluesql;rn rn rn rn rn datavalue = System.Convert.ToString(cmd.ExecuteScalar());rnrnrnrnrn Operasql = "insert into DOM_DATA_VALUE(COMPANYID,USENO,DATANO,DATAVALUE,DATATIME)values('" + companyid + "','" + System.Convert.ToString(n_useno) + "','" + collireader[0] + "','" + System.Convert.ToInt32(datavalue) + "',to_date('" + System.DateTime.Now + "','yyyy-mm-dd hh24:mi:ss'))";//插入数据rn rn rn cmd.CommandText = Operasql;rn cmd.ExecuteNonQuery();rn status = 1;rnrn [/code]rn用的是ORACLErn 第一个collireader[0] 会随着循环变化,而第2个 就不变。。。求教为啥rnrn
又遇到了一个问题
我设计了一个SSIS包,目的是从一个源数据表中把数据导入到目的表中,在SSIS包执行时,如果由于数据某个字段不规范而出现错误,那我该如何捕获这个错误呀?并且把这条数据以及它出错的信息存入到一个新表中?
读入顺序文件遇到了问题
当我在读入顺序文件时,有四五十组数,每组数是有一个点名,五个double型数组成,我要用那五个数,但是我用下面的语句时却只循环了一次,请教高手,是什么原因?rnwhile(inClientFile>>pointname>>u>>v>>X>>Y>>Z)
python遇到了的问题总结
python遇到了的问题总结1.pickle序列化保存文件读取 1.pickle序列化保存文件读取 group = (&quot;biadu&quot;,&quot;jingdong&quot;,&quot;taobao&quot;) f = file('1.pkl','wb') pickle.dump(group,f) f.closed f2 = file('1.pkl', 'rb') t = pickle.load(f2) f2.clos...
建立索引遇到了问题
[code=sql]mysql> create unique index idx_part_name_lenrn -> on part(length(name));rnERROR 1064 (42000): You have an error in your SQL syntax; check the manual thatrncorresponds to your MySQL server version for the right syntax to use near 'name)rn)' at line 2[/code]rnrnRTrn本意是建立一个由表part中name的长度的索引rn请问是什么情况?该如何解决?
输出0000--9999,遇到了问题
using System;rnusing System.Collections.Generic;rnusing System.Text;rnrnnamespace TestCrnrn class Programrn rn static void Main(string[] args)rn rn int i;rn int j;rn int m;rn int n;rn for (i = 0; i < 9;i++ )rn rn for (j = 0; j < 9; j++)rn rn for (m = 0; m < 9; m++)rn rn for (n = 0; n < 9; n++)rn rn Console.Write(i + j +m + n + " ");rn rn rn rn rn rn rnrnrn以上是我自己写的程序,怎么老是到32就截至了呢?(只要能正确输出0000--9999之间所有的数)rn我认为题目也不难,怎么就运行不到俺心里呢?rn请高手指点!谢谢
我遇到了奇怪的问题?
我要写很多相同的程序,我做好一个之后就不停的另存。但是后来打开一看,为什么全部的程序都变成了最后一个呢。以前没有遇到这个问题。请解释
遇到了问题关于axwebbrowser
我用axwebbrowser访问调用JS命令 ((mshtml.HTMLDocumentClass)axWebBrowser1.Document).parentWindow.execScript("submit3()", "JScript"); rn问题是被调用的网页是应用AJAX技术嵌套在主页面中的,所以无法访问到submit3()的JS代码。请求解决个。。谢谢
遇到了一个问题,求助!
タイムアウトに達しました。プールから接続を取得する前にタイムアウト期間が過ぎました。プールされた接続がすべて使用中で、プール サイズの制限値に達した可能性があります。 rn上面这是什么问题啊?应该怎么解决?谢谢
遇到了一个诡异的问题。
明明头文件里定义了成员变量,rnrn编译死活说没定义。rnrn然后搜索也搜不到,什么情况。
在getsetting中遇到了问题
例:rnGetSetting("Setting", "OperatorPsw", "Operator")rnrn其中Setting 作为注册表,在哪能找到位置或者文件rnrn求解rnrn勿以善小而不为啊。。
相关热词 c++和c#哪个就业率高 c# 批量动态创建控件 c# 模块和程序集的区别 c# gmap 截图 c# 验证码图片生成类 c# 再次尝试 连接失败 c#开发编写规范 c# 压缩图片好麻烦 c#计算数组中的平均值 c#获取路由参数

相似问题

3
装了python3.7 大包的时候显示python3不是内部或外部指令
1
Python3.5版本,怎样才能成功安装face_recognition库?
1
centos6.3 如何解决python3.7 的 SSL 问题?
1
用pyinstaller封装同样的python文件,为什么3.6封装的要远远大于3.5封装的?
1
python3.7安装的 tensorflow缺少tensorflow.app.flags怎么解决?
0
求教!安装kaldi,make时错误提示没有安装libtool和python2.7,但是已经安装了。
4
windows下Django运行python manage.py runserver时报错LookupError: No installed app with label 'admin'.
3
python3.6 kivy 环境搭建问题
0
ESP32 windows开发环境的搭建. 第四步:安装 Python 软件包 出错?
0
【求助】Anaconda 建立python 3.6 新环境后,激活环境,进入python交互模式又变回原来的python3.7 。
7
关于Python3.7中安装pip install Scrapy出现的问题
1
Ubuntu上安装python3.7.0版本,执行到make命令有两个modules build failed,请问如何解决呢?
1
乌班图下载python3.7时的问题
1
Windows 7环境下Python3.7.3版本类导入问题
1
Python3.7+Pyside2 运行exe文件提示“ImportError: DLL load failed: 找不到指定的程序。
1
tensorflow环境下VS编译安装pycocotools提示缺失cl.exe
1
python3.7安装email库出现报错
2
如何在服务器中一直运行python manage.py runserver 这条命令
1
安装python3.7,但勾勒了add python 3.7 to PATH就安装不了了。自己选择安装也没用
0
执行python manage.py makemigrations,python manage.py migrate报错