Python运行ride.py报错

各位大佬,小白请教一个问题,我在cmd命令下运行ride.py的时候报如下错,能否帮忙看下,小白谢谢各位大佬了~!
E:\Python27\Scripts>python ride.py
Traceback (most recent call last):
File "E:\Python27\lib\site-packages\robotide__init__.py", line 83, in main
run(inpath, not noupdatecheck, debug_console)
File "E:\Python27\lib\site-packages\robotide\
_init__.py", line 102, in run
from robotide.application import RIDE
File "E:\Python27\lib\site-packages\robotide\application\
_init__.py", line 16, in
from .application import RIDE, Project
File "E:\Python27\lib\site-packages\robotide\application\application.py", line 22, in
from robotide.namespace import Namespace
File "E:\Python27\lib\site-packages\robotide\namespace__init__.py", line 16, in
from .namespace import Namespace
File "E:\Python27\lib\site-packages\robotide\namespace\namespace.py", line 31, in
from robotide.publish import PUBLISHER, RideSettingsChanged, RideLogMessage
File "E:\Python27\lib\site-packages\robotide\publish__init__.py", line 123, in
from .messages import *
File "E:\Python27\lib\site-packages\robotide\publish\messages.py", line 21, in
from .messages2 import *
File "E:\Python27\lib\site-packages\robotide\publish\messages2.py", line 24, in
from robotide.publish import publisher
File "E:\Python27\lib\site-packages\robotide\publish\publisher.py", line 24, in
from pubsub import pub
ImportError: cannot import name pub

weixin_44849302
天晴欲雨 你好,你这个问题解决没有?我现在准备使用RIDE时,根据提示下载了很多小文件(.whl)最后装好了wxpython;但是在运行ride.py时出现报错,和你这个一样; from pubsub import pub ModuleNotFoundError: No module named 'pubsub'
5 个月之前 回复
q463643865
like sunshine 回复小白Jeson: 我这个问题是重新按照文档来了之后就没有报这个错了,https://www.cnblogs.com/yinrw/p/5837828.html 不过我现在遇到了另外一个坑爹的错
大约一年之前 回复
Jason__JA_K
小白Jeson 遇到了同样的问题,你解决了吗?
大约一年之前 回复

1个回答

错误在最后三句:

File "E:\Python27\lib\site-packages\robotide\publish\publisher.py", line 24, in 
from pubsub import pub
ImportError: cannot import name pub

导入出错了。应该是你的文件导入顺序有误,具体可以参考下面这篇文章检查一下:
https://segmentfault.com/a/1190000010600365

q463643865
like sunshine 谢谢,可是我这个是运行robotframework-ride的运行程序报的错呀,难道这个包的代码有问题吗,应该不可能吧?
大约一年之前 回复
Csdn user default icon
上传中...
上传图片
插入图片
抄袭、复制答案,以达到刷声望分或其他目的的行为,在CSDN问答是严格禁止的,一经发现立刻封号。是时候展现真正的技术了!
其他相关推荐
Windows命令行启动ride.py报错。

Win10,64位,Python版本3.8.1, pip 19.3.1 Pypubsub 4.0.3 pywin32 227 requests 2.22.0 robotframework 3.1.2 robotframework-ride 1.7.4 setuptools 41.2.0 wxPython 4.1.0a1.dev4523+46bae17a 出现的情况是:用命令行python ride.py启动就如图报错; 直接双击ride.py会有一个空白的命令行窗口闪一下,然后就没反应了。 这个报错图上面还有蛮长的一段,内容都是<class 'robotide.preferences.configobj.UnreprError'> Parse error in value at lineXX这种。 ![图片说明](https://img-ask.csdn.net/upload/202001/12/1578762599_139263.png) 还请大佬能为我答疑解惑。

windows安装python3.7.7启动ride.py报错

python3.7.7启动ride.py 本机版本信息如下,所有版本都是64位 ![图片说明](https://img-ask.csdn.net/upload/202003/20/1584673323_782069.png) 启动ride.py时,报错如下: ![图片说明](https://img-ask.csdn.net/upload/202003/20/1584673393_604128.png) 请教各位大佬,如何解决 答友提说说使用命令python ride.py,执行结果无响应 ![图片说明](https://img-ask.csdn.net/upload/202003/20/1584680606_497638.png)

·Robotframework」运行ride.py 报错 麻烦大神们看一下!

环境:Ubuntu 16.04 折腾了好久pip install robotframework-ride 才成功 运行ride.py又又又报错了 心累 麻烦各位帮我看看 指点迷津 ``` pip install robotframework-ride 提示 Looking in indexes: https://pypi.tuna.tsinghua.edu.cn/simple Requirement already satisfied: robotframework-ride in /usr/local/lib/python2.7/dist-packages (1.7.4b1.dev1) Requirement already satisfied: wxPython in /usr/lib/python2.7/dist-packages/wx-2.8-gtk2-unicode (from robotframework-ride) (2.8.12.1) Requirement already satisfied: PyPubSub in /usr/local/lib/python2.7/dist-packages (from robotframework-ride) (3.3.0) Requirement already satisfied: Pygments in /usr/local/lib/python2.7/dist-packages (from robotframework-ride) (2.4.2 ``` ``` ride.py后 ``` ![图片说明](https://img-ask.csdn.net/upload/201907/18/1563447987_206124.png) 报错:Traceback (most recent call last): File "/usr/local/lib/python2.7/dist-packages/robotide/__init__.py", line 83, in main _run(inpath, not noupdatecheck, debug_console) File "/usr/local/lib/python2.7/dist-packages/robotide/__init__.py", line 112, in _run ride = RIDE(inpath, updatecheck) File "/usr/local/lib/python2.7/dist-packages/robotide/application/application.py", line 45, in __init__ wx.App.__init__(self, redirect=False) File "/usr/lib/python2.7/dist-packages/wx-2.8-gtk2-unicode/wx/_core.py", line 7981, in __init__ self._BootstrapApp() File "/usr/lib/python2.7/dist-packages/wx-2.8-gtk2-unicode/wx/_core.py", line 7555, in _BootstrapApp return _core_.PyApp__BootstrapApp(*args, **kwargs) File "/usr/local/lib/python2.7/dist-packages/robotide/application/application.py", line 55, in OnInit self.frame = RideFrame(self, self._controller) File "/usr/local/lib/python2.7/dist-packages/robotide/ui/mainframe.py", line 173, in __init__ self.Bind(wx.EVT_DIRCTRL_FILEACTIVATED, self.OnOpenFile) AttributeError: 'module' object has no attribute 'EVT_DIRCTRL_FILEACTIVATED' 麻烦各位了!!非常感谢!!

python运行main.py报错

python3运行项目的main.py是报错提示系统找不到指定的路径

安装完robotframework-ride之后运行ride.py报错,救救孩子吧!!!我试了好几个方法都失败

Traceback (most recent call last): File "C:\Python27\lib\site-packages\robotide\application\application.py", line 59, in OnInit self._plugin_loader.enable_plugins() File "C:\Python27\lib\site-packages\robotide\application\pluginloader.py", line 43, in enable_plugins p.enable_on_startup() File "C:\Python27\lib\site-packages\robotide\application\pluginconnector.py", line 52, in enable_on_startup self.enable() File "C:\Python27\lib\site-packages\robotide\application\pluginconnector.py", line 57, in enable self._plugin.enable() File "C:\Python27\lib\site-packages\robotide\contrib\testrunner\testrunnerplugin.py", line 162, in enable self._build_ui() File "C:\Python27\lib\site-packages\robotide\contrib\testrunner\testrunnerplugin.py", line 558, in _build_ui self._build_notebook_tab() File "C:\Python27\lib\site-packages\robotide\contrib\testrunner\testrunnerplugin.py", line 734, in _build_notebook_tab self.out = self._create_output_textctrl() File "C:\Python27\lib\site-packages\robotide\contrib\testrunner\testrunnerplugin.py", line 769, in _create_output_textctrl font = self._create_font() File "C:\Python27\lib\site-packages\robotide\contrib\testrunner\testrunnerplugin.py", line 789, in _create_font font=wx.SystemSettings.GetFont(wx.ANSI_FIXED_FONT) AttributeError: 'module' object has no attribute 'ANSI_FIXED_FONT' OnInit returned false, exiting... Error in atexit._run_exitfuncs: Traceback (most recent call last): File "C:\Python27\lib\atexit.py", line 24, in _run_exitfuncs func(*targs, **kargs) wxAssertionError: C++ assertion "GetEventHandler() == this" failed at ..\..\src\common\wincmn.cpp(478) in wxWindowBase::~wxWindowBase(): any pushed event handlers must have been removed Error in sys.exitfunc: Traceback (most recent call last): File "C:\Python27\lib\atexit.py", line 24, in _run_exitfuncs func(*targs, **kargs) wx._core.wxAssertionError: C++ assertion "GetEventHandler() == this" failed at ..\..\src\common\wincmn.cpp(478) in wxWindowBase::~wxWindowBase(): any pushed event handlers must have been removed

python运行ride.py报错wxAssertionError

这个问题再发一次,麻烦各位大佬帮忙看下呢,十分感谢啦! 报错内容如下,十分感谢各位大佬! Traceback (most recent call last): File "C:\Users\坤哥\AppData\Local\Programs\Python\Python37\lib\site-packages\robotide\application\application.py", line 59, in OnInit self._plugin_loader.enable_plugins() File "C:\Users\坤哥\AppData\Local\Programs\Python\Python37\lib\site-packages\robotide\application\pluginloader.py", line 43, in enable_plugins p.enable_on_startup() File "C:\Users\坤哥\AppData\Local\Programs\Python\Python37\lib\site-packages\robotide\application\pluginconnector.py", line 52, in enable_on_startup self.enable() File "C:\Users\坤哥\AppData\Local\Programs\Python\Python37\lib\site-packages\robotide\application\pluginconnector.py", line 57, in enable self._plugin.enable() File "C:\Users\坤哥\AppData\Local\Programs\Python\Python37\lib\site-packages\robotide\contrib\testrunner\testrunnerplugin.py", line 162, in enable self._build_ui() File "C:\Users\坤哥\AppData\Local\Programs\Python\Python37\lib\site-packages\robotide\contrib\testrunner\testrunnerplugin.py", line 558, in _build_ui self._build_notebook_tab() File "C:\Users\坤哥\AppData\Local\Programs\Python\Python37\lib\site-packages\robotide\contrib\testrunner\testrunnerplugin.py", line 734, in _build_notebook_tab self.out = self._create_output_textctrl() File "C:\Users\坤哥\AppData\Local\Programs\Python\Python37\lib\site-packages\robotide\contrib\testrunner\testrunnerplugin.py", line 769, in _create_output_textctrl font = self._create_font() File "C:\Users\坤哥\AppData\Local\Programs\Python\Python37\lib\site-packages\robotide\contrib\testrunner\testrunnerplugin.py", line 789, in _create_font font=wx.SystemSettings.GetFont(wx.SYS_ANSI_FIXED_FONT) wx._core.wxAssertionError: C++ assertion "wxFontEnumerator::IsValidFacename(font.GetFaceName())" failed at ....\src\msw\settings.cpp(301) in wxSystemSettingsNative::GetFont(): OnInit returned false, exiting... Error in atexit._run_exitfuncs: wx._core.wxAssertionError: C++ assertion "GetEventHandler() == this" failed at ....\src\common\wincmn.cpp(478) in wxWindowBase::~wxWindowBase(): any pushed event handlers must have been removed

phython运行ride.py时报错

phython运行ride.py报如下错,求大佬看下是什么问题哇,感谢了 Traceback (most recent call last): File "C:\Users\坤哥\AppData\Local\Programs\Python\Python37\lib\site-packages\robotide\application\application.py", line 59, in OnInit self._plugin_loader.enable_plugins() File "C:\Users\坤哥\AppData\Local\Programs\Python\Python37\lib\site-packages\robotide\application\pluginloader.py", line 43, in enable_plugins p.enable_on_startup() File "C:\Users\坤哥\AppData\Local\Programs\Python\Python37\lib\site-packages\robotide\application\pluginconnector.py", line 52, in enable_on_startup self.enable() File "C:\Users\坤哥\AppData\Local\Programs\Python\Python37\lib\site-packages\robotide\application\pluginconnector.py", line 57, in enable self._plugin.enable() File "C:\Users\坤哥\AppData\Local\Programs\Python\Python37\lib\site-packages\robotide\contrib\testrunner\testrunnerplugin.py", line 162, in enable self._build_ui() File "C:\Users\坤哥\AppData\Local\Programs\Python\Python37\lib\site-packages\robotide\contrib\testrunner\testrunnerplugin.py", line 558, in _build_ui self._build_notebook_tab() File "C:\Users\坤哥\AppData\Local\Programs\Python\Python37\lib\site-packages\robotide\contrib\testrunner\testrunnerplugin.py", line 734, in _build_notebook_tab self.out = self._create_output_textctrl() File "C:\Users\坤哥\AppData\Local\Programs\Python\Python37\lib\site-packages\robotide\contrib\testrunner\testrunnerplugin.py", line 769, in _create_output_textctrl font = self._create_font() File "C:\Users\坤哥\AppData\Local\Programs\Python\Python37\lib\site-packages\robotide\contrib\testrunner\testrunnerplugin.py", line 789, in _create_font font=wx.SystemSettings.GetFont(wx.SYS_ANSI_FIXED_FONT) wx._core.wxAssertionError: C++ assertion "wxFontEnumerator::IsValidFacename(font.GetFaceName())" failed at ..\..\src\msw\settings.cpp(301) in wxSystemSettingsNative::GetFont(): OnInit returned false, exiting... Error in atexit._run_exitfuncs: wx._core.wxAssertionError: C++ assertion "GetEventHandler() == this" failed at ..\..\src\common\wincmn.cpp(478) in wxWindowBase::~wxWindowBase(): any pushed event handlers must have been removed

robotframework安装完成,点击ride.py弹出俩个框怎么解决?

![点击ride.py,会运行python.exe和ride.py,并且二次点击的时候报错如下,只想要ride界面怎么解决](https://img-ask.csdn.net/upload/201811/23/1542987790_115853.png)

python的问题执行.py 提示nameError

![图片说明](https://img-ask.csdn.net/upload/201712/22/1513910248_293318.png) 执行hello.py里面只是print‘hello’一行代码,这是什么问题引起的希望知道的帮忙解决一下谢谢各位前辈

robotframework ride 什么时候支持python3.0?

官方wiki说,不支持python3.0,但是python以后全力支持3.0,ride就不打算支持3.0了么? 求解:robotframework ride 什么时候支持python3.0? 下面是官方wiki: RIDE runs only on the regular Python, not on Jython nor IronPython. Python 2.6 is the minimum version. Notice that similarly as Robot Framework, RIDE does not yet support Python 3.

RIDE的testcase edit界面显示异常/空白

问题描述: 在电脑A通过运行exe安装python后,把python38文件夹拷贝到另一台电脑B(Python\Python38)。 在电脑B的Python文件夹安装pip,并安装Selenium2Library, robotframework, wxPython, robotframework-ride 安装成功,环境配置成功 电脑B运行ride.py,RIDE的testcase edit界面显示异常/空白(如图) 此时cmd的报错信息: module 'urllib' has no attribute 'Request' 尝试过的方法: 1、在ride.py添加import urllib.request 2、安装urllib3 3、添加requests packages,及配套的certifi, idna;Django packages,和pytz, sqlparse, chardet等。 以上,均未解决问题。 希望有大神可以帮助解答,谢谢! ![图片说明](https://img-ask.csdn.net/upload/201911/08/1573205687_271275.jpg)

刚学python,py文件,双击运行后,自动关闭了

刚学python, py文件,双击运行后,看不到结果就自动关闭了,需要加什么参数可以不要让他自动关闭吗·??问题太菜了,不要拍砖,TKS~~

Python问题 出现问题报错怎么办?

# 读入Staffs_2030.txt,找出其中本年度考核为优秀的员工,加薪20%,薪水四舍五入后统一保留整数位。然后重新写入Staffs_2031.txt中,新旧文件的编码方式均为’utf-8’ with open('Staffs_2030.txt','r',encoding='utf-8') as f: a=f.readlines() for i in a: b=i.split(',') if b[6]=='优秀': b[5]=round(int(b[5])+0.2*int(b[5]),0) str1=','.join(b) with open('Staffs_2031.txt','w',encoding='utf-8') as g: g.append(b) else: str1=','.join(b) with open('Staffs_2031.txt','w',encoding='utf-8') as g: g.append(b) print('已根据2030信息生成2031对应文件') ## Staffs_2030.txt 工号,姓名,职位,年龄,工龄,工资,考核结果 00001,曹横,总经理,40,10,30000,优秀 00002,郑武,经理,34,8,18000,及格 00007,李飞,经理,30,7,15600,优秀 00019,张白,经理,28,6,14000,及格 00035,王柳,经理,34,4,19200,优秀 01002,张小明,职员,26,3,8000,及格 01004,李小笑,职员,25,3,10800,优秀 01006,张三,职员,25,3,8400,优秀 01009,李四,职员,23,3,5000,及格 01013,王五,职员,22,3,6000,优秀 01015,郑六,职员,21,1,4000,及格 01016,宋七,职员,21,1,4800,优秀 ## 错误提示 Traceback (most recent call last): File "C:\Users\lzj\Desktop\p_SalaryRaising(1).py", line 13, in <module> g.append(b) AttributeError: '_io.TextIOWrapper' object has no attribute 'append'

RobotFramework Error267

RobotFramework运行时出现:command: pybot.bat --argumentfile c:\users\wg\appdata\local\temp\RIDEwtxns7.d\argfile.txt --listener E:\Python27\lib\site-packages\robotide\contrib\testrunner\TestRunnerAgent.py:2195:True D:\Python\RF脚本\testproject [Error 267]

robotframework 执行报错command: pybot.bat --argumentfile

各位前辈们,我根据教程安装robotframework,并根据网上教程执行命令打开ride,但是run用例就报command: pybot.bat --argumentfile c:\users\zhoudn\appdata\local\temp\RIDEfc7_t_.d\argfile.txt --listener C:\Python27\lib\site-packages\robotide\contrib\testrunner\TestRunnerAgent.py:45557:False C:\Python27\Scripts\Learn_1\测试项目 [Error 267] 执行命令pybot--version,没问题 Robot Framework 3.1.2 <python on win32

robot framwork执行脚本报错,找不到原因,求大神

command: --argumentfile c:\users\tangdan\appdata\local\temp\RIDEc6rbff.d\argfile.txt --listener C:\Python27\lib\site-packages\robotide\contrib\testrunner\TestRunnerAgent.py:6568:False C:\Users\tangdan\Desktop\接口自动\服务网关接口自动化最新[Error 123] ![图片说明](https://img-ask.csdn.net/upload/201709/12/1505200172_856632.png)

python简单爬虫正常运行遍历,没有报错,但最后csv文件为什么只保存了一条信息

import requests import json import re import csv # 获取每个电影分类链接的函数 def get_movie_type(): url='https://movie.douban.com/chart' resp=requests.get(url) result=re.findall(r'<span><a href="(/typerank\?type_name=.*?)">(.*?)</a></span>',resp.text) return result # 获取每种电影前100部: def get_movie_rank(type_url): type_url = 'https://movie.douban.com/j/chart/top_list?' + type_url[23:] + '&start=0&limit=100' resp=requests.get(type_url) return resp.text # 储存成CSV格式 数据包括:电影名,类型,国家或地区,上映日期,评分,排行 def save(movie): with open(r'C:\Users\Administrator\Desktop\python\豆瓣电影分类前100.csv', 'w', newline='', encoding='utf8') as f: csv.writer(f).writerow(['类型','电影名称','地区','上映日期','评分','排行','地址']) csv.writer(f).writerow(movie) def run(): types_url=get_movie_type() for url in types_url: movie_type_name = url[1] print('正在储存'+movie_type_name+'类型的电影') type_url = url[0] result=get_movie_rank(type_url) #json解析 result=json.loads(result) #获取所需电影信息 for massage in result: title=massage['title'] regions=massage['regions'][0] release_date=massage['release_date'] score=massage['score'] rank = massage['rank'] url = massage['url'] movie = [movie_type_name, title, regions, release_date, score, rank, url] # 储存包含电影信息 save(movie) print(movie_type_name + '的类型储存完毕!') run()

'utf8' codec can't decode byte 0xbd

问题描述: RobotFramework ride 导入用户自定义库时报错 报错日志: 20160809 10:28:52.264 [WARN]: Importing test library "C:/Python27/Lib/site-packages/CustomLibrary/runbat.py" failed Traceback (most recent call last): Importing test library 'C:\Python27\Lib\site-packages\CustomLibrary\runbat.py' failed: SyntaxError: (unicode error) 'utf8' codec can't decode byte 0xbd in position 0: invalid start byte (runbat.py, line 16) Traceback (most recent call last): File "C:\Python27\lib\site-packages\robotide\lib\robot\utils\importer.py", line 143, in _import return __import__(name, fromlist=fromlist) 用户自定义的库文件源码: 如图![图片说明](https://img-ask.csdn.net/upload/201608/09/1470714706_278512.png) 这个是网上的一个教程,我复制粘贴搞不定了,求带飞。

TypeError: unsupported operand type(s) for +: 'NoneType' and 'float'如何处理?

关于“+”,如何处理'NoneType' and 'float' ``` def minPathCost_Memo(cost, i, j, memo): # 请在下面编写代码 if not (memo[i][j]==0): return memo[i][j] if (i==0) and (j==0): memo[i][j]=cost[0][0] elif i==0 and j>0: memo[i][j]=minPathCost_Memo(cost,i,j-1,memo)+float(cost[0][j]) elif j==0 and i>0: memo[i][j]=minPathCost_Memo(cost,i-1,j,memo)+float(cost[i][0]) elif j>0 and i>0: x=minPathCost_Memo(cost,i-1,j,memo) y=minPathCost_Memo(cost,i,j-1,memo) memo[i][j]=min(x,y)+float(cost[i][j]) return memo[i][j] # 请不要修改下面的代码 ``` ``` TypeError: unsupported operand type(s) for +: 'NoneType' and 'float' ```

学Python后到底能干什么?网友:我太难了

感觉全世界营销文都在推Python,但是找不到工作的话,又有哪个机构会站出来给我推荐工作? 笔者冷静分析多方数据,想跟大家说:关于超越老牌霸主Java,过去几年间Python一直都被寄予厚望。但是事实是虽然上升趋势,但是国内环境下,一时间是无法马上就超越Java的,也可以换句话说:超越Java只是时间问题罢。 太嚣张了会Python的人!找工作拿高薪这么简单? https://edu....

在中国程序员是青春饭吗?

今年,我也32了 ,为了不给大家误导,咨询了猎头、圈内好友,以及年过35岁的几位老程序员……舍了老脸去揭人家伤疤……希望能给大家以帮助,记得帮我点赞哦。 目录: 你以为的人生 一次又一次的伤害 猎头界的真相 如何应对互联网行业的「中年危机」 一、你以为的人生 刚入行时,拿着傲人的工资,想着好好干,以为我们的人生是这样的: 等真到了那一天,你会发现,你的人生很可能是这样的: ...

为什么程序猿都不愿意去外包?

分享外包的组织架构,盈利模式,亲身经历,以及根据一些外包朋友的反馈,写了这篇文章 ,希望对正在找工作的老铁有所帮助

Java校招入职华为,半年后我跑路了

何来 我,一个双非本科弟弟,有幸在 19 届的秋招中得到前东家华为(以下简称 hw)的赏识,当时秋招签订就业协议,说是入了某 java bg,之后一系列组织架构调整原因等等让人无法理解的神操作,最终毕业前夕,被通知调往其他 bg 做嵌入式开发(纯 C 语言)。 由于已至于校招末尾,之前拿到的其他 offer 又无法再收回,一时感到无力回天,只得默默接受。 毕业后,直接入职开始了嵌入式苦旅,由于从未...

Java基础知识面试题(2020最新版)

文章目录Java概述何为编程什么是Javajdk1.5之后的三大版本JVM、JRE和JDK的关系什么是跨平台性?原理是什么Java语言有哪些特点什么是字节码?采用字节码的最大好处是什么什么是Java程序的主类?应用程序和小程序的主类有何不同?Java应用程序与小程序之间有那些差别?Java和C++的区别Oracle JDK 和 OpenJDK 的对比基础语法数据类型Java有哪些数据类型switc...

@程序员:GitHub这个项目快薅羊毛

今天下午在朋友圈看到很多人都在发github的羊毛,一时没明白是怎么回事。 后来上百度搜索了一下,原来真有这回事,毕竟资源主义的羊毛不少啊,1000刀刷爆了朋友圈!不知道你们的朋友圈有没有看到类似的消息。 这到底是啥情况? 微软开发者平台GitHub 的一个区块链项目 Handshake ,搞了一个招募新会员的活动,面向GitHub 上前 25万名开发者派送 4,246.99 HNS币,大约价...

用python打开电脑摄像头,并把图像传回qq邮箱【Pyinstaller打包】

前言: 如何悄悄的打开朋友的摄像头,看看她最近过的怎么样,嘿嘿!这次让我带你们来实现这个功能。 注: 这个程序仅限在朋友之间开玩笑,别去搞什么违法的事情哦。 代码 发送邮件 使用python内置的email模块即可完成。导入相应的代码封装为一个send函数,顺便导入需要导入的包 注: 下面的代码有三处要修改的地方,两处写的qq邮箱地址,还有一处写的qq邮箱授权码,不知道qq邮箱授权码的可以去百度一...

做了5年运维,靠着这份监控知识体系,我从3K变成了40K

从来没讲过运维,因为我觉得运维这种东西不需要太多的知识面,然后我一个做了运维朋友告诉我大错特错,他就是从3K的运维一步步到40K的,甚至笑着说:我现在感觉自己什么都能做。 既然讲,就讲最重要的吧。 监控是整个运维乃至整个产品生命周期中最重要的一环,事前及时预警发现故障,事后提供详实的数据用于追查定位问题。目前业界有很多不错的开源产品可供选择。选择一款开源的监控系统,是一个省时省力、效率最高的方...

C++(继承):19---虚基类与虚继承(virtual)

一、菱形继承 在介绍虚继承之前介绍一下菱形继承 概念:A作为基类,B和C都继承与A。最后一个类D又继承于B和C,这样形式的继承称为菱形继承 菱形继承的缺点: 数据冗余:在D中会保存两份A的内容 访问不明确(二义性):因为D不知道是以B为中介去访问A还是以C为中介去访问A,因此在访问某些成员的时候会发生二义性 缺点的解决: 数据冗余:通过下面“虚继承”技术来解决(见下) 访问...

再不跳槽,应届毕业生拿的都比我多了!

跳槽几乎是每个人职业生涯的一部分,很多HR说“三年两跳”已经是一个跳槽频繁与否的阈值了,可为什么市面上有很多程序员不到一年就跳槽呢?他们不担心影响履历吗? PayScale之前发布的**《员工最短任期公司排行榜》中,两家码农大厂Amazon和Google**,以1年和1.1年的员工任期中位数分列第二、第四名。 PayScale:员工最短任期公司排行榜 意外的是,任期中位数极小的这两家公司,薪资...

我以为我学懂了数据结构,直到看了这个导图才发现,我错了

数据结构与算法思维导图

技术大佬:我去,你写的 switch 语句也太老土了吧

昨天早上通过远程的方式 review 了两名新来同事的代码,大部分代码都写得很漂亮,严谨的同时注释也很到位,这令我非常满意。但当我看到他们当中有一个人写的 switch 语句时,还是忍不住破口大骂:“我擦,小王,你丫写的 switch 语句也太老土了吧!” 来看看小王写的代码吧,看完不要骂我装逼啊。 private static String createPlayer(PlayerTypes p...

华为初面+综合面试(Java技术面)附上面试题

华为面试整体流程大致分为笔试,性格测试,面试,综合面试,回学校等结果。笔试来说,华为的难度较中等,选择题难度和网易腾讯差不多。最后的代码题,相比下来就简单很多,一共3道题目,前2题很容易就AC,题目已经记不太清楚,不过难度确实不大。最后一题最后提交的代码过了75%的样例,一直没有发现剩下的25%可能存在什么坑。 笔试部分太久远,我就不怎么回忆了。直接将面试。 面试 如果说腾讯的面试是挥金如土...

和黑客斗争的 6 天!

互联网公司工作,很难避免不和黑客们打交道,我呆过的两家互联网公司,几乎每月每天每分钟都有黑客在公司网站上扫描。有的是寻找 Sql 注入的缺口,有的是寻找线上服务器可能存在的漏洞,大部分都...

讲一个程序员如何副业月赚三万的真实故事

loonggg读完需要3分钟速读仅需 1 分钟大家好,我是你们的校长。我之前讲过,这年头,只要肯动脑,肯行动,程序员凭借自己的技术,赚钱的方式还是有很多种的。仅仅靠在公司出卖自己的劳动时...

win10暴力查看wifi密码

刚才邻居打了个电话说:喂小灰,你家wifi的密码是多少,我怎么连不上了。 我。。。 我也忘了哎,就找到了一个好办法,分享给大家: 第一种情况:已经连接上的wifi,怎么知道密码? 打开:控制面板\网络和 Internet\网络连接 然后右击wifi连接的无线网卡,选择状态 然后像下图一样: 第二种情况:前提是我不知道啊,但是我以前知道密码。 此时可以利用dos命令了 1、利用netsh wlan...

上班一个月,后悔当初着急入职的选择了

最近有个老铁,告诉我说,上班一个月,后悔当初着急入职现在公司了。他之前在美图做手机研发,今年美图那边今年也有一波组织优化调整,他是其中一个,在协商离职后,当时捉急找工作上班,因为有房贷供着,不能没有收入来源。所以匆忙选了一家公司,实际上是一个大型外包公司,主要派遣给其他手机厂商做外包项目。**当时承诺待遇还不错,所以就立马入职去上班了。但是后面入职后,发现薪酬待遇这块并不是HR所说那样,那个HR自...

女程序员,为什么比男程序员少???

昨天看到一档综艺节目,讨论了两个话题:(1)中国学生的数学成绩,平均下来看,会比国外好?为什么?(2)男生的数学成绩,平均下来看,会比女生好?为什么?同时,我又联想到了一个技术圈经常讨...

总结了 150 余个神奇网站,你不来瞅瞅吗?

原博客再更新,可能就没了,之后将持续更新本篇博客。

副业收入是我做程序媛的3倍,工作外的B面人生是怎样的?

提到“程序员”,多数人脑海里首先想到的大约是:为人木讷、薪水超高、工作枯燥…… 然而,当离开工作岗位,撕去层层标签,脱下“程序员”这身外套,有的人生动又有趣,马上展现出了完全不同的A/B面人生! 不论是简单的爱好,还是正经的副业,他们都干得同样出色。偶尔,还能和程序员的特质结合,产生奇妙的“化学反应”。 @Charlotte:平日素颜示人,周末美妆博主 大家都以为程序媛也个个不修边幅,但我们也许...

MySQL数据库面试题(2020最新版)

文章目录数据库基础知识为什么要使用数据库什么是SQL?什么是MySQL?数据库三大范式是什么mysql有关权限的表都有哪几个MySQL的binlog有有几种录入格式?分别有什么区别?数据类型mysql有哪些数据类型引擎MySQL存储引擎MyISAM与InnoDB区别MyISAM索引与InnoDB索引的区别?InnoDB引擎的4大特性存储引擎选择索引什么是索引?索引有哪些优缺点?索引使用场景(重点)...

女朋友过生日,我花了20分钟给她写了一个代理服务器

女朋友说:“看你最近挺辛苦的,我送你一个礼物吧。你看看想要什么,我来准备。” 我想了半天,从书到鞋子到电子产品最后到生活用品,感觉自己什么都不缺,然后和她说:“你省省钱吧,我什么都不需要。” 她坚持要送:“不行,你一定要说一个礼物,我想送你东西了。” 于是,我认真了起来,拿起手机,上淘宝逛了几分钟,但还是没能想出来缺点什么,最后实在没办法了:“这样吧,如果你实在想送东西,那你就写一个代理服务器吧”...

记一次腾讯面试,我挂在了最熟悉不过的队列上……

腾讯后台面试,面试官问:如何自己实现队列?

如果你是老板,你会不会踢了这样的员工?

有个好朋友ZS,是技术总监,昨天问我:“有一个老下属,跟了我很多年,做事勤勤恳恳,主动性也很好。但随着公司的发展,他的进步速度,跟不上团队的步伐了,有点...

我入职阿里后,才知道原来简历这么写

私下里,有不少读者问我:“二哥,如何才能写出一份专业的技术简历呢?我总感觉自己写的简历太烂了,所以投了无数份,都石沉大海了。”说实话,我自己好多年没有写过简历了,但我认识的一个同行,他在阿里,给我说了一些他当年写简历的方法论,我感觉太牛逼了,实在是忍不住,就分享了出来,希望能够帮助到你。 01、简历的本质 作为简历的撰写者,你必须要搞清楚一点,简历的本质是什么,它就是为了来销售你的价值主张的。往深...

程序员写出这样的代码,能不挨骂吗?

当你换槽填坑时,面对一个新的环境。能够快速熟练,上手实现业务需求是关键。但是,哪些因素会影响你快速上手呢?是原有代码写的不够好?还是注释写的不够好?昨夜...

带了6个月的徒弟当了面试官,而身为高级工程师的我天天修Bug......

即将毕业的应届毕业生一枚,现在只拿到了两家offer,但最近听到一些消息,其中一个offer,我这个组据说客户很少,很有可能整组被裁掉。 想问大家: 如果我刚入职这个组就被裁了怎么办呢? 大家都是什么时候知道自己要被裁了的? 面试软技能指导: BQ/Project/Resume 试听内容: 除了刷题,还有哪些技能是拿到offer不可或缺的要素 如何提升面试软实力:简历, 行为面试,沟通能...

!大部分程序员只会写3年代码

如果世界上都是这种不思进取的软件公司,那别说大部分程序员只会写 3 年代码,恐怕就没有程序员这种职业。

离职半年了,老东家又发 offer,回不回?

有小伙伴问松哥这个问题,他在上海某公司,在离职了几个月后,前公司的领导联系到他,希望他能够返聘回去,他很纠结要不要回去? 俗话说好马不吃回头草,但是这个小伙伴既然感到纠结了,我觉得至少说明了两个问题:1.曾经的公司还不错;2.现在的日子也不是很如意。否则应该就不会纠结了。 老实说,松哥之前也有过类似的经历,今天就来和小伙伴们聊聊回头草到底吃不吃。 首先一个基本观点,就是离职了也没必要和老东家弄的苦...

2020阿里全球数学大赛:3万名高手、4道题、2天2夜未交卷

阿里巴巴全球数学竞赛( Alibaba Global Mathematics Competition)由马云发起,由中国科学技术协会、阿里巴巴基金会、阿里巴巴达摩院共同举办。大赛不设报名门槛,全世界爱好数学的人都可参与,不论是否出身数学专业、是否投身数学研究。 2020年阿里巴巴达摩院邀请北京大学、剑桥大学、浙江大学等高校的顶尖数学教师组建了出题组。中科院院士、美国艺术与科学院院士、北京国际数学...

立即提问
相关内容推荐