在Ubuntu下装ns-3,编译时总是中途出错,具体如下:

Build failed
-> task failed (exit status 1):
{task 139621304904464: cxx print-introspected-doxygen.cc -> print-introspected-doxygen.cc.4.o}
['/usr/bin/g++', '-O0', '-ggdb', '-g3', '-Wall', '-Werror', '-Wno-error=deprecated-declarations', '-fstrict-aliasing', '-Wstrict-aliasing', '-pthread', '-pthread', '-fno-strict-aliasing', '-fwrapv', '-fdebug-prefix-map=/build/python2.7-3hk45v/python2.7-2.7.15~rc1=.', '-fstack-protector-strong', '-fno-strict-aliasing', '-Ibuild', '-I.', '-I.', '-I/home/zhangzq/tarballs/ns-allinone-3.13', '-I/usr/include/gtk-2.0', '-I/usr/lib/x86_64-linux-gnu/gtk-2.0/include', '-I/usr/include/gio-unix-2.0', '-I/usr/include/cairo', '-I/usr/include/pango-1.0', '-I/usr/include/atk-1.0', '-I/usr/include/pixman-1', '-I/usr/include/gdk-pixbuf-2.0', '-I/usr/include/libpng16', '-I/usr/include/harfbuzz', '-I/usr/include/glib-2.0', '-I/usr/lib/x86_64-linux-gnu/glib-2.0/include', '-I/usr/include/freetype2', '-I/usr/include/libxml2', '-I/usr/include/python2.7', '-I/usr/include/x86_64-linux-gnu/python2.7', '-DNS3_ASSERT_ENABLE', '-DNS3_LOG_ENABLE', '-DSQLITE3=1', '-DHAVE_IF_TUN_H=1', '-DPYTHONDIR="/usr/local/lib/python2.7/dist-packages"', '-DPYTHONARCHDIR="/usr/local/lib/python2.7/dist-packages"', '-DHAVE_PYTHON_H=1', '-DENABLE_GSL', '-DNDEBUG', '-D_FORTIFY_SOURCE=2', '../utils/print-introspected-doxygen.cc', '-c', '-o', 'utils/print-introspected-doxygen.cc.4.o']
Traceback (most recent call last):
File "./build.py", line 147, in
sys.exit(main(sys.argv))
File "./build.py", line 138, in main
build_ns3(config, build_examples, build_tests, args, build_options)
File "./build.py", line 61, in build_ns3
run_command([sys.executable, "waf", "build"] + build_options)
File "/home/zhangzq/tarballs/ns-allinone-3.13/util.py", line 24, in run_command
raise CommandError("Command %r exited with code %i" % (argv, retval))
util.CommandError: Command ['/usr/bin/python', 'waf', 'build'] exited with code 1

weixin_43136415
weixin_43136415 哥们,问题解决没,我也遇见一样的问题了。。。。
16 天之前 回复

1个回答

虚拟机内存不够,把内存调整大一些。

Csdn user default icon
上传中...
上传图片
插入图片
抄袭、复制答案,以达到刷声望分或其他目的的行为,在CSDN问答是严格禁止的,一经发现立刻封号。是时候展现真正的技术了!
其他相关推荐
NS3进行可视化编译时出错AttributeError: 'module' object has no attribute 'require_foreign'
在安装NS3后想通过可视化界面看示例编译出错 ``` @ubuntu:~/software/ns-allinone-3.29/ns-3.29$ ./waf --pyrun src/flow-monitor/examples/wifi-olsr-flowmon.py --vis Waf: Entering directory `/home/Alao8B/software/ns-allinone-3.29/ns-3.29/build' [2497/2757] Linking build/examples/tutorial/ns3.29-third-debug Waf: Leaving directory `/home/Alao8B/software/ns-allinone-3.29/ns-3.29/build' Build commands will be stored in build/compile_commands.json 'build' finished successfully (5.867s) Traceback (most recent call last): File "<string>", line 1, in <module> File "/home/XXX/software/ns-allinone-3.29/ns-3.29/src/visualizer/visualizer/__init__.py", line 2, in <module> from core import start, register_plugin, set_bounds, add_initialization_hook File "/home/XXX/software/ns-allinone-3.29/ns-3.29/src/visualizer/visualizer/core.py", line 41, in <module> gi.require_foreign("cairo") AttributeError: 'module' object has no attribute 'require_foreign' ``` 请问大家有没有遇到类似问题 谢谢
ubuntu无法apt-get, grub-pc出错
在ubuntu16.04系统下进行操作 ``` sudo apt-get install pyth-qt4on ``` 所有的apt-get均会报错, 报错如下: ``` Setting up grub-pc (2.02~beta2-36ubuntu3.20) ... dpkg: error processing package grub-pc (--configure): subprocess installed post-installation script returned error exit status 10 dpkg: dependency problems prevent configuration of grub-gfxpayload-lists: grub-gfxpayload-lists depends on grub-pc (>= 1.99~20101210-1ubuntu2); however: Package grub-pc is not configured yet. dpkg: error processing package grub-gfxpayload-lists (--configure): dependency problems - leaving unconfigured No apport report written because the error message indicates its a followup error from a previous failure. Errors were encountered while processing: grub-pc grub-gfxpayload-lists E: Sub-process /usr/bin/dpkg returned an error code (1 ) ``` 试了谷歌上面的各种方法均未解决,看看各位大佬有没有什么方法
交叉编译程序无法运行 arm-oe-linux-gnueabi-gcc: not found
Ubuntu交叉编译的应用程序在Qualcomm 9615 A5核的Linux系统下面无法运行, 出错信息如下 dinapp /usr/bin/dinapp: cd: line 1: can't cd to /home/nelson/qualcomm/Margaery/apps_pro c/oe-core/build/tmp-eglibc/work/armv7a-vfp-neon-oe-linux-gnueabi/dinstar-git-r1/ dinstar /usr/bin/dinapp: eval: line 1: arm-oe-linux-gnueabi-gcc: not foundn/usr/bin #
交叉编译应用程序无法运行 arm-oe-linux-gnueabi-gcc: not found
Ubuntu交叉编译的应用程序在Qualcomm 9615 A5核的Linux系统下面无法运行, 出错信息如下 /usr/bin/qmi_ping_clnt_test_0000: cd: line 1: can't cd to /home/qualcomm/nelson/ apps_proc/oe-core/build/tmp-eglibc/work/armv7a-vfp-neon-oe-linux-gnueabi/qmi-fra mework-git-r3/qmi-framework/qcci/test /usr/bin/qmi_ping_clnt_test_0000: eval: line 1: arm-oe-linux-gnueabi-gcc: not fo undn/usr/bin #
/etc/update-motd.d/80-esm:3 /etc/update-motd.d/80-esm: lsb_release: not found
ubuntu18.04 登录直接进入命令行,login输入正确之后 提示 /etc/update-motd.d/80-esm:3 /etc/update-motd.d/80-esm: lsb_release: not found ![图片说明](https://img-ask.csdn.net/upload/201908/01/1564639117_137618.jpg) _求路过的大神帮忙解决一下吧。没法玩Linux了都。__
ubuntu 编译vlc 源码时,make出错
最近在用ubuntu编译vlc源码,我用的ubuntu版本号:12.0.0,下载的vlc 是: vlc-2.2.4.tar.xz。 执行到./configure 结果如下: libvlc configuration -------------------- version : 2.2.4 system : linux architecture : i686 mmx sse sse2 optimizations : yes vlc aliases : cvlc rvlc qvlc svlc nvlc 然后执行sudo make 报以下错误 video_chroma/swscale.c:39:32: fatal error: libswscale/version.h: No such file or directory compilation terminated. make[4]: *** [video_chroma/libswscale_plugin_la-swscale.lo] Error 1 make[4]: Leaving directory `/home/farsight/vlc/vlc2.2.4/vlc-2.2.4/modules' make[3]: *** [all-recursive] Error 1 make[3]: Leaving directory `/home/farsight/vlc/vlc2.2.4/vlc-2.2.4/modules' make[2]: *** [all] Error 2 make[2]: Leaving directory `/home/farsight/vlc/vlc2.2.4/vlc-2.2.4/modules' make[1]: *** [all-recursive] Error 1 make[1]: Leaving directory `/home/farsight/vlc/vlc2.2.4/vlc-2.2.4' make: *** [all] Error 2 根据报错提示:安装所缺少的库,执行 :sudo apt-get install libversion-dev,显示结果如下 Reading package lists... Done Building dependency tree Reading state information... Done E: Unable to locate package libversion-dev 报错提示无法找到包,随后更新执行sudo apt-get update,错误仍然如下 Reading package lists... Done Building dependency tree Reading state information... Done E: Unable to locate package libversion-dev 请问各位大师,出现这种问题该如何解决?
Ubuntu安装Mysql启动出错
小弟刚刚接触Linux,想安装一个mysql,按照这个步骤尝试安装[http://jingyan.baidu.com/article/4f7d5712d5f8181a2019270e.html](http://jingyan.baidu.com/article/4f7d5712d5f8181a2019270e.html ""),结果最后服务启动不了。 输入systemctl status mysql.service命令查看的时候显示 mysql.service - MySQL Community Server Loaded: loaded (/lib/systemd/system/mysql.service; disabled; vendor preset: enabled) Active: deactivating (final-sigterm) (Result: exit-code) Process: 17564 ExecStart=/usr/sbin/mysqld --daemonize --pid-file=/var/run/mysqld/mysqld.pid (code=exited, status=1/FAILURE) CGroup: /system.slice/mysql.service └─17566 /usr/sbin/mysqld --daemonize --pid-file=/var/run/mysqld/my... Nov 20 06:51:35 ubuntu mysqld[17564]: 2016-11-20T14:51:35.520393Z 0 [Note] ...d. Nov 20 06:51:35 ubuntu mysqld[17564]: mysqld: Table 'mysql.plugin' doesn't exist Nov 20 06:51:35 ubuntu mysqld[17564]: 2016-11-20T14:51:35.520736Z 0 [ERROR]...t. Nov 20 06:51:35 ubuntu mysqld[17564]: 2016-11-20T14:51:35.521871Z 0 [Warnin...d. Nov 20 06:51:35 ubuntu mysqld[17564]: 2016-11-20T14:51:35.522009Z 0 [Warnin...ey Nov 20 06:51:35 ubuntu mysqld[17564]: 2016-11-20T14:51:35.523079Z 0 [Note] ...06 Nov 20 06:51:35 ubuntu mysqld[17564]: 2016-11-20T14:51:35.523154Z 0 [Note] ...e. Nov 20 06:51:35 ubuntu mysqld[17564]: 2016-11-20T14:51:35.523182Z 0 [Note] ...'; Nov 20 06:51:35 ubuntu mysqld[17564]: 2016-11-20T14:51:35.523352Z 0 [Note] ...'. Nov 20 06:51:35 ubuntu systemd[1]: mysql.service: Control process exited, c...=1 Hint: Some lines were ellipsized, use -l to show in full. 输入journalctl -xe命令显示 -- Subject: Unit mysql.service has finished shutting down -- Defined-By: systemd -- Support: http://lists.freedesktop.org/mailman/listinfo/systemd-devel -- -- Unit mysql.service has finished shutting down. Nov 20 07:10:32 ubuntu systemd[1]: Starting MySQL Community Server... -- Subject: Unit mysql.service has begun start-up -- Defined-By: systemd -- Support: http://lists.freedesktop.org/mailman/listinfo/systemd-devel -- -- Unit mysql.service has begun starting up. Nov 20 07:10:33 ubuntu mysqld[32270]: 2016-11-20T15:10:33.122479Z 0 [Warning] TI Nov 20 07:10:33 ubuntu mysqld[32270]: 2016-11-20T15:10:33.124201Z 0 [Note] /usr/ Nov 20 07:10:33 ubuntu mysqld[32270]: 2016-11-20T15:10:33.127834Z 0 [Note] InnoD Nov 20 07:10:33 ubuntu mysqld[32270]: 2016-11-20T15:10:33.127858Z 0 [Note] InnoD Nov 20 07:10:33 ubuntu mysqld[32270]: 2016-11-20T15:10:33.127864Z 0 [Note] InnoD Nov 20 07:10:33 ubuntu mysqld[32270]: 2016-11-20T15:10:33.127869Z 0 [Note] InnoD Nov 20 07:10:33 ubuntu mysqld[32270]: 2016-11-20T15:10:33.127874Z 0 [Note] InnoD Nov 20 07:10:33 ubuntu mysqld[32270]: 2016-11-20T15:10:33.127879Z 0 [Note] InnoD Nov 20 07:10:33 ubuntu mysqld[32270]: 2016-11-20T15:10:33.128131Z 0 [Note] InnoD Nov 20 07:10:33 ubuntu mysqld[32270]: 2016-11-20T15:10:33.128221Z 0 [Note] InnoD Nov 20 07:10:33 ubuntu mysqld[32270]: 2016-11-20T15:10:33.129445Z 0 [Note] InnoD Nov 20 07:10:33 ubuntu mysqld[32270]: 2016-11-20T15:10:33.139914Z 0 [Note] InnoD Nov 20 07:10:33 ubuntu mysqld[32270]: 2016-11-20T15:10:33.141532Z 0 [Note] InnoD 请各位大牛帮忙看看怎么回事,不胜感激!
关于在ubuntu下编译stm32工程的问题
在ubuntu16.4里面装了arm-none-eabi编译器 版本是最新的19年第四季度的 在cubemx生成了MDK5的工程 也生成了Makefile 在mdk下编译生成的hex文件有30K ubuntu下生成的hex文件要46K 想问下 这正常吗 ubuntu下要怎么减小hex文件体积呢 还有啊 在ubuntu下编译有啥好处a
新手求助--在ubuntu里面使用geany可以编译成功但是没法执行qaq(使用的语言是Python,截图如下)
跟着书开始学习python,配置什么的都是完全一样的步骤,但是在执行hello world的时候显示 ![图片说明](https://img-ask.csdn.net/upload/202002/06/1580982713_840545.png) 怀疑可能是生成指令设置出了什么问题但是在网上搜了很久还是没有找到解决办法,我的生成指令设置如下: ![图片说明](https://img-ask.csdn.net/upload/202002/06/1580982835_838845.png) 另程序可以编译就是不能执行,求大佬们指教!!!! 感激不尽!!
arm-linux-gcc编译报错:libc.so format not recognized.
小弟新手,之前没接触过arm开发,这两天做毕设碰到了难题,请大家帮忙看下, 先行谢过! 我的开发板是一个实验室网关(HBE-UBI-box2),用来收集传感器传来的信息的。将写好的C文件通过arm-linux-gcc编译器编译成cgi文件(编译命令:arm-linux-gcc -o info.cgi info.c)info.c是我写的文件。编译好了之后传到网关里面,然后访问网关就可以看到编程实现的结果了。 可是,前几天导师说网关不能同时支持大量的访问,要我把网关收集的传感器数据传到实验室的服务器上,然后写个网站来访问服务器上的数据。。。好吧,我也不敢反抗,默默的在服务器上建好了MySQL数据库,写了几个jsp来访问数据库,都弄好了。 可是把数据从网关传到服务器时确碰到难题了。我刚开始以为很简单,直接把之前 没有连接mysql数据库的代码加了这段代码: int connmysql(){ MYSQL mysql, *sock; mysql_init(&mysql); if (!(sock = mysql_real_connect(&mysql, "XXX", "XXX", "XXX", "XXX", 0, NULL, 0))) { printf("Cannot connect to database:%s\n",mysql_error(sock)); return 0; } char sqlbuf[200] = "INSERT INTO sensordata VALUES('0','sstatus.id','sstatus.illumi','sstatus.temp','sstatus.humid','sstatus.battery');"; if (mysql_query(sock, sqlbuf)) { printf("Query Failed:%s", mysql_error(sock)); return 0; } mysql_close(sock); return 0; } 其中那个连接数据库语句中的IP地址和用户名密码数据库名都是正确的,我用XXX代替了~。。。 代码也写好了,可是我在用arm-linux-gcc -o 编译的时候却报错了,百度了下,发现自己想的太简单了。按照别人的指导,在虚拟机Ubuntu上又装了mysql的客户机和服务器。 1. sudo apt-get install mysql-server 2. apt-get install mysql-client 3. sudo apt-get install libmysqlclient-dev 编译的命令也找了许多,大致就是要加上编译时用到的库的路径,最后采用的命令如下:arm-linux-gcc -I'/usr/include/mysql' -L'/usr/lib/i386-linux-gnu' -lmysqlclient -lpthread -lz -lm -lrt -ldl -o info.cgi mysql-info.c 这个时候噩梦开始了,一开始报了好多错,我只好一个个排查解决,其中辛酸暂且不表,但是最后还是有一个无法解决: ![图片说明](https://img-ask.csdn.net/upload/201506/03/1433335703_64402.png) 报的错说是:libc.so 的文件格式不被认可和解析错误。找了好久没找到适合arm编程的libc.so文件,只能上这求救了,各位大神如有解决办法,或者对于这个项目的思路有什么新的思路(即不用通过arm连接mysql也可以实现相同功能)烦请指点一二,感激不尽~
检查Nova服务时,nova-compute出现xxx怎么解决?求大神指点!菇凉在线等
root@ubuntu:~# nova-manage service list Binary Host Zone Status State Updated At nova-consoleauth ubuntu nova enabled :-) 2015-08-06 12:42:18 nova-scheduler ubuntu nova enabled :-) 2015-08-06 12:42:18 nova-compute ubuntu nova enabled XXX None nova-network ubuntu nova enabled :-) 2015-08-06 12:42:19
Ubuntu 16.04安装opencv 3.4.1出错
Ubuntu16.04安装opencv 3.4.1出错,请求大佬帮忙看下是啥问题,百度也找不出问题。log记录如下: Determining if the include file sys/videoio.h exists failed with the following output: Change Dir: /home/whitejiang/opencv-3.4.1/my_build_dir/CMakeFiles/CMakeTmp Run Build Command:"/usr/bin/make" "cmTC_f508d/fast" /usr/bin/make -f CMakeFiles/cmTC_f508d.dir/build.make CMakeFiles/cmTC_f508d.dir/build make[1]: Entering directory '/home/whitejiang/opencv-3.4.1/my_build_dir/CMakeFiles/CMakeTmp' Building C object CMakeFiles/cmTC_f508d.dir/CheckIncludeFile.c.o /usr/bin/cc -fsigned-char -W -Wall -Werror=return-type -Werror=non-virtual-dtor -Werror=address -Werror=sequence-point -Wformat -Werror=format-security -Wmissing-declarations -Wmissing-prototypes -Wstrict-prototypes -Wundef -Winit-self -Wpointer-arith -Wshadow -Wuninitialized -Winit-self -Wno-narrowing -Wno-comment -fdiagnostics-show-option -Wno-long-long -pthread -fomit-frame-pointer -ffunction-sections -fdata-sections -msse -msse2 -msse3 -fvisibility=hidden -O3 -DNDEBUG -fPIE -o CMakeFiles/cmTC_f508d.dir/CheckIncludeFile.c.o -c /home/whitejiang/opencv-3.4.1/my_build_dir/CMakeFiles/CMakeTmp/CheckIncludeFile.c /home/whitejiang/opencv-3.4.1/my_build_dir/CMakeFiles/CMakeTmp/CheckIncludeFile.c:1:25: fatal error: sys/videoio.h: 没有那个文件或目录 compilation terminated. CMakeFiles/cmTC_f508d.dir/build.make:65: recipe for target 'CMakeFiles/cmTC_f508d.dir/CheckIncludeFile.c.o' failed make[1]: *** [CMakeFiles/cmTC_f508d.dir/CheckIncludeFile.c.o] Error 1 make[1]: Leaving directory '/home/whitejiang/opencv-3.4.1/my_build_dir/CMakeFiles/CMakeTmp' Makefile:126: recipe for target 'cmTC_f508d/fast' failed make: *** [cmTC_f508d/fast] Error 2
Ubuntu编译内核时make menuconfig出错的问题
在编译内核时遇到了如下问题,小白想知道这要怎么解决呢 root@ubuntu:/usr/src/linux-2.6.32.60# make menuconfig HOSTCC scripts/basic/fixdep /usr/bin/ld: cannot find -lgcc_s collect2: error: ld returned 1 exit status scripts/Makefile.host:118: recipe for target 'scripts/basic/fixdep' failed make[1]: *** [scripts/basic/fixdep] Error 1 Makefile:381: recipe for target 'scripts_basic' failed make: *** [scripts_basic] Error 2
求助:Ubuntu16.04交叉编译Qt4.8.6出错
目标机器:银河麒麟/arm64,所用交叉编译器为:aarch64-linux-gnu-g++ ./configure -opensource -confirm-license -prefix /opt/arm_qt4.8.6 -xplatform qws/linux-aarch64-gnu-g++ -shared -no-qt3support -no-phonon -no-phonon-backend -qt-zlib -no-gif -no-libtiff -no-qvfb -qt-libjpeg -no-nis -no-opengl -no-cups -no-webkit -no-glib -no-dbus -no-rpath -no-mmx -no-3dnow -no-sse -no-sse2 -no-sse3 -no-ssse3 -no-sse4.1 -no-sse4.2 -no-avx -no-neon -no-audio-backend -no-svg -no-javascript-jit -no-script -no-scripttools -no-multimedia -no-openssl -nomake tools -nomake examples -nomake demos -DQT_ARCH_ARM _在mkspecs/qws/linux-aarch64-gnu-g++/中的qmake.conf也已经修改完毕。 在make时出错如下图: ![图片说明](https://img-ask.csdn.net/upload/201807/17/1531793511_417806.png)
求问ubuntu 13.10下ns3.8安装遇到python2.7-config意外停止
运行./build.py时,报错说“对不起,应用程序i386-linux-gnu-python2.7-config意外停止” 所以就build failed,遇见错误的地方如下: # Build NS-3 Entering directory `./ns-3.8' Note: configuring ns-3 without NSC => python waf configure --with-regression-traces ../ns-3.8-ref-traces --with-pybindgen ../pybindgen-0.14.1 Checking for program gcc or cc : /usr/bin/gcc Checking for program cpp : /usr/bin/cpp Checking for program ar : /usr/bin/ar Checking for program ranlib : /usr/bin/ranlib Checking for gcc : ok Checking for program g++ or c++ : /usr/bin/g++ Checking for program ar : /usr/bin/ar Checking for program ranlib : /usr/bin/ranlib Checking for g++ : ok Checking for program pkg-config : /usr/bin/pkg-config Checking for regression traces location : ok ../ns-3.8-ref-traces (given) Checking for -Wl,--soname=foo support : yes Checking for header stdlib.h : yes Checking for header signal.h : yes Checking for header pthread.h : yes Checking for high precision time implementation : 128-bit integer Checking for header stdint.h : yes Checking for header inttypes.h : yes Checking for header sys/inttypes.h : not found Checking for library rt : yes Checking for header netpacket/packet.h : yes Checking for header linux/if_tun.h : yes Checking for pkg-config flags for GTK_CONFIG_STORE : ok Checking for pkg-config flags for LIBXML2 : ok Checking for library sqlite3 : yes Checking for NSC location : not found Checking for header sys/socket.h : yes Checking for header netinet/in.h : yes Checking for program python : /usr/bin/python Checking for Python version >= 2.3 : ok 2.7.5 Checking for library python2.7 : yes Checking for program python2.7-config : /usr/bin/python2.7-config File "/usr/bin/python2.7-config", line 5 echo "Usage: $0 --prefix|--exec-prefix|--includes|--libs|--cflags|--ldflags|--extension-suffix|--help|--configdir" ^ SyntaxError: invalid syntax Traceback (most recent call last): File "waf", line 158, in <module> Scripting.prepare(t, cwd, VERSION, wafdir) File "/home/daisy/workspace/eclipseWorkspace/ns3.8/ns-3.8/.waf-1.5.16-e6d03192b5ddfa5ef2c8d65308e48e42/wafadmin/Scripting.py", line 105, in prepare prepare_impl(t,cwd,ver,wafdir)
用Ubuntu16.04编译iDT算法(c++)时报错:/usr/lib/gcc/x86_64-linux-gnu/5/../../../x86_64-linux-gnu/crt1.o: In function `_start':(.text+0x20): undefined reference to `main'
最近在学习iDT算法,刚刚接触Ubuntu也刚刚接触c++,很多东西不是很懂,请教各位: 我在编译iDT算法的时候,需要依赖opencv和ffmpeg两个库,我安装成功并且确保这两个库能用之后,去编译iDT算法,'make'之后报错: ![图片说明](https://img-ask.csdn.net/upload/202001/10/1578648835_846854.png) 查过资料,有的人说是缺少main函数,但是我确保.cpp文件里是有main函数的。 也有帖子说是crt1.o文件的问题,也有帖子说是动态库的问题,现在很迷茫,不知道问题出在哪里,希望各位能够帮助我,万分感谢。 同时为了方便各位帮我找到问题,我上一下我的makefile文件以及Opencv和ffmpeg的安装信息。 Makefile文件 ``` # set the binaries that have to be built TARGETS := DenseTrack Video # set the build configuration set BUILD := release #BUILD := debug # set bin and build dirs BUILDDIR := .build_$(BUILD) BINDIR := $(BUILD) # libraries LDLIBS = $(addprefix -l, $(LIBS) $(LIBS_$(notdir $*))) LIBS := \ opencv_core opencv_highgui opencv_video opencv_imgproc \ avformat avdevice avutil avcodec swscale # set some flags and compiler/linker specific commands CXXFLAGS = -pipe -D __STDC_CONSTANT_MACROS -D STD=std -Wall $(CXXFLAGS_$(BUILD)) -I. -I/opt/include CXXFLAGS_debug := -ggdb CXXFLAGS_release := -O3 -DNDEBUG -ggdb LDFLAGS = -L/opt/lib -pipe -Wall $(LDFLAGS_$(BUILD)) LDFLAGS_debug := -ggdb LDFLAGS_release := -O3 -ggdb include make/generic.mk ``` 下面是opencv和ffmpeg的安装信息: ffmpeg: ![图片说明](https://img-ask.csdn.net/upload/202001/10/1578649174_591798.png) opencv: ![图片说明](https://img-ask.csdn.net/upload/202001/10/1578649330_643110.png) 恳请各位帮忙!!(小弟没有金币,没办法给悬赏,还请各位见谅!)
docker虚拟机中,使用网上教程加速apt-get源镜像,更新sources.list文件后执行apt-get update命令报错:The following signatures couldn't be verified because the public key is not available
是在docker虚拟机中运行的命令 Err:1 http://mirrors.ustc.edu.cn/ubuntu xenial InRelease Connection failed [IP: 202.38.95.110 80] Get:2 http://mirrors.ustc.edu.cn/ubuntu xenial-security InRelease [109 kB] Err:2 http://mirrors.ustc.edu.cn/ubuntu xenial-security InRelease The following signatures couldn't be verified because the public key is not available: NO_PUBKEY xxx NO_PUBKEY zzz Get:3 http://mirrors.ustc.edu.cn/ubuntu xenial-updates InRelease [109 kB] Err:3 http://mirrors.ustc.edu.cn/ubuntu xenial-updates InRelease The following signatures couldn't be verified because the public key is not available: NO_PUBKEY xxx NO_PUBKEY zzz Get:4 http://mirrors.ustc.edu.cn/ubuntu xenial-proposed InRelease [260 kB] Err:4 http://mirrors.ustc.edu.cn/ubuntu xenial-proposed InRelease The following signatures couldn't be verified because the public key is not available: NO_PUBKEY xxx NO_PUBKEY zzz Get:5 http://mirrors.ustc.edu.cn/ubuntu xenial-backports InRelease [107 kB]
编译PX4时出现下面错误怎么办error: non-constant condition for static assertion
在Ubuntu16.04版本下,编译PX4时,总是出现下面的情况,不知道是什么原因,有哪位大神帮忙解答吗? u@ubuntu:~/src/Firmware$ make px4_fmu-v2_default -- PX4 config file: /home/hanlu/src/Firmware/boards/px4/fmu-v2/default.cmake -- PX4 config: px4_fmu-v2_default -- PX4 platform: nuttx -- PX4 lockstep: disabled -- PX4 version: v1.9.0-216-gbef7a9b -- cmake build type: MinSizeRel -- The CXX compiler identification is GNU 4.9.3 -- The C compiler identification is GNU 4.9.3 -- The ASM compiler identification is GNU -- Found assembler: /opt/gcc-arm-none-eabi-4_9-2015q3/bin/arm-none-eabi-gcc -- Check for working CXX compiler using: Ninja -- Check for working CXX compiler using: Ninja -- works -- Detecting CXX compiler ABI info -- Detecting CXX compiler ABI info - done -- Detecting CXX compile features -- Detecting CXX compile features - done -- Check for working C compiler using: Ninja -- Check for working C compiler using: Ninja -- works -- Detecting C compiler ABI info -- Detecting C compiler ABI info - done -- Detecting C compile features -- Detecting C compile features - done -- Found PythonInterp: /usr/bin/python (found version "2.7.12") -- Found PY_jinja2: /usr/local/lib/python2.7/dist-packages/Jinja2-2.7.3-py2.7.egg/jinja2 -- PX4 ECL: Very lightweight Estimation & Control Library v1.9.0-rc1-5-g54ac147 -- Building and including px4_io-v2_default -- ROMFS: px4fmu_common -- ROMFS: Adding rc.board_defaults -- ROMFS: Adding rc.board_sensors -- Configuring done -- Generating done -- Build files have been written to: /home/hanlu/src/Firmware/build/px4_fmu-v2_default [1/690] git submodule platforms/nuttx/NuttX/nuttx [4/690] git submodule platforms/nuttx/NuttX/apps [5/690] git submodule src/lib/ecl [10/690] git submodule src/drivers/gps/devices [16/690] git submodule mavlink/include/mavlink/v2.0 [24/690] Performing configure step for 'px4io_firmware' -- PX4 config file: /home/hanlu/src/Firmware/boards/px4/io-v2/default.cmake -- PX4 config: px4_io-v2_default -- PX4 platform: nuttx -- PX4 lockstep: disabled -- PX4 version: v1.9.0-216-gbef7a9b -- cmake build type: MinSizeRel -- The CXX compiler identification is GNU 4.9.3 -- The C compiler identification is GNU 4.9.3 -- The ASM compiler identification is GNU -- Found assembler: /opt/gcc-arm-none-eabi-4_9-2015q3/bin/arm-none-eabi-gcc -- Check for working CXX compiler using: Ninja -- Check for working CXX compiler using: Ninja -- works -- Detecting CXX compiler ABI info -- Detecting CXX compiler ABI info - done -- Detecting CXX compile features -- Detecting CXX compile features - done -- Check for working C compiler using: Ninja -- Check for working C compiler using: Ninja -- works -- Detecting C compiler ABI info -- Detecting C compiler ABI info - done -- Detecting C compile features -- Detecting C compile features - done -- Found PythonInterp: /usr/bin/python (found version "2.7.12") -- Found PY_jinja2: /usr/local/lib/python2.7/dist-packages/Jinja2-2.7.3-py2.7.egg/jinja2 -- PX4 ECL: Very lightweight Estimation & Control Library v1.9.0-rc1-5-g54ac147 -- Configuring done -- Generating done -- Build files have been written to: /home/hanlu/src/Firmware/build/px4_fmu-v2_default/external/Build/px4io_firmware [25/690] Performing build step for 'px4io_firmware' [1/200] git submodule platforms/nuttx/NuttX/nuttx [5/200] git submodule platforms/nuttx/NuttX/apps [39/200] Building CXX object src/platforms/common/CMakeFiles/px4_platform.dir/module.cpp.obj FAILED: /opt/gcc-arm-none-eabi-4_9-2015q3/bin/arm-none-eabi-g++ -DCONFIG_ARCH_BOARD_PX4_IO_V2 -D__CUSTOM_FILE_IO__ -D__DF_NUTTX -D__PX4_NUTTX -D__STDC_FORMAT_MACROS -isystem ../../../../../platforms/nuttx/NuttX/include/cxx -isystem NuttX/nuttx/include/cxx -isystem NuttX/nuttx/include -I../../../../../boards/px4/io-v2/src -I. -Isrc -Isrc/lib -Isrc/modules -I../../../../../src -I../../../../../src/include -I../../../../../src/lib -I../../../../../src/lib/DriverFramework/framework/include -I../../../../../src/lib/matrix -I../../../../../src/modules -I../../../../../src/platforms -I../../../../../src/platforms/common -INuttX/nuttx/arch/arm/src/armv7-m -INuttX/nuttx/arch/arm/src/chip -INuttX/nuttx/arch/arm/src/common -INuttX/apps/include -Iexternal/Install/include -mcpu=cortex-m3 -mthumb -Os -DNDEBUG -g -fdata-sections -ffunction-sections -fomit-frame-pointer -fno-signed-zeros -fno-trapping-math -freciprocal-math -fno-math-errno -fno-strict-aliasing -fvisibility=hidden -include visibility.h -Wall -Wextra -Werror -Warray-bounds -Wcast-align -Wdisabled-optimization -Wdouble-promotion -Wfatal-errors -Wfloat-equal -Wformat-security -Winit-self -Wlogical-op -Wpointer-arith -Wshadow -Wuninitialized -Wunknown-pragmas -Wunused-variable -Wno-implicit-fallthrough -Wno-missing-field-initializers -Wno-missing-include-dirs -Wno-unused-parameter -fdiagnostics-color=always -fno-builtin-printf -fno-strength-reduce -Wformat=1 -Wunused-but-set-variable -Wno-format-truncation -fcheck-new -fno-exceptions -fno-rtti -fno-threadsafe-statics -Wreorder -Wno-overloaded-virtual -D__STDC_VERSION__=199901L -nostdinc++ -std=gnu++11 -MMD -MT src/platforms/common/CMakeFiles/px4_platform.dir/module.cpp.obj -MF src/platforms/common/CMakeFiles/px4_platform.dir/module.cpp.obj.d -o src/platforms/common/CMakeFiles/px4_platform.dir/module.cpp.obj -c ../../../../../src/platforms/common/module.cpp In file included from ../../../../../src/platforms/px4_module.h:44:0, from ../../../../../src/platforms/common/module.cpp:43: ../../../../../src/platforms/px4_atomic.h: In instantiation of 'class px4::atomic<bool>': ../../../../../src/platforms/px4_module.h:421:42: required from here ../../../../../src/platforms/px4_atomic.h:72:2: error: non-constant condition for static assertion static_assert(__atomic_always_lock_free(sizeof(T), 0), "atomic is not lock-free for the given type T"); ^ compilation terminated due to -Wfatal-errors. [39/200] Building CXX object msg/CMakeFiles/uorb_msgs.dir/topics_sources/gps_inject_data.cpp.obj ninja: build stopped: subcommand failed. [108/690] Building CXX object msg/CMakeFiles/uorb_msgs.dir/topics_sources/rc_parameter_map.cpp.obj FAILED: cd /home/hanlu/src/Firmware/build/px4_fmu-v2_default/external/Build/px4io_firmware && /usr/bin/cmake --build . && /usr/bin/cmake -E touch /home/hanlu/src/Firmware/build/px4_fmu-v2_default/external/Stamp/px4io_firmware/px4io_firmware-build [108/690] Building CXX object msg/CMakeFiles/uorb_msgs.dir/topics_sources/rc_parameter_map.cpp.obj ninja: build stopped: subcommand failed. Makefile:193: recipe for target 'px4_fmu-v2_default' failed make: *** [px4_fmu-v2_default] Error 1
ubuntu 交叉编译vlc 源码时,make出错
ubuntu版本号:14.04.5 vlc源码:vlc2.2.4 在liunux上交叉编译vlc2.2.4源码,使得能够在windows上运行 $ export PKG_CONFIG_LIBDIR=$HOME/wcj/my/vlc/vlc2.2.4.3/vlc-2.2.4/contrib/i586-mingw32msvc/lib/pkgconfig $ sudo ../extras/package/win32/configure.sh --host=i586-mingw32msvc 出现以下错误 checking for DV1394... yes checking for DVDREAD... no configure: error: Library dvdread > 4.9.0 needed for dvdread was not found 重新执行 $ bash ../extras/package/win32/configure.sh --host=i586-mingw32msvc --disable-dvdread --disable-goom 结果如下 libvlc configuration -------------------- version : 2.2.4 system : mingw32 architecture : i586 mmx sse sse2 optimizations : yes vlc aliases : cvlc rvlc qvlc svlc nvlc To build vlc and its plugins, type `make', or `./compile' if you like nice colors. 接下来执行 & sudo make 时,出现以下错误 CC network/rootbind.lo CC network/tls.lo CC text/charset.lo CC text/strings.lo CC text/unicode.lo ../../extras/package/win32/../../../src/text/unicode.c: In function ‘vlc_towc’: ../../extras/package/win32/../../../src/text/unicode.c:125: warning: ‘cp’ may be used uninitialized in this function ../../extras/package/win32/../../../src/text/unicode.c: In function ‘IsUTF8’: ../../extras/package/win32/../../../src/text/unicode.c:125: warning: ‘cp’ may be used uninitialized in this function ../../extras/package/win32/../../../src/text/unicode.c:125: note: ‘cp’ was declared here ../../extras/package/win32/../../../src/text/unicode.c: In function ‘EnsureUTF8’: ../../extras/package/win32/../../../src/text/unicode.c:125: warning: ‘cp’ may be used uninitialized in this function ../../extras/package/win32/../../../src/text/unicode.c:125: note: ‘cp’ was declared here ../../extras/package/win32/../../../src/text/unicode.c: In function ‘vlc_strcasestr’: ../../extras/package/win32/../../../src/text/unicode.c:125: warning: ‘cp’ may be used uninitialized in this function ../../extras/package/win32/../../../src/text/unicode.c:125: note: ‘cp’ was declared here ../../extras/package/win32/../../../src/text/unicode.c:125: warning: ‘cp’ may be used uninitialized in this function ../../extras/package/win32/../../../src/text/unicode.c:125: note: ‘cp’ was declared here ../../extras/package/win32/../../../src/text/unicode.c:125: warning: ‘cp’ may be used uninitialized in this function ../../extras/package/win32/../../../src/text/unicode.c:125: note: ‘cp’ was declared here CC text/url.lo ../../extras/package/win32/../../../src/text/url.c:185:3: warning: #warning Drive letter-relative path not implemented! ../../extras/package/win32/../../../src/text/url.c: In function ‘vlc_path2uri’: ../../extras/package/win32/../../../src/text/url.c:188: error: ‘ENOTSUP’ undeclared (first use in this function) ../../extras/package/win32/../../../src/text/url.c:188: error: (Each undeclared identifier is reported only once ../../extras/package/win32/../../../src/text/url.c:188: error: for each function it appears in.) ../../extras/package/win32/../../../src/text/url.c:502:19: error: idna.h: No such file or directory ../../extras/package/win32/../../../src/text/url.c: In function ‘vlc_idna_to_ascii’: ../../extras/package/win32/../../../src/text/url.c:518: error: implicit declaration of function ‘idna_to_ascii_8z’ ../../extras/package/win32/../../../src/text/url.c:518: error: ‘IDNA_ALLOW_UNASSIGNED’ undeclared (first use in this function) ../../extras/package/win32/../../../src/text/url.c:518: error: ‘IDNA_SUCCESS’ undeclared (first use in this function) make[3]: *** [text/url.lo] Error 1 make[3]: Leaving directory `/home/wcj/my/vlc/vlc2.2.4.3/vlc-2.2.4/win32/src' make[2]: *** [all] Error 2 make[2]: Leaving directory `/home/wcj/my/vlc/vlc2.2.4.3/vlc-2.2.4/win32/src' make[1]: *** [all-recursive] Error 1 make[1]: Leaving directory `/home/wcj/my/vlc/vlc2.2.4.3/vlc-2.2.4/win32' make: *** [all] Error 2 请教各位大师,出现这种错误该如何解决?
终于明白阿里百度这样的大公司,为什么面试经常拿ThreadLocal考验求职者了
点击上面↑「爱开发」关注我们每晚10点,捕获技术思考和创业资源洞察什么是ThreadLocalThreadLocal是一个本地线程副本变量工具类,各个线程都拥有一份线程私...
《奇巧淫技》系列-python!!每天早上八点自动发送天气预报邮件到QQ邮箱
将代码部署服务器,每日早上定时获取到天气数据,并发送到邮箱。 也可以说是一个小人工智障。 思路可以运用在不同地方,主要介绍的是思路。
加快推动区块链技术和产业创新发展,2019可信区块链峰会在京召开
11月8日,由中国信息通信研究院、中国通信标准化协会、中国互联网协会、可信区块链推进计划联合主办,科技行者协办的2019可信区块链峰会将在北京悠唐皇冠假日酒店开幕。   区块链技术被认为是继蒸汽机、电力、互联网之后,下一代颠覆性的核心技术。如果说蒸汽机释放了人类的生产力,电力解决了人类基本的生活需求,互联网彻底改变了信息传递的方式,区块链作为构造信任的技术有重要的价值。   1...
阿里面试官问我:如何设计秒杀系统?我的回答让他比起大拇指
你知道的越多,你不知道的越多 点赞再看,养成习惯 GitHub上已经开源 https://github.com/JavaFamily 有一线大厂面试点脑图和个人联系方式,欢迎Star和指教 前言 Redis在互联网技术存储方面使用如此广泛,几乎所有的后端技术面试官都要在Redis的使用和原理方面对小伙伴们进行360°的刁难。 作为一个在互联网公司面一次拿一次Offer的面霸,打败了...
C语言魔塔游戏
很早就很想写这个,今天终于写完了。 游戏截图: 编译环境: VS2017 游戏需要一些图片,如果有想要的或者对游戏有什么看法的可以加我的QQ 2985486630 讨论,如果暂时没有回应,可以在博客下方留言,到时候我会看到。 下面我来介绍一下游戏的主要功能和实现方式 首先是玩家的定义,使用结构体,这个名字是可以自己改变的 struct gamerole { char n...
面试官问我:什么是消息队列?什么场景需要他?用了会出现什么问题?
你知道的越多,你不知道的越多 点赞再看,养成习惯 GitHub上已经开源 https://github.com/JavaFamily 有一线大厂面试点脑图、个人联系方式和人才交流群,欢迎Star和完善 前言 消息队列在互联网技术存储方面使用如此广泛,几乎所有的后端技术面试官都要在消息队列的使用和原理方面对小伙伴们进行360°的刁难。 作为一个在互联网公司面一次拿一次Offer的面霸...
Android性能优化(4):UI渲染机制以及优化
文章目录1. 渲染机制分析1.1 渲染机制1.2 卡顿现象1.3 内存抖动2. 渲染优化方式2.1 过度绘制优化2.1.1 Show GPU overdraw2.1.2 Profile GPU Rendering2.2 卡顿优化2.2.1 SysTrace2.2.2 TraceView 在从Android 6.0源码的角度剖析View的绘制原理一文中,我们了解到View的绘制流程有三个步骤,即m...
微服务中的Kafka与Micronaut
今天,我们将通过Apache Kafka主题构建一些彼此异步通信的微服务。我们使用Micronaut框架,它为与Kafka集成提供专门的库。让我们简要介绍一下示例系统的体系结构。我们有四个微型服务:订单服务,行程服务,司机服务和乘客服务。这些应用程序的实现非常简单。它们都有内存存储,并连接到同一个Kafka实例。 我们系统的主要目标是为客户安排行程。订单服务应用程序还充当网关。它接收来自客户的请求...
致 Python 初学者们!
作者| 许向武 责编 | 屠敏 出品 | CSDN 博客 前言 在 Python 进阶的过程中,相信很多同学应该大致上学习了很多 Python 的基础知识,也正在努力成长。在此期间,一定遇到了很多的困惑,对未来的学习方向感到迷茫。我非常理解你们所面临的处境。我从2007年开始接触 Python 这门编程语言,从2009年开始单一使用 Python 应对所有的开发工作,直至今...
究竟你适不适合买Mac?
我清晰的记得,刚买的macbook pro回到家,开机后第一件事情,就是上了淘宝网,花了500元钱,找了一个上门维修电脑的师傅,上门给我装了一个windows系统。。。。。。 表砍我。。。 当时买mac的初衷,只是想要个固态硬盘的笔记本,用来运行一些复杂的扑克软件。而看了当时所有的SSD笔记本后,最终决定,还是买个好(xiong)看(da)的。 已经有好几个朋友问我mba怎么样了,所以今天尽量客观...
程序员一般通过什么途径接私活?
二哥,你好,我想知道一般程序猿都如何接私活,我也想接,能告诉我一些方法吗? 上面是一个读者“烦不烦”问我的一个问题。其实不止是“烦不烦”,还有很多读者问过我类似这样的问题。 我接的私活不算多,挣到的钱也没有多少,加起来不到 20W。说实话,这个数目说出来我是有点心虚的,毕竟太少了,大家轻喷。但我想,恰好配得上“一般程序员”这个称号啊。毕竟苍蝇再小也是肉,我也算是有经验的人了。 唾弃接私活、做外...
字节跳动面试官这样问消息队列:分布式事务、重复消费、顺序消费,我整理了一下
你知道的越多,你不知道的越多 点赞再看,养成习惯 GitHub上已经开源 https://github.com/JavaFamily 有一线大厂面试点脑图、个人联系方式和人才交流群,欢迎Star和完善 前言 消息队列在互联网技术存储方面使用如此广泛,几乎所有的后端技术面试官都要在消息队列的使用和原理方面对小伙伴们进行360°的刁难。 作为一个在互联网公司面一次拿一次Offer的面霸...
Python爬虫爬取淘宝,京东商品信息
小编是一个理科生,不善长说一些废话。简单介绍下原理然后直接上代码。 使用的工具(Python+pycharm2019.3+selenium+xpath+chromedriver)其中要使用pycharm也可以私聊我selenium是一个框架可以通过pip下载 pip installselenium -ihttps://pypi.tuna.tsinghua.edu.cn/simple/ ...
阿里程序员写了一个新手都写不出的低级bug,被骂惨了。
这种新手都不会范的错,居然被一个工作好几年的小伙子写出来,差点被当场开除了。
Java工作4年来应聘要16K最后没要,细节如下。。。
前奏: 今天2B哥和大家分享一位前几天面试的一位应聘者,工作4年26岁,统招本科。 以下就是他的简历和面试情况。 基本情况: 专业技能: 1、&nbsp;熟悉Sping了解SpringMVC、SpringBoot、Mybatis等框架、了解SpringCloud微服务 2、&nbsp;熟悉常用项目管理工具:SVN、GIT、MAVEN、Jenkins 3、&nbsp;熟悉Nginx、tomca...
SpringBoot2.x系列教程(三十六)SpringBoot之Tomcat配置
Spring Boot默认内嵌的Tomcat为Servlet容器,关于Tomcat的所有属性都在ServerProperties配置类中。同时,也可以实现一些接口来自定义内嵌Servlet容器和内嵌Tomcat等的配置。 关于此配置,网络上有大量的资料,但都是基于SpringBoot1.5.x版本,并不适合当前最新版本。本文将带大家了解一下最新版本的使用。 ServerProperties的部分源...
Python绘图,圣诞树,花,爱心 | Turtle篇
每周每日,分享Python实战代码,入门资料,进阶资料,基础语法,爬虫,数据分析,web网站,机器学习,深度学习等等。 公众号回复【进群】沟通交流吧,QQ扫码进群学习吧 微信群 QQ群 1.画圣诞树 import turtle screen = turtle.Screen() screen.setup(800,600) circle = turtle.Turtle()...
作为一个程序员,CPU的这些硬核知识你必须会!
CPU对每个程序员来说,是个既熟悉又陌生的东西? 如果你只知道CPU是中央处理器的话,那可能对你并没有什么用,那么作为程序员的我们,必须要搞懂的就是CPU这家伙是如何运行的,尤其要搞懂它里面的寄存器是怎么一回事,因为这将让你从底层明白程序的运行机制。 随我一起,来好好认识下CPU这货吧 把CPU掰开来看 对于CPU来说,我们首先就要搞明白它是怎么回事,也就是它的内部构造,当然,CPU那么牛的一个东...
破14亿,Python分析我国存在哪些人口危机!
一、背景 二、爬取数据 三、数据分析 1、总人口 2、男女人口比例 3、人口城镇化 4、人口增长率 5、人口老化(抚养比) 6、各省人口 7、世界人口 四、遇到的问题 遇到的问题 1、数据分页,需要获取从1949-2018年数据,观察到有近20年参数:LAST20,由此推测获取近70年的参数可设置为:LAST70 2、2019年数据没有放上去,可以手动添加上去 3、将数据进行 行列转换 4、列名...
听说想当黑客的都玩过这个Monyer游戏(1~14攻略)
第零关 进入传送门开始第0关(游戏链接) 请点击链接进入第1关: 连接在左边→ ←连接在右边 看不到啊。。。。(只能看到一堆大佬做完的留名,也能看到菜鸡的我,在后面~~) 直接fn+f12吧 &lt;span&gt;连接在左边→&lt;/span&gt; &lt;a href="first.php"&gt;&lt;/a&gt; &lt;span&gt;←连接在右边&lt;/span&gt; o...
在家远程办公效率低?那你一定要收好这个「在家办公」神器!
相信大家都已经收到国务院延长春节假期的消息,接下来,在家远程办公可能将会持续一段时间。 但是问题来了。远程办公不是人在电脑前就当坐班了,相反,对于沟通效率,文件协作,以及信息安全都有着极高的要求。有着非常多的挑战,比如: 1在异地互相不见面的会议上,如何提高沟通效率? 2文件之间的来往反馈如何做到及时性?如何保证信息安全? 3如何规划安排每天工作,以及如何进行成果验收? ...... ...
作为一个程序员,内存和磁盘的这些事情,你不得不知道啊!!!
截止目前,我已经分享了如下几篇文章: 一个程序在计算机中是如何运行的?超级干货!!! 作为一个程序员,CPU的这些硬核知识你必须会! 作为一个程序员,内存的这些硬核知识你必须懂! 这些知识可以说是我们之前都不太重视的基础知识,可能大家在上大学的时候都学习过了,但是嘞,当时由于老师讲解的没那么有趣,又加上这些知识本身就比较枯燥,所以嘞,大家当初几乎等于没学。 再说啦,学习这些,也看不出来有什么用啊!...
这个世界上人真的分三六九等,你信吗?
偶然间,在知乎上看到一个问题 一时间,勾起了我深深的回忆。 以前在厂里打过两次工,做过家教,干过辅导班,做过中介。零下几度的晚上,贴过广告,满脸、满手地长冻疮。 再回首那段岁月,虽然苦,但让我学会了坚持和忍耐。让我明白了,在这个世界上,无论环境多么的恶劣,只要心存希望,星星之火,亦可燎原。 下文是原回答,希望能对你能有所启发。 如果我说,这个世界上人真的分三六九等,...
2020年全新Java学习路线图,含配套视频,学完即为中级Java程序员!!
新的一年来临,突如其来的疫情打破了平静的生活! 在家的你是否很无聊,如果无聊就来学习吧! 世上只有一种投资只赚不赔,那就是学习!!! 传智播客于2020年升级了Java学习线路图,硬核升级,免费放送! 学完你就是中级程序员,能更快一步找到工作! 一、Java基础 JavaSE基础是Java中级程序员的起点,是帮助你从小白到懂得编程的必经之路。 在Java基础板块中有6个子模块的学...
B 站上有哪些很好的学习资源?
哇说起B站,在小九眼里就是宝藏般的存在,放年假宅在家时一天刷6、7个小时不在话下,更别提今年的跨年晚会,我简直是跪着看完的!! 最早大家聚在在B站是为了追番,再后来我在上面刷欧美新歌和漂亮小姐姐的舞蹈视频,最近两年我和周围的朋友们已经把B站当作学习教室了,而且学习成本还免费,真是个励志的好平台ヽ(.◕ฺˇд ˇ◕ฺ;)ノ 下面我们就来盘点一下B站上优质的学习资源: 综合类 Oeasy: 综合...
爬取薅羊毛网站百度云资源
这是疫情期间无聊做的爬虫, 去获取暂时用不上的教程 import threading import time import pandas as pd import requests import re from threading import Thread, Lock # import urllib.request as request # req=urllib.request.Requ...
如何优雅地打印一个Java对象?
你好呀,我是沉默王二,一个和黄家驹一样身高,和刘德华一样颜值的程序员。虽然已经写了十多年的 Java 代码,但仍然觉得自己是个菜鸟(请允许我惭愧一下)。 在一个月黑风高的夜晚,我思前想后,觉得再也不能这么蹉跎下去了。于是痛下决心,准备通过输出的方式倒逼输入,以此来修炼自己的内功,从而进阶成为一名真正意义上的大神。与此同时,希望这些文章能够帮助到更多的读者,让大家在学习的路上不再寂寞、空虚和冷。 ...
雷火神山直播超两亿,Web播放器事件监听是怎么实现的?
Web播放器解决了在手机浏览器和PC浏览器上播放音视频数据的问题,让视音频内容可以不依赖用户安装App,就能进行播放以及在社交平台进行传播。在视频业务大数据平台中,播放数据的统计分析非常重要,所以Web播放器在使用过程中,需要对其内部的数据进行收集并上报至服务端,此时,就需要对发生在其内部的一些播放行为进行事件监听。 那么Web播放器事件监听是怎么实现的呢? 01 监听事件明细表 名...
3万字总结,Mysql优化之精髓
本文知识点较多,篇幅较长,请耐心学习 MySQL已经成为时下关系型数据库产品的中坚力量,备受互联网大厂的青睐,出门面试想进BAT,想拿高工资,不会点MySQL优化知识,拿offer的成功率会大大下降。 为什么要优化 系统的吞吐量瓶颈往往出现在数据库的访问速度上 随着应用程序的运行,数据库的中的数据会越来越多,处理时间会相应变慢 数据是存放在磁盘上的,读写速度无法和内存相比 如何优化 设计...
HTML5适合的情人节礼物有纪念日期功能
前言 利用HTML5,css,js实现爱心树 以及 纪念日期的功能 网页有播放音乐功能 以及打字倾诉感情的画面,非常适合情人节送给女朋友 具体的HTML代码 具体只要修改代码里面的男某某和女某某 文字段也可自行修改,还有代码下半部分的JS代码需要修改一下起始日期 注意月份为0~11月 也就是月份需要减一。 当然只有一部分HTML和JS代码不够运行的,文章最下面还附加了完整代码的下载地址 &lt;!...
相关热词 c# 数组类型 泛型约束 c#的赛狗日程序 c# 传递数组 可变参数 c# 生成存储过程 c# list 补集 c#获得所有窗体 c# 当前秒数转成年月日 c#中的枚举 c# 计算校验和 连续随机数不重复c#
立即提问