[Error] expected ')' before ';' token这个错误一直消不掉,第一次提问,没有悬赏真抱歉了,谢谢大哥们了

#include
struct student
{
char name[];
float course[5];
}stu[20];

void average(struct student p)
{
float aver=0;
int i,j;
for(i=0;i<20;i++)
{for(j=0;j<=4;j++)
{aver+=((
(p+i)).course[j])/5.0;}
printf("%10s:average is %5f\n",((*(p+i)).name,aver);
}
}

void each_average(struct student p)
{
int i,j;
float aver=0;
for(j=0;j<=4;j++)
{for(i=0;i<20;i++)
{aver+=((
(p+i)).course[j])/20.0;}
printf("%f ",aver);
}

}

void max_min(struct student p)
{
int i,j,k,t;
for(k=0;k<=4;k++)
{for(i=0;i<20;i++)
{for(j=i+1;j<20;j++)
if(((
(p+i)).course[k])>((*(p+j)).course[k]))
{t=((*(p+i)).course[k]);
((*(p+i)).course[k])=((*(p+j)).course[k]);
((*(p+j)).course[k])=t;
}
}
printf("max=%f,min=%f\n",(*(p+19)).course[k],(*p).course[k]);
}

}

void unpass_student(struct student *p)
{
int i,k;图片说明

for(k=0;k<=4;k++)
{
for(i=0;i<20;i++)
{
if((*(p+i)).course[k]<60.0)
printf("%s ",(*(p+i)).name);
}
}
}

int main()
{
int i;
struct student *p;
p=stu;
float max,min;
printf("输入学生名字,用回车隔开");
for(i=0;i<20;i++)
scanf("%s",student[i].name);
printf("输入学生各科成绩,用逗号隔开");
for(i=0;i<20;i++)
scanf("%f,%f,%f,%f,%f",stu[i].course[0],stu[i].course[1],stu[i].course[2],stu[i].course[3],stu[i].course[4]);
for(i=0;i<20;i++)
printf("%10s:%5f,%5f,%5f,%5f,%5f",stu.name[i],stu[i].course[0],stu[i].course[1],stu[i].course[2],stu[i].course[3],stu[i].course[4]);

average(p);
each_average(p);
max_min(p);
unpass_student(p);
return 0;
}

1个回答

char name[];
这里没有指定长度,改写成
char name[20];

Csdn user default icon
上传中...
上传图片
插入图片
抄袭、复制答案,以达到刷声望分或其他目的的行为,在CSDN问答是严格禁止的,一经发现立刻封号。是时候展现真正的技术了!
其他相关推荐
Web工程中js文件一直报Errors‘Syntax error on token“{”,throw expected before this token’
1、Maven创建的JavaWeb工程,页面引入了js文件,js文件中存放的是一串json格式数据。 2、一直报类似Syntax error on token“{”,throw expected before this token’的错误 。外层大括号处都有报错。 3、代码如 //统计数据 { 'cell':[ {'id': 1, 'coms': 'psm.sno'}, {'id': 2, 'psm': 'crm.cno'} ] } 4、网上查资料有说是编码问题,一侧是UTF-8、GBK,ANSI等编码,报错一样。 请问是否有这块精通一些的朋友指导一下,谢谢!
Dev C++嵌入__asm { } 报错
我就加了一个检测是否为虚拟机的函数,像每次加多行汇编老是报错,求解 **[Error]** expected '(' before '{' token **[Error]** 'push' was not declared in this scope **[Error]** expected ')' before numeric constant **[Error]** expected type-specifier before numeric constant **[Error]** expected '{' before numeric constant **[Error]** expected ';' before ')' token ``` BOOL IsInsideVMWare() { bool rc = true; try { __asm { push edx push ecx push ebx mov eax, 'VMXh' mov ebx, 0 // any value but not the MAGIC VALUE mov ecx, 10 // get VMWare version mov edx, 'VX' // port number in eax, dx // read port // on return EAX returns the VERSION cmp ebx, 'VMXh' // is it a reply from VMWare? setz [rc] // set return value pop ebx pop ecx pop edx } }catch(EXCEPTION_EXECUTE_HANDLER) { rc = false; } return rc; } /* from https://www.codeproject.com/Articles/9823/Detect-if-your-program-is-running-inside-a-Virtual */ ```
|error: expected type-specifier before '(' token|
初学者的问题,在看视频的时候老师是可以运行的,但我用vs和codeblock都不能运行,代码我是照着打下来的,应该没错,那么这个是编译器问题还是我真的打错了....#include<iostream> using namespace std; #include"string" #include<vector> #include<list> #include"set" #include<algorithm> #include"functional" //函数对象 template<typename T> class show { public: void operator(T &t) { cout << t << " "; } private: }; void main() { cout << "hello wordl" << endl; system("pause"); return 0; }
77: error: expected unqualified-id before '^' token
#define TO_SIGNED(x) ((signed)(x)) class BigInteger{ protected: unsigned* array; BigInteger(unsigned*const theArray){ array = theArray; } inline unsigned* getArray(){ if(this == BigIntegerNull) #ifdef _EXCEPTION_H_ throw NullPointerException(); #else return NullArray; #endif return array; } BigInteger expand(unsigned newSize, bool extendSign){ if(getArray() == NullArray){ BigInteger n(NullArray); return n; } if(newSize <= array[0]) return *(new BigInteger(*this)); BigInteger nbi(new unsigned[newSize+1]); register unsigned i; for(i = 0; i <= array[0]; i++) nbi.array[i] = array[i]; if(extendSign && TO_SIGNED(array[array[0]]) < 0){ for(; i <= newSize; i++) nbi.array[i] = -1; }else{ for(; i <= newSize; i++) nbi.array[i] = 0; } return nbi; } public: static BigInteger*const BigIntegerNull; static unsigned*const NullArray; BigInteger(const BigInteger& origin){ #ifdef _EXCEPTION_H_ if(origin.getArray() == NullArray) throw NullPointerException(); #endif register unsigned size = origin.array[0]+1; array = new unsigned[size]; do{ --size; array[size] = origin.array[size]; }while(size > 0); } BigInteger _xor(BigInteger bi, bool extendSign){ if(getArray() == NullArray || bi.getArray() == NullArray){ BigInteger n(NullArray); return n; } register unsigned i; if(array[0] <= bi.array[0]){ for(i = array[0]; i > 0; i--) array[i] &= bi.array[i]; }else{ for(i = 1; i <= bi.array[0]; i++){ array[i] ^= bi.array[i]; } if(extendSign && TO_SIGNED(bi.array[bi.array[0]]) < 0){ for(; i <= array[0]; i++){ array[i] = -1; // or -1 } } } return *this; } BigInteger xor(BigInteger bi, bool extendSign){ // 编译器指示错误的行 BigInteger n(NullArray); if(getArray() == NullArray || bi.getArray() == NullArray){ return n; } register unsigned i; if(array[0] <= bi.array[0]){ n = this->expand(bi.array[0], extendSign); for(i = array[0]; i > 0; i--){ n.array[i] ^= bi.array[i]; } if(extendSign && TO_SIGNED(bi.array[bi.array[0]]) < 0){ for(; i <= bi.array[0]; i++){ n.array[i] = ~bi.array[i]; // xor -1 } }else{ for(; i <= bi.array[0]; i++){ n.array[i] = bi.array[i]; // xor 0 } } }else{ n = *(new BigInteger(*this)); for(i = 1; i <= bi.array[0]; i++){ n.array[i] ^= bi.array[i]; } if(extendSign && TO_SIGNED(bi.array[bi.array[0]]) < 0){ for(; i <= array[0]; i++){ n.array[i] = ~array[i]; // xor -1 } } } return n; } }; BigInteger*const BigInteger::BigIntegerNull = reinterpret_cast<BigInteger*>(0); unsigned*const BigInteger::NullArray = reinterpret_cast<unsigned*>(0);
请问:error: expected primary-expression before '[' token 该怎么解决?
程序及错误如图:![图片说明](https://img-ask.csdn.net/upload/201904/26/1556271507_407252.png)
为什么会报这个错误?(详情请点击进入查看)
# 我今天在打代码时,发现了这个问题。 ![图片说明](https://img-ask.csdn.net/upload/201910/26/1572081526_167672.png) 不知道为什么这里不能够运行,还报错说 [Error] expected primary-expression before '==' token [错误]标记“==”之前需要主表达式 ## 这是什么意思啊? 难道说我这个string不能用在if中吗? (另外,这是一个利用随机数猜硬币朝向的程序,想知道我这个代码哪里错了) ## 求大佬解答!!
数据结构一元多项式相乘问题
这两个错误是什么问题,求告知 [Error] a function-definition is not allowed here before '{' token [Error] expected '}' at end of input
vs2010错误机器人足球
最近在学习机器人足球 用的是vs2010运行代码 老是出现错误 3> ------ Building libbhuman (Release) ------ 3> bhuman.cpp 1> Enum.cpp 1> Global.cpp 1> Geometry.cpp 1> Pose2D.cpp 1> OutStreams.cpp 3> ..\..\Src\libbhuman\bhuman.cpp(14) :28: warning: alcore\altypes.h: No such file or directory 3> ..\..\Src\libbhuman\bhuman.cpp(15) :28: warning: alcore\alerror.h: No such file or directory 3> ..\..\Src\libbhuman\bhuman.cpp(16) :31: warning: alcommon\albroker.h: No such file or directory 3> ..\..\Src\libbhuman\bhuman.cpp(17) :30: warning: alcommon\alproxy.h: No such file or directory 3> ..\..\Src\libbhuman\bhuman.cpp(18) :32: warning: alproxies\dcmproxy.h: No such file or directory 3> ..\..\Src\libbhuman\bhuman.cpp(19) :37: warning: alproxies\almemoryproxy.h: No such file or directory 3>..\..\Src\libbhuman\bhuman.cpp(29): error : 'AL' has not been declared 3>..\..\Src\libbhuman\bhuman.cpp(29): error : expected constructor, destructor, or type conversion before '*' token 3>..\..\Src\libbhuman\bhuman.cpp(30): error : 'AL' has not been declared 3>..\..\Src\libbhuman\bhuman.cpp(30): error : expected constructor, destructor, or type conversion before '*' token 3>..\..\Src\libbhuman\bhuman.cpp(31): error : 'AL' has not been declared 3>..\..\Src\libbhuman\bhuman.cpp(31): error : expected constructor, destructor, or type conversion before '*' token 3>..\..\Src\libbhuman\bhuman.cpp(32): error : 'AL' has not been declared 3>..\..\Src\libbhuman\bhuman.cpp(32): error : expected constructor, destructor, or type conversion before '*' token 3>..\..\Src\libbhuman\bhuman.cpp(33): error : 'AL' has not been declared 3>..\..\Src\libbhuman\bhuman.cpp(33): error : expected constructor, destructor, or type conversion before '*' token 3>..\..\Src\libbhuman\bhuman.cpp(34): error : 'AL' has not been declared 3>..\..\Src\libbhuman\bhuman.cpp(34): error : expected constructor, destructor, or type conversion before '*' token 3> ..\..\Src\libbhuman\bhuman.cpp: In function 'void sitDown(float, float*)': 3>..\..\Src\libbhuman\bhuman.cpp(424): error : 'positionRequest' was not declared in this scope 3>..\..\Src\libbhuman\bhuman.cpp(425): error : 'hardnessRequest' was not declared in this scope 3> ..\..\Src\libbhuman\bhuman.cpp: In function 'void standUp(float, float*, float*)': 3>..\..\Src\libbhuman\bhuman.cpp(455): error : 'positionRequest' was not declared in this scope 3> ..\..\Src\libbhuman\bhuman.cpp: In function 'void onPreProcess()': 3>..\..\Src\libbhuman\bhuman.cpp(475): error : 'proxy' was not declared in this scope 3>..\..\Src\libbhuman\bhuman.cpp(475): error : 'positionRequest' was not declared in this scope 3>..\..\Src\libbhuman\bhuman.cpp(475): error : 'hardnessRequest' was not declared in this scope 3>..\..\Src\libbhuman\bhuman.cpp(486): error : 'stderr' was not declared in this scope 3>..\..\Src\libbhuman\bhuman.cpp(486): error : 'fprintf' was not declared in this scope 3>..\..\Src\libbhuman\bhuman.cpp(563): error : 'usRequest' was not declared in this scope 3>..\..\Src\libbhuman\bhuman.cpp(575): error : 'ledRequest' was not declared in this scope 3>..\..\Src\libbhuman\bhuman.cpp(575): error : 'string' is not a member of 'std' 3>..\..\Src\libbhuman\bhuman.cpp(582): error : expected type-specifier before 'AL' 3>..\..\Src\libbhuman\bhuman.cpp(582): error : expected `)' before '::' token 3>..\..\Src\libbhuman\bhuman.cpp(582): error : expected `{' before '::' token 3>..\..\Src\libbhuman\bhuman.cpp(582): error : '::ALError' has not been declared 3>..\..\Src\libbhuman\bhuman.cpp(582): error : 'e' was not declared in this scope 3>..\..\Src\libbhuman\bhuman.cpp(582): error : expected `;' before ')' token 3> ..\..\Src\libbhuman\bhuman.cpp: In function 'void onPostProcess()': 3>..\..\Src\libbhuman\bhuman.cpp(591): error : 'memory' was not declared in this scope 3>..\..\Src\libbhuman\bhuman.cpp(591): error : 'proxy' was not declared in this scope 3>..\..\Src\libbhuman\bhuman.cpp(601): error : 'assert' was not declared in this scope 3>..\..\Src\libbhuman\bhuman.cpp(616): error : 'system' was not declared in this scope 3>..\..\Src\libbhuman\bhuman.cpp(618): error : 'system' was not declared in this scope 3>..\..\Src\libbhuman\bhuman.cpp(622): error : expected type-specifier before 'AL' 3>..\..\Src\libbhuman\bhuman.cpp(622): error : expected `)' before '::' token 3>..\..\Src\libbhuman\bhuman.cpp(622): error : expected `{' before '::' token 3>..\..\Src\libbhuman\bhuman.cpp(622): error : '::ALError' has not been declared 3>..\..\Src\libbhuman\bhuman.cpp(622): error : 'e' was not declared in this scope 3>..\..\Src\libbhuman\bhuman.cpp(622): error : expected `;' before ')' token 3>..\..\Src\libbhuman\bhuman.cpp(641): error : 'stderr' was not declared in this scope 3>..\..\Src\libbhuman\bhuman.cpp(641): error : 'fprintf' was not declared in this scope 3> ..\..\Src\libbhuman\bhuman.cpp: In function 'void close()': 3>..\..\Src\libbhuman\bhuman.cpp(650): error : 'stderr' was not declared in this scope 3>..\..\Src\libbhuman\bhuman.cpp(650): error : 'fprintf' was not declared in this scope 3>..\..\Src\libbhuman\bhuman.cpp(648): error : too many arguments to function 'void close()' 3>..\..\Src\libbhuman\bhuman.cpp(662): error : at this point in file 3>..\..\Src\libbhuman\bhuman.cpp(674): error : 'proxy' was not declared in this scope 3>..\..\Src\libbhuman\bhuman.cpp(676): error : type '<type error>' argument given to 'delete', expected pointer 3>..\..\Src\libbhuman\bhuman.cpp(679): error : 'positionRequest' was not declared in this scope 3>..\..\Src\libbhuman\bhuman.cpp(681): error : type '<type error>' argument given to 'delete', expected pointer 3>..\..\Src\libbhuman\bhuman.cpp(684): error : 'hardnessRequest' was not declared in this scope 3>..\..\Src\libbhuman\bhuman.cpp(686): error : type '<type error>' argument given to 'delete', expected pointer 3>..\..\Src\libbhuman\bhuman.cpp(689): error : 'usRequest' was not declared in this scope 3>..\..\Src\libbhuman\bhuman.cpp(691): error : type '<type error>' argument given to 'delete', expected pointer 3>..\..\Src\libbhuman\bhuman.cpp(694): error : 'ledRequest' was not declared in this scope 3>..\..\Src\libbhuman\bhuman.cpp(696): error : type '<type error>' argument given to 'delete', expected pointer 3>..\..\Src\libbhuman\bhuman.cpp(699): error : 'memory' was not declared in this scope 3>..\..\Src\libbhuman\bhuman.cpp(701): error : type '<type error>' argument given to 'delete', expected pointer 3> ..\..\Src\libbhuman\bhuman.cpp: At global scope: 3>..\..\Src\libbhuman\bhuman.cpp(708): error : 'AL' has not been declared 3>..\..\Src\libbhuman\bhuman.cpp(708): error : 'AL' has not been declared 3>..\..\Src\libbhuman\bhuman.cpp(708): error : 'pBroker' was not declared in this scope 3>..\..\Src\libbhuman\bhuman.cpp(709): error : expected ',' or ';' before '{' token 3> make: *** [../../Build/libbhuman/Linux/Release/bhuman.o] Error 1 3>C:\Program Files\MSBuild\Microsoft.Cpp\v4.0\Microsoft.MakeFile.Targets(43,5): error MSB3073: 命令“bash -c "../../Util/zbuildgen/Win32/bin/zbuildgen.exe ../Linux/libbhuman.make.zbuild && make -f ../Linux/libbhuman.make clean CONFIG=Release SHELLOPTS=igncr && make -j 2 -f ../Linux/libbhuman.make CONFIG=Release SHELLOPTS=igncr"”已退出,代码为 2。 3> 3>生成失败。
Qt include<Python.h> 报错
Qt里面只是加了一个头文件 #include <Python.h> 程序就报错了, D:\Python34-x86\include\object.h:435: error: expected unqualified-id before ';' token PyType_Slot *slots; /* terminated by slot==0. */ ^ 点击错误发现出错的位置是我Python的安装目录下include/object.h ![图片说明](https://img-ask.csdn.net/upload/201607/29/1469781997_28091.png) 这个问题是要怎么处理啊,各位给点建议
新手求教改语法错误C?
不太清楚语法哪里错了? ``` #include <stdio.h> #include <string.h> int n = 1000000; int mark[1000001]; int N, M; int c, i; scanf("%d,%d", &N,&M); int main() { int c; memset(mark, 0, sizeof(mark)); mark[0] = 1; mark[1] = 1; for (c = 2; c * c <= n; c++) { if (mark[c] != 1) /*是待筛选的数*/ { for (i = M; i <= n / c; M++) { mark[c * i] = 1; } } } if (mark[c] != 1) { printf("%d\n", c); } return 0; } ``` Line 8: error: expected declaration specifiers or '...' before string constant Line 8: error: expected declaration specifiers or '...' before '&' token Line 8: error: expected declaration specifiers or '...' before '&' token Line 8: warning: data definition has no type or storage class Line 8: error: conflicting types for 'scanf'
C++代码有什么问题啊 求解答
![图片说明](https://img-ask.csdn.net/upload/201507/28/1438086348_293066.jpg) 为什么编译器提示 Line3: error: expected unqualified-id before ';' token
在GCC上的C语言编程错误问题
#include <stdio.h> #include <stdlib.h> #include <malloc.h> struct LinkList { int data; struct LinkList *next; }; struct LinkList Reverse ( LinkList *list ) **出错** { LNode *tmp = NULL; LNode *p = NULL; if (list == NULL) { return NULL; } tmp = list->next; while (tmp->next != NULL) { p = tmp->next; tmp->next = p->next; p->next = list->next; list->next = p; } return list; } int main( ) { int i=0; int b; struct LinkList *L; struct LinkList *p; struct LinkList *q; p=L->next; while (b!= -1) { while( scanf("%d\n",&b)&&(b>0) ) { p->data=b; p=p->next; i++; } } struct LinkList Reverse ( LinkList *L ); **出错** q=L->next; while(i>=0) { printf("%d\n",q->data); i--; } return 0; } 为什么会提示 Main.c:31: error: expected ‘)’ before ‘*’ token Main.c: In function ‘main’: Main.c:68: error: expected ‘)’ before ‘*’ token
关于uboot,arm-linux-gcc编译.c文件
各位大神求教我 arm-linux-gcc cmd_hello.c -o cmd_hello.o总是提示这个错误,我已经把有可能的安装包都给补上了还是不行 root@yukin-virtual-machine:/CBT-SuperIOT/SRC/u-boot4cbt210-2011.06# arm-linux-gcc cmd_hello.c -o cmd_hello.o cmd_hello.c:13: error: expected ')' before '*' token cmd_hello.c:21: error: expected ')' before numeric constant 这个是我的.c文件的代码,帮我看看好不 #include <common.h> #include <watchdog.h> #include <command.h> #include <image.h> #include <malloc.h> #include <u-bootzlib.h> #include <bzlib.h> #include <environment.h> #include <lmb.h> #include <linuxctype.h> #include <asmbyteorder.h> U_BOOT_CMD(hello,CONFIG_SYS_MAXARGS,1,do_hello,"usage info", "help info"); int do_hello (cmd_tbl_t *cmdtp, int flag, int argc, char * const argv[]) { printf("hello world\n"); return 0; }
C++中的这个问题怎么解决
#include<iostream> int main() { int base, exponent; std::cout << "Please enter the base and the exponent :" << std::endl; std::cin >> base >> exponent; long result = 1; if (base == 0 && exponent == 0) { result = 0; std::cout << "the " << exponent << " power of " << base << " is " << result; } else if (base == 0 && exponent != 0) { result = 0; std::cout << "the " << exponent << " power of " << base << " is " << result; } else if (base != 0 && exponent == 0) { result = 1; std::cout << "the " << exponent << " power of " << base << " is " << result; } else {} if ( exponent < 0) std::cout << " Exponent can't be smaller than 0." << std::endl; else { for (int i = 1; i <= exponent; i++) result = result * base; std::cout << "the " << exponent << " power of " << base << " is " << result; std::cout << std::endl; } } return 0; } 这是怎么回事,为什么会出现这种情况? [Error] expected unqualified-id before 'return' [Error] expected declaration before '}' token
C语言错误,大神们,求解!
error: expected declaration specifiers or '...' before '*' token| ``` #include <stdio.h> #include <stdlib.h> void format(char *a,*b,*c) { char *p=a,*q=b; int i=0; ```
安装淘宝 TFS出现一些异常能帮忙看下吗谢谢
就是最后一个步骤 进入 tfs 目录 [root@locatfs local]# cd tfs/ [root@locatfs local]# chmod +x *.sh [root@locatfs local]# ./build.sh init [root@locatfs local]# ./configure --prefix=/usr/local/tfs --without-tcmalloc 到这里都没问题 接下来 运行 make 的时候就出现问题了 Making all in src make[1]: Entering directory `/root/tfs-2.6.0/src' Making all in common make[2]: Entering directory `/root/tfs-2.6.0/src/common' Making all in mysql_cluster make[3]: Entering directory `/root/tfs-2.6.0/src/common/mysql_cluster' if g++ -DPACKAGE_NAME=\"tfs\" -DPACKAGE_TARNAME=\"tfs\" -DPACKAGE_VERSION=\"2.6.0\" -DPACKAGE_STRING=\"tfs\ 2.6.0\" -DPACKAGE_BUGREPORT=\"duolong@taobao.com\" -DPACKAGE_URL=\"\" -DPACKAGE=\"tfs\" -DVERSION=\"2.6.0\" -DSTDC_HEADERS=1 -DHAVE_SYS_TYPES_H=1 -DHAVE_SYS_STAT_H=1 -DHAVE_STDLIB_H=1 -DHAVE_STRING_H=1 -DHAVE_MEMORY_H=1 -DHAVE_STRINGS_H=1 -DHAVE_INTTYPES_H=1 -DHAVE_STDINT_H=1 -DHAVE_UNISTD_H=1 -DHAVE_DLFCN_H=1 -DHAVE_LIBC=1 -DHAVE_LIBDL=1 -DHAVE_LIBM=1 -DHAVE_LIBPTHREAD=1 -DHAVE_LIBRT=1 -DHAVE_READLINE_READLINE_H=1 -DHAVE_READLINE_HISTORY_H=1 -DTFS_DS_FALLOCATE=0 -DHAVE_DIRENT_H=1 -DSTDC_HEADERS=1 -DHAVE_ARPA_INET_H=1 -DHAVE_FCNTL_H=1 -DHAVE_INTTYPES_H=1 -DHAVE_LIMITS_H=1 -DHAVE_NETDB_H=1 -DHAVE_NETINET_IN_H=1 -DHAVE_STDINT_H=1 -DHAVE_STDLIB_H=1 -DHAVE_STRING_H=1 -DHAVE_SYS_IOCTL_H=1 -DHAVE_SYS_SOCKET_H=1 -DHAVE_SYS_TIME_H=1 -DHAVE_SYS_VFS_H=1 -DHAVE_UNISTD_H=1 -DHAVE__BOOL=1 -DHAVE_STDBOOL_H=1 -DTIME_WITH_SYS_TIME=1 -DLSTAT_FOLLOWS_SLASHED_SYMLINK=1 -DLSTAT_FOLLOWS_SLASHED_SYMLINK=1 -DHAVE_STDLIB_H=1 -DHAVE_MALLOC=1 -DHAVE_STDLIB_H=1 -DHAVE_UNISTD_H=1 -DHAVE_SYS_PARAM_H=1 -DHAVE_GETPAGESIZE=1 -DHAVE_MMAP=1 -DHAVE_STDLIB_H=1 -DHAVE_REALLOC=1 -DRETSIGTYPE=void -DHAVE_FDATASYNC=1 -DHAVE_FTRUNCATE=1 -DHAVE_GETHOSTBYNAME=1 -DHAVE_GETPAGESIZE=1 -DHAVE_GETTIMEOFDAY=1 -DHAVE_MEMSET=1 -DHAVE_MKDIR=1 -DHAVE_MUNMAP=1 -DHAVE_RMDIR=1 -DHAVE_SOCKET=1 -DHAVE_STRCASECMP=1 -DHAVE_STRCHR=1 -DHAVE_STRDUP=1 -DHAVE_STRERROR=1 -DHAVE_STRSTR=1 -DHAVE_STRTOUL=1 -DHAVE_STRTOULL=1 -DHAVE_TZSET=1 -DHAVE_MYSQL=1 -I. -I. -Wall -I../../../src -I/usr/local/include/tbsys -I/usr/local/include/tbnet -I/usr/include/mysql -g -pipe -Wp,-D_FORTIFY_SOURCE=2 -fexceptions -fstack-protector --param=ssp-buffer-size=4 -m32 -fasynchronous-unwind-tables -D_GNU_SOURCE -D_FILE_OFFSET_BITS=64 -D_LARGEFILE_SOURCE -fno-strict-aliasing -fwrapv -fPIC -fPIC -g -static-libgcc -fno-omit-frame-pointer -fno-strict-aliasing -DMY_PTHREAD_FASTMUTEX=1 -g -D__STDC_LIMIT_MACROS -Wall -Werror -Wextra -Wunused-parameter -Wformat -Wconversion -Wdeprecated -MT database_pool.o -MD -MP -MF ".deps/database_pool.Tpo" -c -o database_pool.o database_pool.cpp; \ then mv -f ".deps/database_pool.Tpo" ".deps/database_pool.Po"; else rm -f ".deps/database_pool.Tpo"; exit 1; fi In file included from database_pool.cpp:16: database_pool.h:18:19: error: tbsys.h: No such file or directory database_pool.h:19:19: error: Mutex.h: No such file or directory In file included from database_pool.h:20, from database_pool.cpp:16: ../../../src/common/internal.h:34:19: error: tbnet.h: No such file or directory In file included from database_pool.cpp:20: mysql_database_helper.h:18:19: error: mysql.h: No such file or directory ../../../src/common/internal.h:471: error: ‘tbnet’ has not been declared ../../../src/common/internal.h:471: error: ISO C++ forbids declaration of ‘DataBuffer’ with no type ../../../src/common/internal.h:471: error: expected ‘;’ before ‘data_’ ../../../src/common/internal.h: In member function ‘void tfs::common::TimeStat::start()’: ../../../src/common/internal.h:1211: error: ‘tbsys’ has not been declared ../../../src/common/internal.h: In member function ‘void tfs::common::TimeStat::end()’: ../../../src/common/internal.h:1212: error: ‘tbsys’ has not been declared database_pool.h: At global scope: database_pool.h:51: error: ‘tbutil’ has not been declared database_pool.h:51: error: ISO C++ forbids declaration of ‘Mutex’ with no type database_pool.h:51: error: expected ‘;’ before ‘mutex_’ mysql_database_helper.h:54: error: ISO C++ forbids declaration of ‘MYSQL_STMT’ with no type mysql_database_helper.h:54: error: expected ‘;’ before ‘*’ token mysql_database_helper.h:55: error: ‘MYSQL_BIND’ does not name a type mysql_database_helper.h:65: error: ‘MYSQL’ does not name a type mysql_database_helper.h:71: error: ‘MYSQL_STMT’ has not been declared mysql_database_helper.h:81: error: ‘tbutil’ has not been declared mysql_database_helper.h:81: error: ISO C++ forbids declaration of ‘Mutex’ with no type mysql_database_helper.h:81: error: expected ‘;’ before ‘mutex_’ database_pool.cpp: In destructor ‘tfs::common::DataBasePool::~DataBasePool()’: database_pool.cpp:36: error: ‘ERROR’ was not declared in this scope database_pool.cpp:36: error: ‘TBSYS_LOG’ was not declared in this scope database_pool.cpp: In member function ‘bool tfs::common::DataBasePool::init_pool(int32_t, const char*, const char*, const char*)’: database_pool.cpp:65: error: ‘DEBUG’ was not declared in this scope database_pool.cpp:66: error: ‘TBSYS_LOG’ was not declared in this scope database_pool.cpp: In member function ‘bool tfs::common::DataBasePool::destroy_pool()’: database_pool.cpp:90: error: ‘mysql_thread_end’ was not declared in this scope database_pool.cpp: In member function ‘tfs::common::MysqlDatabaseHelper* tfs::common::DataBasePool::get()’: database_pool.cpp:98: error: ‘ERROR’ was not declared in this scope database_pool.cpp:98: error: ‘TBSYS_LOG’ was not declared in this scope database_pool.cpp:105: error: ‘tbutil’ has not been declared database_pool.cpp:105: error: expected `;' before ‘lock’ database_pool.cpp:123: error: ‘WARN’ was not declared in this scope database_pool.cpp:123: error: ‘TBSYS_LOG’ was not declared in this scope database_pool.cpp: In member function ‘void tfs::common::DataBasePool::release(tfs::common::MysqlDatabaseHelper*)’: database_pool.cpp:132: error: ‘tbutil’ has not been declared database_pool.cpp:132: error: expected `;' before ‘lock’ database_pool.cpp:143: error: ‘ERROR’ was not declared in this scope database_pool.cpp:143: error: ‘TBSYS_LOG’ was not declared in this scope make[3]: *** [database_pool.o] Error 1 make[3]: Leaving directory `/root/tfs-2.6.0/src/common/mysql_cluster' make[2]: *** [all-recursive] Error 1 make[2]: Leaving directory `/root/tfs-2.6.0/src/common' make[1]: *** [all-recursive] Error 1 make[1]: Leaving directory `/root/tfs-2.6.0/src' make: *** [all-recursive] Error 1 接下来就都是报错 能帮忙看下吗谢谢
qt 在main外面定义变量时出错
这是main里面的一段,编译的时候总是显示 error: expected initializer before '*' token Game* game; 请各位帮忙看看 #include <QApplication> #include "game.h" Game* game; int main(int argc, char *argv[]) { QApplication a(argc, argv); game=new Game(); game->show(); return a.exec(); }
关于编译Android源码的问题.
最近在编译android源码的时候遇到了下面这个错误提示.请问如何解决啊. 编译环境:Ubuntu9.04,JDK 1.5, [color=red]external/opencore/android/android_surface_output.cpp:1183: error: a function-definition is not allowed here before '{' token external/opencore/android/android_surface_output.cpp:1255: error: expected '}' at end of input make: *** [out/target/product/generic/obj/STATIC_LIBRARIES/libandroidpv_intermediates/android_surface_output.o] Error 1[/color] ps,这个cpp文件我看过了,没有任何问题~
qt在编译c++11 的<"thread">头文件时报错
qt在编译c++11 的<"thread">头文件时报错: 1. d:\Qt\Qt5.6.2\Tools\mingw492_32\i686-w64-mingw32\include\c++\thread:235: error: expected primary-expression before '<<' token return __out << "thread::id of a non-executing thread"; 2.d:\Qt\Qt5.6.2\Tools\mingw492_32\i686-w64-mingw32\include\c++\thread:237: error: expected primary-expression before '<<' token return __out << __id._M_thread; 只包括头文件也会报错 qmake 已添加: QMAKE_CXXFLAGS += -std=c++11 QMAKE_LFLAGS += -Wl,--no-as-needed LIBS += -lpthread
对计算机专业来说学历真的重要吗?
我本科学校是渣渣二本,研究生学校是985,现在毕业五年,校招笔试、面试,社招面试参加了两年了,就我个人的经历来说下这个问题。 这篇文章很长,但绝对是精华,相信我,读完以后,你会知道学历不好的解决方案,记得帮我点赞哦。 先说结论,无论赞不赞同,它本质就是这样:对于技术类工作而言,学历五年以内非常重要,但有办法弥补。五年以后,不重要。 目录: 张雪峰讲述的事实 我看到的事实 为什么会这样 ...
Java学习的正确打开方式
在博主认为,对于入门级学习java的最佳学习方法莫过于视频+博客+书籍+总结,前三者博主将淋漓尽致地挥毫于这篇博客文章中,至于总结在于个人,实际上越到后面你会发现学习的最好方式就是阅读参考官方文档其次就是国内的书籍,博客次之,这又是一个层次了,这里暂时不提后面再谈。博主将为各位入门java保驾护航,各位只管冲鸭!!!上天是公平的,只要不辜负时间,时间自然不会辜负你。 何谓学习?博主所理解的学习,它是一个过程,是一个不断累积、不断沉淀、不断总结、善于传达自己的个人见解以及乐于分享的过程。
程序员必须掌握的核心算法有哪些?
由于我之前一直强调数据结构以及算法学习的重要性,所以就有一些读者经常问我,数据结构与算法应该要学习到哪个程度呢?,说实话,这个问题我不知道要怎么回答你,主要取决于你想学习到哪些程度,不过针对这个问题,我稍微总结一下我学过的算法知识点,以及我觉得值得学习的算法。这些算法与数据结构的学习大多数是零散的,并没有一本把他们全部覆盖的书籍。下面是我觉得值得学习的一些算法以及数据结构,当然,我也会整理一些看过...
大学四年自学走来,这些私藏的实用工具/学习网站我贡献出来了
大学四年,看课本是不可能一直看课本的了,对于学习,特别是自学,善于搜索网上的一些资源来辅助,还是非常有必要的,下面我就把这几年私藏的各种资源,网站贡献出来给你们。主要有:电子书搜索、实用工具、在线视频学习网站、非视频学习网站、软件下载、面试/求职必备网站。 注意:文中提到的所有资源,文末我都给你整理好了,你们只管拿去,如果觉得不错,转发、分享就是最大的支持了。 一、电子书搜索 对于大部分程序员...
小白学 Python 爬虫(25):爬取股票信息
人生苦短,我用 Python 前文传送门: 小白学 Python 爬虫(1):开篇 小白学 Python 爬虫(2):前置准备(一)基本类库的安装 小白学 Python 爬虫(3):前置准备(二)Linux基础入门 小白学 Python 爬虫(4):前置准备(三)Docker基础入门 小白学 Python 爬虫(5):前置准备(四)数据库基础 小白学 Python 爬虫(6):前置准备(...
小知识:浅谈二维码的生成和识别原理
目录 前言 条形码 静态二维码 二进制生成图形码 二维码的定位 前言 不知不觉中,我们的生活到处充满了二维码。登录账户需要二维码;加好友需要二维码;共享单车需要二维码;商品包装上也有二维码;甚至连楼下卖水果的阿姨手里都拿张二维码收款。那么,有没有想过这个二维码到底是什么东西呢?那么这个二维码的图案会不会多到不小心重合了呢? 条形码 在二维码出现之前,大行其道的...
[享学Jackson] 一、初识Jackson -- 世界上最好的JSON库
Jackson是一个简单的、功能强大的、基于Java的**应用库**。它可以很方便完成**Java对象**和**json对象(xml文档or其它格式)**进行互转。Jackson社区相对比较活跃,更新速度也比较快。Jackson库有如下几大特性: - 高性能,稳定:低内存占用,对大/小JSON串,大/小对象的解析表现均很优秀 - 流行度高:是很多流行框架的默认实现 - 容易使用:提供高层次的API,极大简化了日常使用 - 无需自己手动创建映射:内置了绝大部分序列化时和Java类型的映射关系 - 干净的JSO
卸载 x 雷某度!GitHub 标星 1.5w+,从此我只用这款全能高速下载工具!
作者 | Rocky0429 来源 | Python空间 大家好,我是 Rocky0429,一个喜欢在网上收集各种资源的蒟蒻… 网上资源眼花缭乱,下载的方式也同样千奇百怪,比如 BT 下载,磁力链接,网盘资源等等等等,下个资源可真不容易,不一样的方式要用不同的下载软件,因此某比较有名的 x 雷和某度网盘成了我经常使用的工具。 作为一个没有钱的穷鬼,某度网盘几十 kb 的下载速度让我...
世界上最牛的网络设备,价格低廉,其貌不扬......
夜深人静,电视和电脑都已经关机休息,但是我还在默默工作,我安静地趴在你家中的某个地方,7*24小时不眠不休,任劳任怨,目的只有一个,能让你舒服地躺在床上,畅快地刷手机!没错,这就是我,...
《面试宝典》2019年springmvc面试高频题(java)
前言 2019即将过去,伴随我们即将迎来的又是新的一年,过完春节,马上又要迎来新的金三银四面试季。那么,作为程序猿的你,是否真的有所准备的呢,亦或是安于本职工作,继续做好手头上的事情。 当然,不论选择如何,假如你真的准备在之后的金三银四跳槽的话,那么作为一个Java工程师,就不可不看了。如何在几个月的时间里,快速的为即将到来的面试进行充分的准备呢? 1、什么是Spring MVC ?简单...
一名大专同学的四个问题
【前言】   收到一封来信,赶上各种事情拖了几日,利用今天要放下工作的时机,做个回复。   2020年到了,就以这一封信,作为开年标志吧。 【正文】   您好,我是一名现在有很多困惑的大二学生。有一些问题想要向您请教。   先说一下我的基本情况,高考失利,不想复读,来到广州一所大专读计算机应用技术专业。学校是偏艺术类的,计算机专业没有实验室更不用说工作室了。而且学校的学风也不好。但我很想在计算机领...
复习一周,京东+百度一面,不小心都拿了Offer
京东和百度一面都问了啥,面试官百般刁难,可惜我全会。
轻松搭建基于 SpringBoot + Vue 的 Web 商城应用
首先介绍下在本文出现的几个比较重要的概念: 函数计算(Function Compute): 函数计算是一个事件驱动的服务,通过函数计算,用户无需管理服务器等运行情况,只需编写代码并上传。函数计算准备计算资源,并以弹性伸缩的方式运行用户代码,而用户只需根据实际代码运行所消耗的资源进行付费。Fun: Fun 是一个用于支持 Serverless 应用部署的工具,能帮助您便捷地管理函数计算、API ...
Python+OpenCV实时图像处理
目录 1、导入库文件 2、设计GUI 3、调用摄像头 4、实时图像处理 4.1、阈值二值化 4.2、边缘检测 4.3、轮廓检测 4.4、高斯滤波 4.5、色彩转换 4.6、调节对比度 5、退出系统 初学OpenCV图像处理的小伙伴肯定对什么高斯函数、滤波处理、阈值二值化等特性非常头疼,这里给各位分享一个小项目,可通过摄像头实时动态查看各类图像处理的特点,也可对各位调参、测试...
2020年一线城市程序员工资大调查
人才需求 一线城市共发布岗位38115个,招聘120827人。 其中 beijing 22805 guangzhou 25081 shanghai 39614 shenzhen 33327 工资分布 2020年中国一线城市程序员的平均工资为16285元,工资中位数为14583元,其中95%的人的工资位于5000到20000元之间。 和往年数据比较: yea...
为什么猝死的都是程序员,基本上不见产品经理猝死呢?
相信大家时不时听到程序员猝死的消息,但是基本上听不到产品经理猝死的消息,这是为什么呢? 我们先百度搜一下:程序员猝死,出现将近700多万条搜索结果: 搜索一下:产品经理猝死,只有400万条的搜索结果,从搜索结果数量上来看,程序员猝死的搜索结果就比产品经理猝死的搜索结果高了一倍,而且从下图可以看到,首页里面的五条搜索结果,其实只有两条才是符合条件。 所以程序员猝死的概率真的比产品经理大,并不是错...
害怕面试被问HashMap?这一篇就搞定了!
声明:本文以jdk1.8为主! 搞定HashMap 作为一个Java从业者,面试的时候肯定会被问到过HashMap,因为对于HashMap来说,可以说是Java集合中的精髓了,如果你觉得自己对它掌握的还不够好,我想今天这篇文章会非常适合你,至少,看了今天这篇文章,以后不怕面试被问HashMap了 其实在我学习HashMap的过程中,我个人觉得HashMap还是挺复杂的,如果真的想把它搞得明明白...
毕业5年,我问遍了身边的大佬,总结了他们的学习方法
我问了身边10个大佬,总结了他们的学习方法,原来成功都是有迹可循的。
推荐10个堪称神器的学习网站
每天都会收到很多读者的私信,问我:“二哥,有什么推荐的学习网站吗?最近很浮躁,手头的一些网站都看烦了,想看看二哥这里有什么新鲜货。” 今天一早做了个恶梦,梦到被老板辞退了。虽然说在我们公司,只有我辞退老板的份,没有老板辞退我这一说,但是还是被吓得 4 点多都起来了。(主要是因为我掌握着公司所有的核心源码,哈哈哈) 既然 4 点多起来,就得好好利用起来。于是我就挑选了 10 个堪称神器的学习网站,推...
这些软件太强了,Windows必装!尤其程序员!
Windows可谓是大多数人的生产力工具,集娱乐办公于一体,虽然在程序员这个群体中都说苹果是信仰,但是大部分不都是从Windows过来的,而且现在依然有很多的程序员用Windows。 所以,今天我就把我私藏的Windows必装的软件分享给大家,如果有一个你没有用过甚至没有听过,那你就赚了????,这可都是提升你幸福感的高效率生产力工具哦! 走起!???? NO、1 ScreenToGif 屏幕,摄像头和白板...
阿里面试一个ArrayList我都能跟面试官扯半小时
我是真的没想到,面试官会这样问我ArrayList。
曾经优秀的人,怎么就突然不优秀了。
职场上有很多辛酸事,很多合伙人出局的故事,很多技术骨干被裁员的故事。说来模板都类似,曾经是名校毕业,曾经是优秀员工,曾经被领导表扬,曾经业绩突出,然而突然有一天,因为种种原因,被裁员了,...
大学四年因为知道了这32个网站,我成了别人眼中的大神!
依稀记得,毕业那天,我们导员发给我毕业证的时候对我说“你可是咱们系的风云人物啊”,哎呀,别提当时多开心啦????,嗯,我们导员是所有导员中最帅的一个,真的???? 不过,导员说的是实话,很多人都叫我大神的,为啥,因为我知道这32个网站啊,你说强不强????,这次是绝对的干货,看好啦,走起来! PS:每个网站都是学计算机混互联网必须知道的,真的牛杯,我就不过多介绍了,大家自行探索,觉得没用的,尽管留言吐槽吧???? 社...
2020年1月中国编程语言排行榜,python是2019增长最快编程语言
编程语言比例 排名 编程语言 最低工资 工资中位数 最低工资 最高工资 人头 人头百分比 1 rust 20713 17500 5042 46250 480 0.14% 2 typescript 18503 22500 6000 30000 1821 0.52% 3 lua 18150 17500 5250 35000 2956 0.84% 4 go 17989 16...
看完这篇HTTP,跟面试官扯皮就没问题了
我是一名程序员,我的主要编程语言是 Java,我更是一名 Web 开发人员,所以我必须要了解 HTTP,所以本篇文章就来带你从 HTTP 入门到进阶,看完让你有一种恍然大悟、醍醐灌顶的感觉。 最初在有网络之前,我们的电脑都是单机的,单机系统是孤立的,我还记得 05 年前那会儿家里有个电脑,想打电脑游戏还得两个人在一个电脑上玩儿,及其不方便。我就想为什么家里人不让上网,我的同学 xxx 家里有网,每...
史上最全的IDEA快捷键总结
现在Idea成了主流开发工具,这篇博客对其使用的快捷键做了总结,希望对大家的开发工作有所帮助。
阿里程序员写了一个新手都写不出的低级bug,被骂惨了。
这种新手都不会范的错,居然被一个工作好几年的小伙子写出来,差点被当场开除了。
谁是华为扫地僧?
是的,华为也有扫地僧!2020年2月11-12日,“养在深闺人不知”的华为2012实验室扫地僧们,将在华为开发者大会2020(Cloud)上,和大家见面。到时,你可以和扫地僧们,吃一个洋...
Idea 中最常用的10款插件(提高开发效率),一定要学会使用!
学习使用一些插件,可以提高开发效率。对于我们开发人员很有帮助。这篇博客介绍了开发中使用的插件。
AI 没让人类失业,搞 AI 的人先失业了
最近和几个 AI 领域的大佬闲聊 根据他们讲的消息和段子 改编出下面这个故事 如有雷同 都是巧合 1. 老王创业失败,被限制高消费 “这里写我跑路的消息实在太夸张了。” 王葱葱哼笑一下,把消息分享给群里。 阿杰也看了消息,笑了笑。在座几位也都笑了。 王葱葱是个有名的人物,21岁那年以全额奖学金进入 KMU 攻读人工智能博士,累计发表论文 40 余篇,个人技术博客更是成为深度学习领域内风向标。 ...
立即提问