求大神告知:如何在 visual studio code中编译运行C/C++代码? 10C

求大神告知:如何在 visual studio code中编译运行C/C++代码,如需配置环境,怎么配置?求详细操作,拜谢!

7个回答

guo8985966
流浪的蝈蝈 大哥,看不懂啊,全英文,而且我也找不到 tasks.json这个脚本文件。难道要自己创建?有没有具体的操作过程?拜谢!
4 年多之前 回复

http://www.cnblogs.com/lkpp/p/vscode-cpp.html
我博客上有详细的记载

单文件 使用 code run 插件 或者 参考楼上链接~
多文件参考项目下载:https://github.com/KimAlittleStar/vscode_c_demo
多文件参考博客:https://blog.csdn.net/qq_39575645/article/details/103867606
有什么问题留言即可

code run 插件可以运行较简单的C/C++语句,初步学习应该是够了.
楼上链接也很可以,但是他的是单文件的
我上面的链接是

你要先新建一个工程,文件夹下新建,在再饮料一个文件,文件要保存,保存时用后缀区分c还是c++.然后把这个文件移动到刚刚新建的工程中,在文件菜单最下面有移动选项,然后就可以写代码编译运行了

jgt_insect
早起的虫儿@04637 回复郭二公子: 已截图 , 在下一个回答中
4 年多之前 回复
jgt_insect
早起的虫儿@04637 回复郭二公子: 我截图跟你讲
4 年多之前 回复
guo8985966
流浪的蝈蝈 不懂,我是纯新手,刚刚入门的。有没有具体的操作过程。拜谢!
4 年多之前 回复

图片说明
图片说明
图片说明
图片说明
图片说明
图片说明
图片说明
图片说明
编写完成 ctrl+F5执行
图片说明

guo8985966
流浪的蝈蝈 vscode是编辑器,没有集成环境,能编写代码,但不能编译运行。
4 年多之前 回复
guo8985966
流浪的蝈蝈 大哥,我说的是 vscode,不是VS 2015
4 年多之前 回复
Csdn user default icon
上传中...
上传图片
插入图片
抄袭、复制答案,以达到刷声望分或其他目的的行为,在CSDN问答是严格禁止的,一经发现立刻封号。是时候展现真正的技术了!
其他相关推荐
求大神告知:如何在 visual studio code中编译运行C/C++代码?

求大神告知:如何在 visual studio code中编译运行C/C++代码,如需配置环境,怎么配置?求详细操作,拜谢!

cuda 9.2在VS2015中的编译问题

我用cuda写了一个.cu的文件,准备封装编译成dll,但始终无法编译成功,频繁 报 expected a ">>>", expected a "(",expected an expression, too few arguments in function call等错误,貌似核函数根本没有被编译器识别。 最后提示错误MSB3721 命令“"C:\Program Files\NVIDIA GPU Computing Toolkit\CUDA\v9.2\bin\nvcc.exe" -gencode=arch=compute_30,code=\"sm_30,compute_30\" --use-local-env -ccbin "D:\Visual Studio\VC\bin\x86_amd64" -x cu -I"C:\Program Files\NVIDIA GPU Computing Toolkit\CUDA\v9.2\include" -I"C:\Program Files\NVIDIA GPU Computing Toolkit\CUDA\v9.2\include" --keep-dir x64\Release -maxrregcount=0 --machine 64 --compile -cudart static -DWIN32 -DWIN64 -DNDEBUG -D_CONSOLE -D_WINDLL -D_MBCS -Xcompiler "/EHsc /W3 /nologo /O2 /FS /Zi /MD " -o x64\Release\cmusimulator.cu.obj "C:\Users\lone\Desktop\cmusimulator_gpu\cmusimulator\cmusimulator.cu"”已退出,返回代码为 1。 求各位大神帮助,十分感激!

Visual Studio 2015 跨平台编译android动态链接clang错误,求大神解答!

我使用VS2015专业版进行android动态链接库编译,新建工程,去掉使用预编程序头选项,未添加或修改任何内容进行编译,发生错误,错误提示: 1>------ 已启动生成: 项目: SharedObject3, 配置: Debug ARM ------ 1> ANDROID_HOME=D:\Android\sdk 1> ANT_HOME=D:\Program Files (x86)\Microsoft Visual Studio 14.0\Apps\apache-ant-1.9.3\ 1> JAVA_HOME=C:\Program Files\Java\jdk1.7.0_80 1> NDK_ROOT=D:\Android\sdk\ndk-bundle 1>clang.exe : error : unable to execute command: program not executable 1>clang.exe : error : linker command failed with exit code 1 (use -v to see invocation) ========== 生成: 成功 0 个,失败 1 个,最新 0 个,跳过 0 个 ========== 查了好多资料,都没有解决问题,求大神解答!!!

Microsoft visual studio 2013在win7系统能正常运行,但放win10就打不开,

弹出一句“connot find one or more components, please reinstall the application ”,请问各路大神有什么方法可以解决?![图片说明](http://forum.csdn.net/PointForum/ui/scripts/csdn/Plugin/001/face/63.gif)![图片说明](http://forum.csdn.net/PointForum/ui/scripts/csdn/Plugin/001/face/63.gif)![图片说明](http://forum.csdn.net/PointForum/ui/scripts/csdn/Plugin/001/face/83.gif)![图片](https://img-ask.csdn.net/upload/201609/26/1474882346_562144.png)

visual studio 找不到sdk

各位大神,,我用visualstudio新建文件的时候提示找不到SDK 我该怎么办,,我的 qq 928783975,,,求解,谢谢。

求大神帮忙!go 语言编译报错 can't load package"XXXX" in any of:

我新建了一个Go语言程序,在Main包下go build 没有问题,但在项目包下编译提示如下截图错误,我环境变量配置的也没有问题啊,昨天在别的电脑上同样的操作也是出现了这个问题,哪位大神能帮我看下问题到底出在哪里?![图片说明](https://img-ask.csdn.net/upload/201910/14/1571019820_960124.png)![图片说明](https://img-ask.csdn.net/upload/201910/14/1571019828_144126.png)

如何使用codewarrior的编译工具,在windows下自动编译

目的是使工程编译自动化,用codewarrior的工具,生成srecord文件(.mot) 进行的尝试: 1、查看工程设置,了解到是使用mings32-make.exe进行编译,但是将此文件拷贝到工程FLASH文件下。 2、在命令行输mingw32-make,结果提示first没有东西执行(Makefile是自动生成的)。 现在就想问一下有没有大神知道如何可以不打开codewarrior进行编译输出srecord文件

大神们帮帮忙,opencv配置编译不成功(要哭了)

win7在vs2010上配置opencv3.0 按网上教程配置好了环境变量以及vs2010 输入opencv的一个小程序: #include <opencv2\opencv.hpp> #include<iostream> using namespace cv; void main() { IplImage *src; src = cvLoadImage("lena.jpg"); //这里将lena.jpg和lena.cpp文件放在同一个文件夹下 cvNamedWindow("lena",CV_WINDOW_AUTOSIZE); cvShowImage("lena",src); cvWaitKey(0); cvDestroyWindow("lena"); cvReleaseImage(&src); } 编译结果: 1>------ Build started: Project: lena, Configuration: Debug Win32 ------ 1>Build started 2015/3/9 9:06:02. 1>InitializeBuildStatus: 1> Touching "Debug\lena.unsuccessfulbuild". 1>ClCompile: 1> lena.cpp 1>d:\opencv\build\include\opencv2\core\mat.hpp(1413): warning C4819: The file contains a character that cannot be represented in the current code page (936). Save the file in Unicode format to prevent data loss 1>d:\opencv\build\include\opencv2\core\mat.hpp(1413): warning C4819: The file contains a character that cannot be represented in the current code page (936). Save the file in Unicode format to prevent data loss 1>c:\users\apple\desktop\documents\visual studio 2010\projects\lena\lena\lena.cpp(6): error C2065: 'IplImage' : undeclared identifier 1>c:\users\apple\desktop\documents\visual studio 2010\projects\lena\lena\lena.cpp(6): error C2065: 'src' : undeclared identifier 1>c:\users\apple\desktop\documents\visual studio 2010\projects\lena\lena\lena.cpp(7): error C2065: 'src' : undeclared identifier 1>c:\users\apple\desktop\documents\visual studio 2010\projects\lena\lena\lena.cpp(7): error C3861: 'cvLoadImage': identifier not found 1>c:\users\apple\desktop\documents\visual studio 2010\projects\lena\lena\lena.cpp(8): error C2065: 'CV_WINDOW_AUTOSIZE' : undeclared identifier 1>c:\users\apple\desktop\documents\visual studio 2010\projects\lena\lena\lena.cpp(8): error C3861: 'cvNamedWindow': identifier not found 1>c:\users\apple\desktop\documents\visual studio 2010\projects\lena\lena\lena.cpp(9): error C2065: 'src' : undeclared identifier 1>c:\users\apple\desktop\documents\visual studio 2010\projects\lena\lena\lena.cpp(9): error C3861: 'cvShowImage': identifier not found 1>c:\users\apple\desktop\documents\visual studio 2010\projects\lena\lena\lena.cpp(10): error C3861: 'cvWaitKey': identifier not found 1>c:\users\apple\desktop\documents\visual studio 2010\projects\lena\lena\lena.cpp(11): error C3861: 'cvDestroyWindow': identifier not found 1>c:\users\apple\desktop\documents\visual studio 2010\projects\lena\lena\lena.cpp(12): error C2065: 'src' : undeclared identifier 1>c:\users\apple\desktop\documents\visual studio 2010\projects\lena\lena\lena.cpp(12): error C3861: 'cvReleaseImage': identifier not found 1> 1>Build FAILED. 1> 1>Time Elapsed 00:00:02.25 ========== Build: 0 succeeded, 1 failed, 0 up-to-date, 0 skipped ========== 然后尝试输入: #include <stdio.h> #include <iostream> int main() { printf("Hello world!"); return 0; } 编译也不成功 1>------ Build started: Project: lena, Configuration: Debug Win32 ------ 1>Build started 2015/3/9 9:12:16. 1>InitializeBuildStatus: 1> Touching "Debug\lena.unsuccessfulbuild". 1>ClCompile: 1> lena.cpp 1>ManifestResourceCompile: 1> All outputs are up-to-date. 1>LINK : fatal error LNK1104: cannot open file 'opencv_calib3d300.lib' 1> 1>Build FAILED. 1> 1>Time Elapsed 00:00:03.02 ========== Build: 0 succeeded, 1 failed, 0 up-to-date, 0 skipped ========== 为什么啊55555~,版本号也是对的呀,为什么打不开opencv_calib3d300.lib

无法打开包括文件:“corecrt.h”

f:\visual studio 2015\vc\include\crtdefs.h(10): fatal error C1083: 无法打开包括文件: “corecrt.h”: No such file or directory 如题 现在连 Hello World 都打不出来,急需大神赐教! ![图片说明](https://img-ask.csdn.net/upload/201603/12/1457757344_324988.png)

ninja 和 VS2015编译caffe-windows失败

![失败截图](https://img-ask.csdn.net/upload/201807/15/1531650930_543226.png) 失败提示 Determining if the C compiler works failed with the following output: Change Dir: G:/Git/caffe/scripts/build/CMakeFiles/CMakeTmp Run Build Command:"C:/Users/TAO/Anaconda3/Library/bin/ninja.exe" "cmTC_55e72" [1/2] Building C object CMakeFiles\cmTC_55e72.dir\testCCompiler.c.obj [2/2] Linking C executable cmTC_55e72.exe FAILED: cmTC_55e72.exe cmd.exe /C "cd . && "C:\Program Files\CMake\bin\cmake.exe" -E vs_link_exe --intdir=CMakeFiles\cmTC_55e72.dir --manifests -- C:\PROGRA~2\MICROS~1.0\VC\bin\amd64\link.exe /nologo CMakeFiles\cmTC_55e72.dir\testCCompiler.c.obj /out:cmTC_55e72.exe /implib:cmTC_55e72.lib /pdb:cmTC_55e72.pdb /version:0.0 /machine:x64 /debug /INCREMENTAL /subsystem:console kernel32.lib user32.lib gdi32.lib winspool.lib shell32.lib ole32.lib oleaut32.lib uuid.lib comdlg32.lib advapi32.lib && cd ." RC Pass 1: command "rc /foCMakeFiles\cmTC_55e72.dir/manifest.res CMakeFiles\cmTC_55e72.dir/manifest.rc" failed (exit code 0) with the following output: The system cannot find the file specified ninja: build stopped: subcommand failed. 我的脚本是 :: Change the settings here to match your setup :: Change MSVC_VERSION to 12 to use VS 2013 if NOT DEFINED MSVC_VERSION set MSVC_VERSION=14 :: Change to 1 to use Ninja generator (builds much faster) if NOT DEFINED WITH_NINJA set WITH_NINJA=1 :: Change to 1 to build caffe without CUDA support if NOT DEFINED CPU_ONLY set CPU_ONLY=0 :: Change to generate CUDA code for one of the following GPU architectures :: [Fermi Kepler Maxwell Pascal All] if NOT DEFINED CUDA_ARCH_NAME set CUDA_ARCH_NAME=Auto :: Change to Debug to build Debug. This is only relevant for the Ninja generator the Visual Studio generator will generate both Debug and Release configs if NOT DEFINED CMAKE_CONFIG set CMAKE_CONFIG=Release :: Set to 1 to use NCCL if NOT DEFINED USE_NCCL set USE_NCCL=0 :: Change to 1 to build a caffe.dll if NOT DEFINED CMAKE_BUILD_SHARED_LIBS set CMAKE_BUILD_SHARED_LIBS=0 :: Change to 3 if using python 3.5 (only 2.7 and 3.5 are supported) if NOT DEFINED PYTHON_VERSION set PYTHON_VERSION=3 :: Change these options for your needs. if NOT DEFINED BUILD_PYTHON set BUILD_PYTHON=1 if NOT DEFINED BUILD_PYTHON_LAYER set BUILD_PYTHON_LAYER=1 if NOT DEFINED BUILD_MATLAB set BUILD_MATLAB=0 :: If python is on your path leave this alone if NOT DEFINED PYTHON_EXE set PYTHON_EXE=python :: Run the tests if NOT DEFINED RUN_TESTS set RUN_TESTS=0 :: Run lint if NOT DEFINED RUN_LINT set RUN_LINT=0 :: Build the install target if NOT DEFINED RUN_INSTALL set RUN_INSTALL=0 折腾一个星期也没弄出来,请大神帮忙看下,谢谢

急急急,matlab交叉编译出错

matlabr2016b 打包.m文件生成C++动态库出现如下问题 Compiler version: 6.3 (R2016b) Dependency analysis by REQUIREMENTS. 警告: Adding path "D:\gobs-master\frfrcode190414" to Compiler path instance. Parsing file "D:\gobs-master\frfrcode190414\frft.m" (Referenced from: "Compiler Command Line"). Deleting 1 temporary MEX authorization files. Removing: 'C:\Users\WANGHU~1\AppData\Local\Temp\mathworks_tmp_016b05319_5808.auth'. Generating file "D:\gobs-master\lib\frft\for_testing\frft.h". Generating file "D:\gobs-master\lib\frft\for_testing\frft.cpp". Generating file "D:\gobs-master\lib\frft\for_testing\frft.exports". Generating file "D:\gobs-master\lib\frft\for_testing\readme.txt". Executing command: ""D:\matlab\bin\mbuild" -client mbuild -O -v -output "frft" -I"D:\gobs-master\lib\frft\for_testing" "D:\gobs-master\lib\frft\for_testing\frft.cpp" DEFFILE"=""D:\gobs-master\lib\frft\for_testing\frft.def""" LINKEXPORT"=""/DLL /def:\"$DEFFILE\"""" LDEXT"="".dll""" CMDLINE250"=""mt -outputresource:$EXE;2 -manifest $MANIFEST""" -outdir "D:\gobs-master\lib\frft\for_testing""详细模式已开。 未标识 MEX 选项文件;将查找隐式选择内容。 ... 正在查找编译器 'Intel C++ Composer XE 2011 with Microsoft SDK 7.1'... ... 正在查找环境变量 'ICPP_COMPILER12'...否。 找不到已安装的编译器 'Intel C++ Composer XE 2011 with Microsoft SDK 7.1'。 ... 正在查找编译器 'Intel C++ Composer XE 2011 with Microsoft Visual Studio 2008'... ... 正在查找环境变量 'ICPP_COMPILER12'...否。 找不到已安装的编译器 'Intel C++ Composer XE 2011 with Microsoft Visual Studio 2008'。 ... 正在查找编译器 'Intel C++ Composer XE 2011 with Microsoft Visual Studio 2010 '... ... 正在查找环境变量 'ICPP_COMPILER12'...否。 找不到已安装的编译器 'Intel C++ Composer XE 2011 with Microsoft Visual Studio 2010 '。 ... 正在查找编译器 'Intel C++ Composer XE 2013 with Microsoft SDK 7.1'... ... 正在查找环境变量 'ICPP_COMPILER14'...否。 ... 正在查找环境变量 'ICPP_COMPILER13'...否。 找不到已安装的编译器 'Intel C++ Composer XE 2013 with Microsoft SDK 7.1'。 ... 正在查找编译器 'Intel C++ Composer XE 2013 with Microsoft Visual Studio 2010'... ... 正在查找环境变量 'ICPP_COMPILER14'...否。 ... 正在查找环境变量 'ICPP_COMPILER13'...否。 找不到已安装的编译器 'Intel C++ Composer XE 2013 with Microsoft Visual Studio 2010'。 ... 正在查找编译器 'Intel C++ Composer XE 2013 with Microsoft Visual Studio 2012'... ... 正在查找环境变量 'ICPP_COMPILER14'...否。 ... 正在查找环境变量 'ICPP_COMPILER13'...否。 找不到已安装的编译器 'Intel C++ Composer XE 2013 with Microsoft Visual Studio 2012'。 ... 正在查找编译器 'Intel C++ Composer XE 2013 with Microsoft Visual Studio 2013'... ... 正在查找环境变量 'ICPP_COMPILER14'...否。 ... 正在查找环境变量 'ICPP_COMPILER13'...否。 找不到已安装的编译器 'Intel C++ Composer XE 2013 with Microsoft Visual Studio 2013'。 ... 正在查找编译器 'Intel Parallel Studio XE 2015 for C++ with Microsoft SDK 7.1'... ... 正在查找环境变量 'ICPP_COMPILER15'...否。 找不到已安装的编译器 'Intel Parallel Studio XE 2015 for C++ with Microsoft SDK 7.1'。 ... 正在查找编译器 'Intel Parallel Studio XE 2015 for C++ with Microsoft Visual Studio 2012'... ... 正在查找环境变量 'ICPP_COMPILER15'...否。 找不到已安装的编译器 'Intel Parallel Studio XE 2015 for C++ with Microsoft Visual Studio 2012'。 ... 正在查找编译器 'Intel Parallel Studio XE 2015 for C++ with Microsoft Visual Studio 2013'... ... 正在查找环境变量 'ICPP_COMPILER15'...否。 找不到已安装的编译器 'Intel Parallel Studio XE 2015 for C++ with Microsoft Visual Studio 2013'。 ... 正在查找编译器 'Intel Parallel Studio XE 2015 for C++ with Microsoft Visual Studio 2015'... ... 正在查找环境变量 'ICPP_COMPILER15'...否。 找不到已安装的编译器 'Intel Parallel Studio XE 2015 for C++ with Microsoft Visual Studio 2015'。 ... 正在查找编译器 'Intel Parallel Studio XE 2016 for C++ with Microsoft SDK 7.1'... ... 正在查找环境变量 'ICPP_COMPILER16'...否。 找不到已安装的编译器 'Intel Parallel Studio XE 2016 for C++ with Microsoft SDK 7.1'。 ... 正在查找编译器 'Intel Parallel Studio XE 2016 for C++ with Microsoft Visual Studio 2012'... ... 正在查找环境变量 'ICPP_COMPILER16'...否。 找不到已安装的编译器 'Intel Parallel Studio XE 2016 for C++ with Microsoft Visual Studio 2012'。 ... 正在查找编译器 'Intel Parallel Studio XE 2016 for C++ with Microsoft Visual Studio 2013'... ... 正在查找环境变量 'ICPP_COMPILER16'...否。 找不到已安装的编译器 'Intel Parallel Studio XE 2016 for C++ with Microsoft Visual Studio 2013'。 ... 正在查找编译器 'Intel Parallel Studio XE 2016 for C++ with Microsoft Visual Studio 2015'... ... 正在查找环境变量 'ICPP_COMPILER16'...否。 找不到已安装的编译器 'Intel Parallel Studio XE 2016 for C++ with Microsoft Visual Studio 2015'。 ... 正在查找编译器 'MinGW64 Compiler (C++)'... ... 正在查找环境变量 'MW_MINGW64_LOC'...是('C:\TDM-GCC-64')。 ... 正在查找文件 'C:\TDM-GCC-64\bin\g++.exe'...是。 ... 正在查找文件夹 'C:\TDM-GCC-64'...是。 找到已安装的编译器 'MinGW64 Compiler (C++)'。 ... 正在查找编译器 'Microsoft Visual C++ 2008'... ... 正在查找环境变量 'VS90COMNTOOLS'...否。 找不到已安装的编译器 'Microsoft Visual C++ 2008'。 ... 正在查找编译器 'Microsoft Visual C++ 2010'... ... 正在查找环境变量 'VS100COMNTOOLS'...否。 找不到已安装的编译器 'Microsoft Visual C++ 2010'。 ... 正在查找编译器 'Microsoft Visual C++ 2012'... ... 正在查找注册表设置 'HKLM\SOFTWARE\Microsoft\VisualStudio\SxS\VS7' 11.0...否。 ... 正在查找注册表设置 'HKCU\SOFTWARE\Microsoft\VisualStudio\SxS\VS7' 11.0...否。 ... 正在查找注册表设置 'HKLM\SOFTWARE\Wow6432Node\Microsoft\VisualStudio\SxS\VS7' 11.0...否。 ... 正在查找注册表设置 'HKCU\SOFTWARE\Wow6432Node\Microsoft\VisualStudio\SxS\VS7' 11.0...否。 找不到已安装的编译器 'Microsoft Visual C++ 2012'。 ... 正在查找编译器 'Microsoft Visual C++ 2013 Professional'... ... 正在查找注册表设置 'HKLM\SOFTWARE\Microsoft\VisualStudio\SxS\VS7' 12.0...否。 ... 正在查找注册表设置 'HKCU\SOFTWARE\Microsoft\VisualStudio\SxS\VS7' 12.0...否。 ... 正在查找注册表设置 'HKLM\SOFTWARE\Wow6432Node\Microsoft\VisualStudio\SxS\VS7' 12.0...否。 ... 正在查找注册表设置 'HKCU\SOFTWARE\Wow6432Node\Microsoft\VisualStudio\SxS\VS7' 12.0...否。 找不到已安装的编译器 'Microsoft Visual C++ 2013 Professional'。 ... 正在查找编译器 'Microsoft Visual C++ 2015 Professional'... ... 正在查找注册表设置 'HKLM\SOFTWARE\Microsoft\VisualStudio\SxS\VS7' 14.0...否。 ... 正在查找注册表设置 'HKCU\SOFTWARE\Microsoft\VisualStudio\SxS\VS7' 14.0...否。 ... 正在查找注册表设置 'HKLM\SOFTWARE\Wow6432Node\Microsoft\VisualStudio\SxS\VS7' 14.0...否。 ... 正在查找注册表设置 'HKCU\SOFTWARE\Wow6432Node\Microsoft\VisualStudio\SxS\VS7' 14.0...否。 找不到已安装的编译器 'Microsoft Visual C++ 2015 Professional'。 ... 正在查找编译器 'Microsoft Visual C++ 2017'... ... 正在查找注册表设置 'HKLM\SOFTWARE\Microsoft\VisualStudio\SxS\VS7' 15.0...否。 ... 正在查找注册表设置 'HKCU\SOFTWARE\Microsoft\VisualStudio\SxS\VS7' 15.0...否。 ... 正在查找注册表设置 'HKLM\SOFTWARE\Wow6432Node\Microsoft\VisualStudio\SxS\VS7' 15.0...否。 ... 正在查找注册表设置 'HKCU\SOFTWARE\Wow6432Node\Microsoft\VisualStudio\SxS\VS7' 15.0...否。 找不到已安装的编译器 'Microsoft Visual C++ 2017'。 ... 正在查找编译器 'Microsoft Windows SDK 7.1 (C++)'... ... 正在查找注册表设置 'HKLM\SOFTWARE\Microsoft\Microsoft SDKs\Windows\v7.1' InstallationFolder...否。 找不到已安装的编译器 'Microsoft Windows SDK 7.1 (C++)'。 未找到支持的编译器或 SDK。您可以安装免费提供的 MinGW-w64 C/C++ 编译器;请访问 http://www.mathworks.com/help/matlab/matlab_external/install-mingw-support-package.html。如需更多选项,请访问 http://www.mathworks.com/support/compilers/R2016b/win64.html。 Error: An error occurred while shelling out to mbuild (error code = -1). Unable to build executable. 看中间已经找到编译器,但是在编译的时候并没有使用依旧找到的编译器,的编译器依旧换了两三个,但均报这个错误。 求大神帮忙。。。。。。

如何调用App_Code中的cs类到另一个cs类

public partial class SiteMaster : System.Web.UI.MasterPage { OperatorClass operatorclass = new OperatorClass(); AdminManage adminmanage = new AdminManage(); PurviewManage purviewmanage = new PurviewManage(); AdminManage,PurviewManage,OperatorClass类都是App Code中的类,他们都是跟一个数据库连接的DateBase有关。这三个类在一个cs文件中实例化以后还是说不存在的,我按照网上的方法将他们的建立模式改成编译的时候,他们就显示DateBase出错。可我将DateBaese类改成编译模式时则程序运行出错。 请问各位大神有什么办法可以解决这个问题

vs2015 无法打开源文件stdio.h

![图片说明](https://img-ask.csdn.net/upload/201611/18/1479440766_872949.png)求大神指教啊!!!!

windows版caffe的编译问题,弄了好几天,求大神看看。

Error 45 error MSB3721: The command ""C:\Program Files\NVIDIA GPU Computing Toolkit\CUDA\v9.0\bin\nvcc.exe" -ccbin "C:\Program Files (x86)\Microsoft Visual Studio 12.0\VC\bin\x86_amd64" -x cu -I"D:\NugetPackages\lmdb-v120-clean.0.9.14.0\build\native\..\..\lib\native\include" -I"D:\NugetPackages\LevelDB-vc120.1.2.0.0\build\native\../..//build/native/include/" -I"D:\NugetPackages\protobuf-v120.2.6.1\build\native\../..//build/native/include/" -ID:\NugetPackages\glog.0.3.3.0\build\native\../..//build/native/include/ -ID:\NugetPackages\gflags.2.1.2.1\build\native\../..///build/native/include/ -ID:\NugetPackages\boost.1.59.0.0\build\native\..\..\lib\native\include\ -I"D:\NugetPackages\hdf5-v120-complete.1.8.15.2\build\native\..\..\lib\native\include" -ID:\NugetPackages\OpenBLAS.0.2.14.1\build\native\..\..\lib\native\include -ID:\NugetPackages\OpenCV.2.4.10\build\native\../../build/native/include/ -I"D:\caffe-master\windows\libcaffe\\..\..\src\D:\Anaconda\python3.6\include" -I"C:\Program Files\NVIDIA GPU Computing Toolkit\CUDA\v9.0\include" -I"C:\Program Files\NVIDIA GPU Computing Toolkit\CUDA\v9.0\include" --keep-dir D:\caffe-master\windows\..\Build\Int\libcaffe\x64\Release -maxrregcount=0 --machine 64 --compile -Xcudafe "--diag_suppress=exception_spec_override_incompat --diag_suppress=useless_using_declaration --diag_suppress=field_without_dll_interface" -D_SCL_SECURE_NO_WARNINGS -DGFLAGS_DLL_DECL= -DHAS_LMDB -DHAS_HDF5 -DHAS_OPENBLAS -DHAS_OPENCV -DNDEBUG -D_SCL_SECURE_NO_WARNINGS -DUSE_OPENCV -DUSE_LEVELDB -DUSE_LMDB -DWITH_PYTHON_LAYER -DBOOST_PYTHON_STATIC_LIB -DUSE_CUDNN -D_UNICODE -DUNICODE -Xcompiler "/EHsc /W1 /nologo /Ox /FS /Zi /MD " -o D:\caffe-master\windows\..\Build\Int\libcaffe\x64\Release\absval_layer.cu.obj "D:\caffe-master\src\caffe\layers\absval_layer.cu" -clean" exited with code 1. C:\Program Files (x86)\MSBuild\Microsoft.Cpp\v4.0\V120\BuildCustomizations\CUDA 9.0.targets 883 9 libcaffe

新手提问:portaudio实在装不来啊,(为了要装PYaudio)

C++小白,不是很会,未能成功安装,求大神指导: 电脑属性如下图![图片说明](https://img-ask.csdn.net/upload/201902/24/1551004226_195898.png) 在网上找了一篇安装教程文章,链接如下: https://www.cnblogs.com/gaoyaguo/p/5011097.html 看完后云里雾里。我就跟着直觉去安装了。安装流程如下: 1、安装DirectX SDK [DirectX SDK](http://www.microsoft.com/en-us/download/details.aspx?id=6812 "") http://www.microsoft.com/en-us/download/details.aspx?id=6812 是个应用程序,我就直接安装了。 2、下载了PortAudio,并随便解压到了D盘下。 http://portaudio.com/docs/v19-doxydocs/compile_windows.html 我下载的版本为pa_stable_v190600_20161030 3、下载ASIO SDK2.3.2 ,并按教程复制到了刚下载的PortAudio的D:\portaudio\src\hostapi\asio文件夹下并改名为ASIOSDK 4、我双击打开了portaudio\build\msvc\portaudio.sln,VS2015启动 ![图片说明](https://img-ask.csdn.net/upload/201902/24/1551021914_679798.png) 5、按照之前教程,我右键了这里,点击属性。 C/C++—〉代码生成—〉运行时库/MT C/C++—〉代码生成—〉浮点模型=快速 C/C++—〉优化—〉省略框架指针= YES 之后一步原文是“为了抑制的PortAudio运行调试控制台输出项目—〉属性—〉配置属性—〉C/C++—〉预处理器。在该领域的预处理器定义,找到PA_ENABLE_DEBUG_OUTPUT并删除它。控制台将不输出调试信息“ 但是我打开了预处理器,里面并没有这些东西,只写着<不同选项>的。所以我直接复制了教程里的这个代码 PA_USE_ASIO PA_USE_DS (DirectSound) PA_USE_WMME (MME) PA_USE_WASAPI PA_USE_WDMKS PA_USE_SKELETON 在这个空白的栏里,见下图 ![图片说明](https://img-ask.csdn.net/upload/201902/24/1551022469_530353.png) ![图片说明](https://img-ask.csdn.net/upload/201902/24/1551022487_79657.png) ![图片说明](https://img-ask.csdn.net/upload/201902/24/1551022537_927310.png) 之后我就直接生成解决方案了,最后用PIP3安装PYAUDIO时果然还是一样不行。 请大神前辈们教我一下,怎么整。我是自己在自学,问的问题尴尬了点,请前辈们包涵,感谢。 最后附上我安装PYAUDIO时的错误,方便的话帮我看看装不了PYaudio是不是因为没有装PORTAUDIO的问题,跪谢! Microsoft Windows [版本 6.1.7601] 版权所有 (c) 2009 Microsoft Corporation。保留所有权利。 C:\Users\Administrator>pip3 install pyaudio Collecting pyaudio Using cached https://files.pythonhosted.org/packages/ab/42/b4f04721c5c5bfc196c e156b3c768998ef8c0ae3654ed29ea5020c749a6b/PyAudio-0.2.11.tar.gz Installing collected packages: pyaudio Running setup.py install for pyaudio ... error Complete output from command c:\users\administrator\appdata\local\programs\p ython\python38\python.exe -u -c "import setuptools, tokenize;__file__='C:\\Users \\ADMINI~1\\AppData\\Local\\Temp\\pip-install-8s3mtmuj\\pyaudio\\setup.py';f=get attr(tokenize, 'open', open)(__file__);code=f.read().replace('\r\n', '\n');f.clo se();exec(compile(code, __file__, 'exec'))" install --record C:\Users\ADMINI~1\A ppData\Local\Temp\pip-record-i5bb3diy\install-record.txt --single-version-extern ally-managed --compile: running install running build running build_py creating build creating build\lib.win-amd64-3.8 copying src\pyaudio.py -> build\lib.win-amd64-3.8 running build_ext building '_portaudio' extension creating build\temp.win-amd64-3.8 creating build\temp.win-amd64-3.8\Release creating build\temp.win-amd64-3.8\Release\src C:\Program Files (x86)\Microsoft Visual Studio 14.0\VC\BIN\x86_amd64\cl.exe /c /nologo /Ox /W3 /GL /DNDEBUG /MD -DMS_WIN64=1 -Ic:\users\administrator\appdat a\local\programs\python\python38\include -Ic:\users\administrator\appdata\local\ programs\python\python38\include "-IC:\Program Files (x86)\Microsoft Visual Stud io 14.0\VC\INCLUDE" "-IC:\Program Files (x86)\Microsoft Visual Studio 14.0\VC\AT LMFC\INCLUDE" "-IC:\Program Files (x86)\Windows Kits\10\include\10.0.10240.0\ucr t" "-IC:\Program Files (x86)\Windows Kits\NETFXSDK\4.6.1\include\um" "-IC:\Progr am Files (x86)\Windows Kits\8.1\include\\shared" "-IC:\Program Files (x86)\Windo ws Kits\8.1\include\\um" "-IC:\Program Files (x86)\Windows Kits\8.1\include\\win rt" /Tcsrc/_portaudiomodule.c /Fobuild\temp.win-amd64-3.8\Release\src/_portaudio module.obj _portaudiomodule.c c:\users\administrator\appdata\local\programs\python\python38\include\pyconf ig.h(117): warning C4005: “MS_WIN64”: 宏重定义 c:\users\administrator\appdata\local\programs\python\python38\include\pyconf ig.h(117): note: 命令行参数: 参见前面的“MS_WIN64”定义 src/_portaudiomodule.c(29): fatal error C1083: 无法打开包括文件: “portaudio .h”: No such file or directory error: command 'C:\\Program Files (x86)\\Microsoft Visual Studio 14.0\\VC\\B IN\\x86_amd64\\cl.exe' failed with exit status 2 ---------------------------------------- Command "c:\users\administrator\appdata\local\programs\python\python38\python.ex e -u -c "import setuptools, tokenize;__file__='C:\\Users\\ADMINI~1\\AppData\\Loc al\\Temp\\pip-install-8s3mtmuj\\pyaudio\\setup.py';f=getattr(tokenize, 'open', o pen)(__file__);code=f.read().replace('\r\n', '\n');f.close();exec(compile(code, __file__, 'exec'))" install --record C:\Users\ADMINI~1\AppData\Local\Temp\pip-re cord-i5bb3diy\install-record.txt --single-version-externally-managed --compile" failed with error code 1 in C:\Users\ADMINI~1\AppData\Local\Temp\pip-install-8s3 mtmuj\pyaudio\ ```

在vs2013初次编译时候报错,求大神指点

用cocos2dx 3.9版本新建立项目后用vs2013打开并初次编译 然后就弹出错误提示框,内容如下 Can't create window More info: GLFWError #65537 Happen,The GLFW library is not initialized 对于编程小白的我来说,度娘找不到的问题,我也就误解了,求大神指点 这该怎么解决

VS2008 非托管C++调用WebService ATL文件报错

小弟MFC新手一枚,最近公司有个项目升级功能,需要调用WebService服务接口,项目的开发环境是VS2008,基于MFC对话框。根据网上VS2008调用WebService的方法,下载了开源代码 ATL_Server_Source_and_Headers_9_0_70425_Alpha.zip,利用生成的sproxy.exe工具把WebService 的wsdl文件生成了WS_Service1.h头文件,引入工程后,编译就生成如下错误,折腾好几天了,一直找不到原因,求大神指点看看什么原因,拜谢。。。(下周二功能要验收,问题没解决,人都要疯了,没办法了,只能到宝地求助) PS:我自己重新新建了一个基于VS2008的MFC对话框工程,可以正常编译通过,只有公司的这个项目不行,会报如下错误。两个工程里面的属性设置我也对比过,是一样的,所以可以排除是开发环境的原因。 1>D:\Program Files\Microsoft Visual Studio 9.0\VC\atlmfc\include\atlcom.h(5900) : error C2296: “>>”: 非法,左操作数包含“unsigned long *”类型 1>D:\Program Files\Microsoft Visual Studio 9.0\VC\atlmfc\include\atlutil.h(309) : error C2440: “return”: 无法从“DWORD”转换为“unsigned long *” 1> 从整型转换为指针类型要求 reinterpret_cast、C 样式转换或函数样式转换 1>D:\Program Files\Microsoft Visual Studio 9.0\VC\atlmfc\include\atlutil.h(331) : error C2440: “return”: 无法从“DWORD_PTR”转换为“unsigned long *” 1> 从整型转换为指针类型要求 reinterpret_cast、C 样式转换或函数样式转换 1>D:\Program Files\Microsoft Visual Studio 9.0\VC\atlmfc\include\atlutil.h(343) : error C2440: “=”: 无法从“UINT_PTR”转换为“unsigned long *” 1> 从整型转换为指针类型要求 reinterpret_cast、C 样式转换或函数样式转换 1>D:\Program Files\Microsoft Visual Studio 9.0\VC\atlmfc\include\atlutil.h(391) : error C2664: “SymGetSymFromAddr”: 不能将参数 3 从“unsigned long **”转换为“PDWORD” 1> 与指向的类型无关;转换要求 reinterpret_cast、C 样式转换或函数样式转换 1>D:\Program Files\Microsoft Visual Studio 9.0\VC\atlmfc\include\atlutil.h(421) : error C2440: “=”: 无法从“unsigned long”转换为“unsigned long *” 1> 从整型转换为指针类型要求 reinterpret_cast、C 样式转换或函数样式转换 1>D:\Program Files\Microsoft Visual Studio 9.0\VC\atlmfc\include\atlutil.h(553) : error C2664: “StackWalk”: 不能将参数 7 从“LPVOID (__stdcall *)(HANDLE,unsigned long *)”转换为“PFUNCTION_TABLE_ACCESS_ROUTINE” 1> 在匹配目标类型的范围内没有具有该名称的函数 1>D:\Program Files\Microsoft Visual Studio 9.0\VC\atlmfc\include\atlcache.h(3044) : error C2144: 语法错误 : “unsigned long”的前面应有“)” 1>D:\Program Files\Microsoft Visual Studio 9.0\VC\atlmfc\include\atlcache.h(3044) : error C2059: 语法错误 : “)” 1>D:\Program Files\Microsoft Visual Studio 9.0\VC\atlmfc\include\atlisapi.h(10469) : warning C4005: “MAX_NAME_LEN”: 宏重定义 1> d:\code manage\ats\ats2 储能机\1源代码\rs485通讯\复件 ats410-00011-037_mes\ateprogram_chromadc_double\GWCommonPublic.h(146) : 参见“MAX_NAME_LEN”的前一个定义 1>D:\Program Files\Microsoft Visual Studio 9.0\VC\atlmfc\include\atlhttp.inl(2406) : error C2446: “==”: 没有从“unsigned int”到“unsigned long *”的转换 1> 从整型转换为指针类型要求 reinterpret_cast、C 样式转换或函数样式转换 1>D:\Program Files\Microsoft Visual Studio 9.0\VC\atlmfc\include\atlhttp.inl(2406) : error C2040: “==”: “unsigned long *”与“unsigned int”的间接寻址级别不同 1>D:\Program Files\Microsoft Visual Studio 9.0\VC\atlmfc\include\atlhttp.inl(2406) : error C2446: “==”: 没有从“unsigned int”到“unsigned long *”的转换 1> 从整型转换为指针类型要求 reinterpret_cast、C 样式转换或函数样式转换 1>D:\Program Files\Microsoft Visual Studio 9.0\VC\atlmfc\include\atlhttp.inl(2406) : error C2040: “==”: “unsigned long *”与“unsigned int”的间接寻址级别不同 1>D:\Program Files\Microsoft Visual Studio 9.0\VC\atlmfc\include\atlhttp.inl(2474) : error C2446: “==”: 没有从“unsigned int”到“unsigned long *”的转换 1> 从整型转换为指针类型要求 reinterpret_cast、C 样式转换或函数样式转换 1>D:\Program Files\Microsoft Visual Studio 9.0\VC\atlmfc\include\atlhttp.inl(2474) : error C2040: “==”: “unsigned long *”与“unsigned int”的间接寻址级别不同 1>D:\Program Files\Microsoft Visual Studio 9.0\VC\atlmfc\include\atlhttp.inl(2474) : error C2446: “==”: 没有从“unsigned int”到“unsigned long *”的转换 1> 从整型转换为指针类型要求 reinterpret_cast、C 样式转换或函数样式转换 1>D:\Program Files\Microsoft Visual Studio 9.0\VC\atlmfc\include\atlhttp.inl(2474) : error C2040: “==”: “unsigned long *”与“unsigned int”的间接寻址级别不同 1>D:\Program Files\Microsoft Visual Studio 9.0\VC\atlmfc\include\atlhttp.inl(2475) : error C2446: “==”: 没有从“unsigned int”到“unsigned long *”的转换 1> 从整型转换为指针类型要求 reinterpret_cast、C 样式转换或函数样式转换 1>D:\Program Files\Microsoft Visual Studio 9.0\VC\atlmfc\include\atlhttp.inl(2475) : error C2040: “==”: “unsigned long *”与“unsigned int”的间接寻址级别不同 1>D:\Program Files\Microsoft Visual Studio 9.0\VC\atlmfc\include\atlhttp.inl(2475) : error C2446: “==”: 没有从“unsigned int”到“unsigned long *”的转换 1> 从整型转换为指针类型要求 reinterpret_cast、C 样式转换或函数样式转换 1>D:\Program Files\Microsoft Visual Studio 9.0\VC\atlmfc\include\atlhttp.inl(2475) : error C2040: “==”: “unsigned long *”与“unsigned int”的间接寻址级别不同 1>D:\Program Files\Microsoft Visual Studio 9.0\VC\atlmfc\include\atlhttp.inl(2624) : error C2446: “==”: 没有从“unsigned int”到“unsigned long *”的转换 1> 从整型转换为指针类型要求 reinterpret_cast、C 样式转换或函数样式转换 1>D:\Program Files\Microsoft Visual Studio 9.0\VC\atlmfc\include\atlhttp.inl(2624) : error C2040: “==”: “unsigned long *”与“unsigned int”的间接寻址级别不同 1>D:\Program Files\Microsoft Visual Studio 9.0\VC\atlmfc\include\atlhttp.inl(2624) : error C2446: “==”: 没有从“unsigned int”到“unsigned long *”的转换 1> 从整型转换为指针类型要求 reinterpret_cast、C 样式转换或函数样式转换 1>D:\Program Files\Microsoft Visual Studio 9.0\VC\atlmfc\include\atlhttp.inl(2624) : error C2040: “==”: “unsigned long *”与“unsigned int”的间接寻址级别不同 1>正在生成代码...

请教大神!C代码中嵌入调用Perl程序问题?

C代码中嵌入调用Perl程序,已根据调查完成如下的代码编写: --------------------- static PerlInterpreter *my_perl;//定义一个perl解释器 PERL_SYS_INIT3(NULL,NULL,NULL);//语句执行perl环境的初始化 my_perl = perl_alloc();//为解释器分配资源 if(!my_perl){ return;} perl_construct( my_perl );//创建一个解释器 char *embedding[] = {"","D:\\GetHttp.pl ",""}; perl_parse( my_perl, NULL, 0, embedding,(char**)NULL); perl_run(my_perl); perl_destruct(my_perl);//析构解释器 perl_free(my_perl);//释放解释器 PERL_SYS_TERM(); --------------------- 已能在C运行环境(VS2008)中自动执行"D:\\GetHttp.pl",但问题是执行的结果和在命令行运行"Perl D:\\GetHttp.pl"不一致 (个人理解既然是Perl文件的解析执行,同一台电脑WIN系统运行结果应该是完全一样的) 该GetHttp.pl主要是执行访问网址,获取访问信息,代码如下: ------------------------------------------ #!/usr/bin/perl #! use LWP::UserAgent; my $ua = LWP::UserAgent->new; my $server_endpoint = "https://www.baidu.com"; my $req = HTTP::Request->new(GET => $server_endpoint); my $resp = $ua->request($req); if ($resp->is_success) { my $message = $resp->content; print "Received reply: $message\n"; } else { print "HTTP GET error code: ", $resp->code, "\n"; print "HTTP GET error message: ", $resp->message, "\n"; } -------------------------------------------- 系统命令行运行结果:($resp->is_success)的判定结果为True,可打印出返回信息内容 C编译环境(VS2008)运行结果:($resp->is_success)的判定结果为False,返回错误代码:501,(attemp to reload IO/Socket.pm aborted) 估计应该是VS2008的编译环境中某个设置有问题,或者是还需要再C嵌入代码中追加相关环境变量的设定,还望各位大神赐教!!

关于.net mf系统中使用interop的有关问题

我参照叶帆老师的博客进行interop实验,但是按照他的步骤编译能通过,但是下载后的系统用电脑ping不通,我的步骤是1、我先建立一个MF类库,在里面写了程序 2、把生成后的文件放到G:\MicroFrameworkPK_v4_3\Solutions\STM32Stamp\DeviceCode里面, 3、在cpp文件中里用记事本打开添加相应的程序 4、然后在tinclr中添加对应的路径,然后编译 这样的步骤编译没有问题,就是下载到板子里后就ping不通 不知道有没有问题,希望大神们帮我看看

C/C++学习指南全套教程

C/C++学习的全套教程,从基本语法,基本原理,到界面开发、网络开发、Linux开发、安全算法,应用尽用。由毕业于清华大学的业内人士执课,为C/C++编程爱好者的教程。

定量遥感中文版 梁顺林著 范闻捷译

这是梁顺林的定量遥感的中文版,由范闻捷等翻译的,是电子版PDF,解决了大家看英文费时费事的问题,希望大家下载看看,一定会有帮助的

YOLOv3目标检测实战:训练自己的数据集

YOLOv3是一种基于深度学习的端到端实时目标检测方法,以速度快见长。本课程将手把手地教大家使用labelImg标注和使用YOLOv3训练自己的数据集。课程分为三个小项目:足球目标检测(单目标检测)、梅西目标检测(单目标检测)、足球和梅西同时目标检测(两目标检测)。 本课程的YOLOv3使用Darknet,在Ubuntu系统上做项目演示。包括:安装Darknet、给自己的数据集打标签、整理自己的数据集、修改配置文件、训练自己的数据集、测试训练出的网络模型、性能统计(mAP计算和画出PR曲线)和先验框聚类。 Darknet是使用C语言实现的轻型开源深度学习框架,依赖少,可移植性好,值得深入探究。 除本课程《YOLOv3目标检测实战:训练自己的数据集》外,本人推出了有关YOLOv3目标检测的系列课程,请持续关注该系列的其它课程视频,包括: 《YOLOv3目标检测实战:交通标志识别》 《YOLOv3目标检测:原理与源码解析》 《YOLOv3目标检测:网络模型改进方法》 敬请关注并选择学习!

sql语句 异常 Err] 1064 - You have an error in your SQL syntax; check the manual that corresponds to your

在我们开发的工程中,有时候会报 [Err] 1064 - You have an error in your SQL syntax; check the manual that corresponds to your MySQL server version for the right syntax to use near ------ 这种异常 不用多想,肯定是我们的sql语句出现问题,下面...

浪潮集团 往年的软件类 笔试题 比较详细的哦

浪潮集团 往年的软件类 笔试题 比较详细的哦

2019 AI开发者大会

2019 AI开发者大会(AI ProCon 2019)是由中国IT社区CSDN主办的AI技术与产业年度盛会。多年经验淬炼,如今蓄势待发:2019年9月6-7日,大会将有近百位中美顶尖AI专家、知名企业代表以及千余名AI开发者齐聚北京,进行技术解读和产业论证。我们不空谈口号,只谈技术,诚挚邀请AI业内人士一起共铸人工智能新篇章!

I2c串口通信实现加速度传感器和FPGA的交流

此代码能实现加速度传感器与FPGA之间的交流,从而测出运动物体的加速度。

Python可以这样学(第一季:Python内功修炼)

董付国系列教材《Python程序设计基础》、《Python程序设计(第2版)》、《Python可以这样学》配套视频,讲解Python 3.5.x和3.6.x语法、内置对象用法、选择与循环以及函数设计与使用、lambda表达式用法、字符串与正则表达式应用、面向对象编程、文本文件与二进制文件操作、目录操作与系统运维、异常处理结构。

微信公众平台开发入门

本套课程的设计完全是为初学者量身打造,课程内容由浅入深,课程讲解通俗易懂,代码实现简洁清晰。通过本课程的学习,学员能够入门微信公众平台开发,能够胜任企业级的订阅号、服务号、企业号的应用开发工作。 通过本课程的学习,学员能够对微信公众平台有一个清晰的、系统性的认识。例如,公众号是什么,它有什么特点,它能做什么,怎么开发公众号。 其次,通过本课程的学习,学员能够掌握微信公众平台开发的方法、技术和应用实现。例如,开发者文档怎么看,开发环境怎么搭建,基本的消息交互如何实现,常用的方法技巧有哪些,真实应用怎么开发。

机器学习初学者必会的案例精讲

通过六个实际的编码项目,带领同学入门人工智能。这些项目涉及机器学习(回归,分类,聚类),深度学习(神经网络),底层数学算法,Weka数据挖掘,利用Git开源项目实战等。

eclipseme 1.7.9

eclipse 出了新的eclipseme插件,官方有下载,但特慢,我都下了大半天(可能自己网速差)。有急需要的朋友可以下哦。。。

Spring Boot -01- 快速入门篇(图文教程)

Spring Boot -01- 快速入门篇 今天开始不断整理 Spring Boot 2.0 版本学习笔记,大家可以在博客看到我的笔记,然后大家想看视频课程也可以到【慕课网】手机 app,去找【Spring Boot 2.0 深度实践】的课程,令人开心的是,课程完全免费! 什么是 Spring Boot? Spring Boot 是由 Pivotal 团队提供的全新框架。Spring Boot...

HoloLens2开发入门教程

本课程为HoloLens2开发入门教程,讲解部署开发环境,安装VS2019,Unity版本,Windows SDK,创建Unity项目,讲解如何使用MRTK,编辑器模拟手势交互,打包VS工程并编译部署应用到HoloLens上等。

最简单的倍频verilog程序(Quartus II)

一个工程文件 几段简单的代码 一个输入一个输出(50Mhz倍频到100Mhz)

计算机组成原理实验教程

西北工业大学计算机组成原理实验课唐都仪器实验帮助,同实验指导书。分为运算器,存储器,控制器,模型计算机,输入输出系统5个章节

4小时玩转微信小程序——基础入门与微信支付实战

这是一个门针对零基础学员学习微信小程序开发的视频教学课程。课程采用腾讯官方文档作为教程的唯一技术资料来源。杜绝网络上质量良莠不齐的资料给学员学习带来的障碍。 视频课程按照开发工具的下载、安装、使用、程序结构、视图层、逻辑层、微信小程序等几个部分组织课程,详细讲解整个小程序的开发过程

面试了一个 31 岁程序员,让我有所触动,30岁以上的程序员该何去何从?

最近面试了一个31岁8年经验的程序猿,让我有点感慨,大龄程序猿该何去何从。

基于RSA通信密钥分发的加密通信

基于RSA通信密钥分发的加密通信,采用pycrypto中的RSA、AES模块实现

不同变质程度煤尘爆炸残留气体特征研究

为分析不同变质程度煤尘爆炸残留气体成分的特征规律,利用水平管道煤尘爆炸实验装置进行了贫瘦煤、肥煤、气煤、长焰煤4种不同变质程度的煤尘爆炸实验,研究了不同变质程度煤尘爆炸后气体残留物含量的差异,并对气体

设计模式(JAVA语言实现)--20种设计模式附带源码

课程亮点: 课程培训详细的笔记以及实例代码,让学员开始掌握设计模式知识点 课程内容: 工厂模式、桥接模式、组合模式、装饰器模式、外观模式、享元模式、原型模型、代理模式、单例模式、适配器模式 策略模式、模板方法模式、观察者模式、迭代器模式、责任链模式、命令模式、备忘录模式、状态模式、访问者模式 课程特色: 笔记设计模式,用笔记串连所有知识点,让学员从一点一滴积累,学习过程无压力 笔记标题采用关键字标识法,帮助学员更加容易记住知识点 笔记以超链接形式让知识点关联起来,形式知识体系 采用先概念后实例再应用方式,知识点深入浅出 提供授课内容笔记作为课后复习以及工作备查工具 部分图表(电脑PC端查看):

MySQL数据库面试题(2020最新版)

文章目录数据库基础知识为什么要使用数据库什么是SQL?什么是MySQL?数据库三大范式是什么mysql有关权限的表都有哪几个MySQL的binlog有有几种录入格式?分别有什么区别?数据类型mysql有哪些数据类型引擎MySQL存储引擎MyISAM与InnoDB区别MyISAM索引与InnoDB索引的区别?InnoDB引擎的4大特性存储引擎选择索引什么是索引?索引有哪些优缺点?索引使用场景(重点)...

软件测试2小时入门

本课程内容系统、全面、简洁、通俗易懂,通过2个多小时的介绍,让大家对软件测试有个系统的理解和认识,具备基本的软件测试理论基础。 主要内容分为5个部分: 1 软件测试概述,了解测试是什么、测试的对象、原则、流程、方法、模型;&nbsp; 2.常用的黑盒测试用例设计方法及示例演示;&nbsp; 3 常用白盒测试用例设计方法及示例演示;&nbsp; 4.自动化测试优缺点、使用范围及示例‘;&nbsp; 5.测试经验谈。

几率大的Redis面试题(含答案)

本文的面试题如下: Redis 持久化机制 缓存雪崩、缓存穿透、缓存预热、缓存更新、缓存降级等问题 热点数据和冷数据是什么 Memcache与Redis的区别都有哪些? 单线程的redis为什么这么快 redis的数据类型,以及每种数据类型的使用场景,Redis 内部结构 redis的过期策略以及内存淘汰机制【~】 Redis 为什么是单线程的,优点 如何解决redis的并发竞争key问题 Red...

手把手实现Java图书管理系统(附源码)

【超实用课程内容】 本课程演示的是一套基于Java的SSM框架实现的图书管理系统,主要针对计算机相关专业的正在做毕设的学生与需要项目实战练习的java人群。详细介绍了图书管理系统的实现,包括:环境搭建、系统业务、技术实现、项目运行、功能演示、系统扩展等,以通俗易懂的方式,手把手的带你从零开始运行本套图书管理系统,该项目附带全部源码可作为毕设使用。 【课程如何观看?】 PC端:https://edu.csdn.net/course/detail/27513 移动端:CSDN 学院APP(注意不是CSDN APP哦) 本课程为录播课,课程2年有效观看时长,大家可以抓紧时间学习后一起讨论哦~ 【学员专享增值服务】 源码开放 课件、课程案例代码完全开放给你,你可以根据所学知识,自行修改、优化

jsp+servlet入门项目实例

jsp+servlet实现班级信息管理项目

winfrom中嵌套html,跟html的交互

winfrom中嵌套html,跟html的交互,源码就在里面一看就懂,很简单

Java面试题大全(2020版)

发现网上很多Java面试题都没有答案,所以花了很长时间搜集整理出来了这套Java面试题大全,希望对大家有帮助哈~ 本套Java面试题大全,全的不能再全,哈哈~ 一、Java 基础 1. JDK 和 JRE 有什么区别? JDK:Java Development Kit 的简称,java 开发工具包,提供了 java 的开发环境和运行环境。 JRE:Java Runtime Environ...

python实现数字水印添加与提取及鲁棒性测试(GUI,基于DCT,含测试图片)

由python写的GUI,可以实现数字水印的添加与提取,提取是根据添加系数的相关性,实现了盲提取。含有两种攻击测试方法(高斯低通滤波、高斯白噪声)。基于python2.7,watermark.py为主

Xshell6完美破解版,亲测可用

Xshell6破解版,亲测可用,分享给大家。直接解压即可使用

你连存活到JDK8中著名的Bug都不知道,我怎么敢给你加薪

CopyOnWriteArrayList.java和ArrayList.java,这2个类的构造函数,注释中有一句话 1 2 3 4 5 6 7 8 9 10 11 12 13 14 15 public ArrayList(Collection&lt;? ...

程序员的算法通关课:知己知彼(第一季)

【超实用课程内容】 程序员对于算法一直又爱又恨!特别是在求职面试时,算法类问题绝对是不可逃避的提问点!本门课程作为算法面试系列的第一季,会从“知己知彼”的角度,聊聊关于算法面试的那些事~ 【哪些人适合学习这门课程?】 求职中的开发者,对于面试算法阶段缺少经验 想了解实际工作中算法相关知识 在职程序员,算法基础薄弱,急需充电 【超人气讲师】 孙秀洋&nbsp;| 服务器端工程师 硕士毕业于哈工大计算机科学与技术专业,ACM亚洲区赛铜奖获得者,先后在腾讯和百度从事一线技术研发,对算法和后端技术有深刻见解。 【课程如何观看?】 PC端:https://edu.csdn.net/course/detail/27272 移动端:CSDN 学院APP(注意不是CSDN APP哦) 本课程为录播课,课程无限观看时长,但是大家可以抓紧时间学习后一起讨论哦~

相关热词 c#设计思想 c#正则表达式 转换 c#form复制 c#写web c# 柱形图 c# wcf 服务库 c#应用程序管理器 c#数组如何赋值给数组 c#序列化应用目的博客园 c# 设置当前标注样式
立即提问