cmake3.4.3重新编译opencv,vs2013,cuda-8.0

最近想使用opencv的GPU模块,就需要用cmake重新编译opencv,
尝试很多中方法,一直不成功,编译老是出错,环境变量也设置了,
真的不知道是什么问题,望大神解答~图片说明

1个回答

为啥要重新编译呢。。。

Csdn user default icon
上传中...
上传图片
插入图片
抄袭、复制答案,以达到刷声望分或其他目的的行为,在CSDN问答是严格禁止的,一经发现立刻封号。是时候展现真正的技术了!
其他相关推荐
vs2015 cmake编译opencv3.1+opencv_contrib报错
在OPENCV_EXTRA_MODULES_PATH,添加opencv_contrib目录后报错,求问是什么问题啊? CMake Error at /Users/Documents/opencv/source/opencv-3.2.0/cmake/OpenCVUtils.cmake:1045 (file): file DOWNLOAD cannot open file for write. Call Stack (most recent call first): /Users/Documents/opencv/source/opencv_contrib-master/modules/dnn/cmake/OpenCVFindLibProtobuf.cmake:32 (ocv_download) /Users/Documents/opencv/source/opencv_contrib-master/modules/dnn/CMakeLists.txt:5 (include) CMake Error at /Users/Documents/opencv/source/opencv-3.2.0/cmake/OpenCVUtils.cmake:1049 (message): Failed to download . Status= Call Stack (most recent call first): /Users/Documents/opencv/source/opencv_contrib-master/modules/dnn/cmake/OpenCVFindLibProtobuf.cmake:32 (ocv_download) /Users/Documents/opencv/source/opencv_contrib-master/modules/dnn/CMakeLists.txt:5 (include)
opencv3.1+cuda7.5+cmake3.5 编译错误
运行环境:win7 64位旗舰版。 重新编译opencv,该添加的库都添加了。但是还是出现了linn error! 编译的时候出现了: frame_source.cpp.obj : error LNK2001: 无法解析的外部符号 "public: static class cv::cuda::GpuMat::Allocator * __cdecl cv::cuda::GpuMat::defaultAllocator(void)" (?defaultAllocator@GpuMat@cuda@cv@@SAPEAVAllocator@123@XZ) 1>optical_flow.cpp.obj : error LNK2001: 无法解析的外部符号 "public: static class cv::cuda::GpuMat::Allocator * __cdecl cv::cuda::GpuMat::defaultAllocator(void)" (?defaultAllocator@GpuMat@cuda@cv@@SAPEAVAllocator@123@XZ) 1>optical_flow.cpp.obj : error LNK2001: 无法解析的外部符号 "public: static class cv::cuda::GpuMat::Allocator * __cdecl cv::cuda::GpuMat::defaultAllocator(void)" (?defaultAllocator@GpuMat@cuda@cv@@SAPEAVAllocator@123@XZ) 类似这些总共2000度个错误。 求大神帮忙!搞了两天也没找出错误。 小弟在此先谢过了!
cmake编译的opencv3.0.0生成的工程无法通过编译
我在windows下用cmake-gui编译opencv3.0(联合opencv contrib master), 生成的工程Opencv.sln在build的时候出现了许多下列类似的错误: ![图片说明](https://img-ask.csdn.net/upload/201602/17/1455675347_444915.png) 请问这是什么原因呢? 系统是windows10,vs2013
windows下cmake编译opencv3.1+opencv_contrib一直报错
错误如下,是在配置“OPENCV_EXTRA_MODULES_PATH” 这个时候报错的 CMake Error at C:/Users/wyq/Downloads/opencv/sources/cmake/OpenCVUtils.cmake:857 (file): file MD5 failed to read file "C:/Users/wyq/Downloads/opencv/opencv_contrib-master/3rdparty/tinydnn/": Permission denied Call Stack (most recent call first): C:/Users/wyq/Downloads/opencv/opencv_contrib-master/modules/dnn_modern/CMakeLists.txt:18 (ocv_download) Downloading ... CMake Error at C:/Users/wyq/Downloads/opencv/sources/cmake/OpenCVUtils.cmake:895 (file): file DOWNLOAD cannot open file for write. Call Stack (most recent call first): C:/Users/wyq/Downloads/opencv/opencv_contrib-master/modules/dnn_modern/CMakeLists.txt:18 (ocv_download) CMake Error at C:/Users/wyq/Downloads/opencv/sources/cmake/OpenCVUtils.cmake:899 (message): Failed to download . Status= Call Stack (most recent call first): C:/Users/wyq/Downloads/opencv/opencv_contrib-master/modules/dnn_modern/CMakeLists.txt:18 (ocv_download) Configuring incomplete, errors occurred! See also "C:/Users/wyq/Downloads/opencv/opencv_contrib-master/CMakeFiles/CMakeOutput.log". See also "C:/Users/wyq/Downloads/opencv/opencv_contrib-master/CMakeFiles/CMakeError.log".
cmake+vs2013编译opencv contrib
cmake编译opencv contrib生成OPENCV.sln后,在vs2013编译过程中出现以下错误 :![图片说明](https://img-ask.csdn.net/upload/201606/15/1465985118_50684.png) ![图片说明](https://img-ask.csdn.net/upload/201606/15/1465985138_303923.png) 已经试过[](http://blog.csdn.net/xizero00/article/details/50823020 "")的方法,试了cmake 3.5.0 3.5.1 3.5.2版本了,问题依旧在。希望有前辈能够提供帮助。 我是win7 64位系统
cmake编译opencv3.2+opencv_contrib一直报错。。
一直会提示这个错,有大神知道原因吗,我把一些依赖包下载下来放固定目录里了。还是该提醒还提醒错。我用的是opencv3.2+vs2015。 CMake Error at H:/OpenCV/opencv/sources/cmake/OpenCVUtils.cmake:1005 (file): file MD5 failed to read file "H:/OpenCV/Library/3rdparty/protobuf/": Permission denied Call Stack (most recent call first): H:/OpenCV/opencv_contrib-master/modules/dnn/cmake/OpenCVFindLibProtobuf.cmake:32 (ocv_download) H:/OpenCV/opencv_contrib-master/modules/dnn/CMakeLists.txt:5 (include)![图片说明](http://forum.csdn.net/PointForum/ui/scripts/csdn/Plugin/003/monkey/11.gif)![图片说明](http://forum.csdn.net/PointForum/ui/scripts/csdn/Plugin/003/monkey/5.gif)
用cmake编译opencv3.4.0后无法找到opencv_world340.lib 的问题
按照网上给的操作做到了最后一部添加依赖项的时候要求添加”opencv_ts340.lib opencv_world340.lib “这些文件,然而惊讶的发现x86->vc11-lib里面没有这些文件,只有其它的lib。怎么办呢?编译都显示成功的呀。 以下是试运行的代码 #include<iostream> #include <opencv2/core/core.hpp> #include <opencv2/highgui/highgui.hpp> using namespace cv; int main() { // 读入一张图片(游戏原画) Mat img = imread("pic.jpg"); // 创建一个名为 "游戏原画"窗口 namedWindow("游戏原画"); // 在窗口中显示游戏原画 imshow("游戏原画", img); // 等待6000 ms后窗口自动关闭 waitKey(6000); }
cmake-gui配置交叉编译OpenCV找不到WITH_LIBV4L和WITH_V4L
Ubuntu 12.04 + cmake 2.8.7 + OpenCV 2.4.9 。使用cmake-gui 交叉编译OpenCV,在Entry的Name中找不到 WITH_VL4 WITH_LIBV4L 选项,但是选择在PC上本地编译时有该两个选项,有大侠了解原因或者了解cmake的运行原理的吗?
用cmake编译opencv3.0 时候出现的问题
CMake Error at CMakeLists.txt:88 (project): No CMAKE_C_COMPILER could be found. 这是什么问题啊! 求大神解决 我是win764位 刚下的opencv3.0 用cmake进行configure就出错 安装的是vs2010
Cmake编译opencv3.0时报错
**CMake Error at D:/VTK7.0/vtk_src/VTK-7.0.0/CMake/vtkModuleAPI.cmake:120 (message): Requested modules not available: ** vtkRenderingOpenGL Call Stack (most recent call first): D:/VTK7.0/vtk_bin/VTKConfig.cmake:75 (vtk_module_config) cmake/OpenCVDetectVTK.cmake:6 (find_package) CMakeLists.txt:584 (include)** **
cuda加速的問題,opencv3.1.0+cuda8.0
使用的是opencv3.1.0+cuda8.0,但是make可以,run出錯。 nvidia@tegra-ubuntu:~$ cd project_wly nvidia@tegra-ubuntu:~/project_wly$ cmake . -- The C compiler identification is GNU 5.4.0 -- The CXX compiler identification is GNU 5.4.0 -- Check for working C compiler: /usr/bin/cc -- Check for working C compiler: /usr/bin/cc -- works -- Detecting C compiler ABI info -- Detecting C compiler ABI info - done -- Detecting C compile features -- Detecting C compile features - done -- Check for working CXX compiler: /usr/bin/c++ -- Check for working CXX compiler: /usr/bin/c++ -- works -- Detecting CXX compiler ABI info -- Detecting CXX compiler ABI info - done -- Detecting CXX compile features -- Detecting CXX compile features - done -- Configuring done -- Generating done -- Build files have been written to: /home/nvidia/project_wly nvidia@tegra-ubuntu:~/project_wly$ make Scanning dependencies of target project_wly [ 50%] Building CXX object CMakeFiles/project_wly.dir/project_wly.cpp.o [100%] Linking CXX executable project_wly [100%] Built target project_wly nvidia@tegra-ubuntu:~/project_wly$ ./project_wly **OpenCV Error: Gpu API call (invalid device symbol) in loadUMax, file /home/nvidia/opencv_3.1/opencv-3.1.0/modules/cudafeatures2d/src/cuda/orb.cu, line 148 terminate called after throwing an instance of 'cv::Exception' what(): /home/nvidia/opencv_3.1/opencv-3.1.0/modules/cudafeatures2d/src/cuda/orb.cu:148: error: (-217) invalid device symbol in function loadUMax** Aborted (core dumped) nvidia@tegra-ubuntu:~/project_wly$ 求教各位大神,怎麼解決這個問題?
为什么Opencv3.4.0使用make编译时出现错误?
环境:Debian(Raspiberry Pi Buster) cmake version: 3.0.2 gcc version: 8.2.0 python version: 3.7.2 make version: 4.2.1 本来计划用opencv基于python进行图像辨别 在使用cmake配置完成后使用make命令编译: ``` sudo make ``` 编译到大约90%时,出现如下错误: ``` #这是之前很多条控制台信息中的warning warning: cast between incompatible function types from ‘PyObject* (*)(PyObject*, PyObject*, PyObject*)’ {aka ‘_object* (*)(_object*, _object*, _object*)’} to ‘PyCFunction’ {aka ‘_object* (*)(_object*, _object*)’} [-Wcast-function-type] ``` ``` #make错误,退出 make[2]: *** [modules/python3/CMakeFiles/opencv_python3.dir/build.make:56: modules/python3/CMakeFiles/opencv_python3.dir/__/src2/cv2.cpp.o] Error 1 make[1]: *** [CMakeFiles/Makefile2:21149: modules/python3/CMakeFiles/opencv_python3.dir/all] Error 2 make: *** [Makefile:138: all] Error 2 ``` 如图(图1中使用了make -i选项忽略错误,继续编译剩余部分,但open_cv python3没有成功编译): ![图片说明](https://img-ask.csdn.net/upload/201908/11/1565498546_278259.png) (图2显示了make的错误) ![图片说明](https://img-ask.csdn.net/upload/201908/11/1565499335_385379.png) ``` #忽略错误后出现的c++error c++: error: Cmakefiles/opencv_python3.dir/__/src2/cv2.cpp.o No such file or dictionary ``` 在网上看到的编译错误的例子都和这个有所区别,没有能够很好地解决问题。有的说这是gcc编译器的问题 希望各位大佬们能够帮忙分析一下错误的原因,因为我的项目急需配置好opencv,也没有其它更好的替代,谢谢~
opencv2.4.9+vs2013 重新编译错误
我是64位机,但是编译的的是32位的库文件,用编译得到的文件测试程序,结果:OpenCV Error: Unspecified error (The function is not implemented. Rebuild the library with Windows, GTK+ 2.x or Carbon support. If you are on Ubuntu or Debian, install libgtk2.0-dev and pkg-config, th en re-run cmake or configure script) in cvShowImage, file D:\opencv\sources\modules\highgui\src\wind ow.cpp, line 501 请按任意键继续. . . 然后程序就崩溃退出了,求各位指导!!!!
vs2019+opencv3.4.5+opencv_contrib3.4.5,cmake成功但是重新生成时有大量失败的情况
按照教程成功生成opencv.sln,在vs里点重新生成解决方案时候有很多失败,我看了下全是报的无法打开opencvworld345d.lib ![图片说明](https://img-ask.csdn.net/upload/201906/28/1561687517_322868.png) 我发现那个路径下确实没有opencvworld345d.lib。是我cmake的时候不完全吗?
windows环境下codeblocks17.12 用cmake配置opencv3.4.7出现如下错误
试了好多次了,参考了不少博主的文章编译,还是有错 ``` F:/mingw64/bin/../lib/gcc/x86_64-w64-mingw32/7.3.0/../../../../x86_64-w64-mingw32/bin/ld.exe: i386 architecture of input file `CMakeFiles\opencv_core.dir/objects.a(vs_version.rc.obj)' is incompatible with i386:x86-64 output collect2.exe: error: ld returned 1 exit status modules\core\CMakeFiles\opencv_core.dir\build.make:1843: recipe for target 'bin/libopencv_core340.dll' failed mingw32-make[2]: *** [bin/libopencv_core340.dll] Error 1 CMakeFiles\Makefile2:1686: recipe for target 'modules/core/CMakeFiles/opencv_core.dir/all' failed mingw32-make[1]: *** [modules/core/CMakeFiles/opencv_core.dir/all] Error 2 Makefile:161: recipe for target 'all' failed mingw32-make: *** [all] Error 2 ```
cmake编译opencv出错:求指导
编译opencv时候,出现如下提示: CMake Error at calib3d/CMakeLists.txt:1 (define_opencv_module): Unknown CMake command "define_opencv_module". CMake Warning (dev) in CMakeLists.txt: No cmake_minimum_required command is present. A line of code such as cmake_minimum_required(VERSION 3.4) should be added at the top of the file. The version specified may be lower if you wish to support older CMake versions for this project. For more information run "cmake --help-policy CMP0000". This warning is for project developers. Use -Wno-dev to suppress it. 为什么说define_opencv_module没有这个命令呢?我用的opencv2.3.1 我看了所有的cmakelist.txt,除了第一个androidcamera文件夹下是 IF(NOT ANDROID) MESSAGE( FATAL_ERROR "This project is for ANDROID only" ) ENDIF() if (BUILD_ANDROID_CAMERA_WRAPPER) add_subdirectory(camera_wrapper) endif() ........ 其他的都是以define_opencv_module开始的,请问该怎么弄呢? 另外有没有什么其他的可以快速查看opencv函数定义的方法呀?
【已经解决】 Win10环境下采用CMake编译OpenCV项目,提示无法找到opencv
1. 安装过OpenCV 4.1 win pack版本,同时安装的Intel Sensor SDK第三方软件中有opencv 3.4版本。 都按照操作要求添加了环境变量路径。 2. 采用CMake编译一个文件出现一直提示错误,这个错误应该是很多人都遇到过的。 CMakeLists.txt文件内容如下: cmake_minimum_required(VERSION 3.10) project(CvTrack) set(CMAKE_BUILD_TYPE Debug) set(OpenCV_DIR "D:/opencv/build") find_package(OpenCV REQUIRED) add_executable(CvTracking "main.cpp") target_link_libraries(CvTrack ${OpenCV_LIBS}) ********************************************************************************************************************************************************** 产生的错误提示: Selecting Windows SDK version 10.0.17763.0 to target Windows 10.0.18362. OpenCV ARCH: x86 OpenCV RUNTIME: vc14 OpenCV STATIC: OFF CMake Warning at D:/opencv/build/OpenCVConfig.cmake:166 (message): Found OpenCV Windows Pack but it has no binaries compatible with your configuration. You should manually point CMake variable OpenCV_DIR to your build of OpenCV library. Call Stack (most recent call first): CMakeLists.txt:15 (find_package) CMake Error at CMakeLists.txt:15 (find_package): Found package configuration file: D:/opencv/build/OpenCVConfig.cmake but it set OpenCV_FOUND to FALSE so package "OpenCV" is considered to be NOT FOUND. ![图片说明](https://img-ask.csdn.net/upload/201912/09/1575860198_340992.png) 安装目录如下: ![图片说明](https://img-ask.csdn.net/upload/201912/09/1575860277_399662.png) ![图片说明](https://img-ask.csdn.net/upload/201912/09/1575860289_707476.png) 请问,这个问题如何解决呢?? /==/==/==/==/==/==/==/==/==/==/==/==/==/==/==/==/==/== 解决方法: 主要原因:根据提示,OpenCVConfig.cmake文件有问题;实际在OpenCV 4.1 wind pack安装版本中,OpenCVConfig.cmake在其它路径下也有一个文件,修改路径即。 其次原因:设定的工程名为CvTrack,在add\_excuatable中的TargetName不对应。所以:重新修正了一下CMakeLists.txt: cmake_minimum_required(VERSION 3.10) project(CvTrack) set(OpenCV_DIR "D:/opencv/build/x64/vc15/lib") # 错误修正 find_package(OpenCV REQUIRED) include_directories(${OpenCV_INCLUDE_DIRS}) add_executable(CvTrack "main.cpp") # 错误修正 target_link_libraries(CvTrack ${OpenCV_LIBS})
谁能帮忙看一下OpenCV 3.4.1源码的类型转换编译错误?
环境: 1. Ubuntu 12.04 LTS 2. cmake 3.5.1 3. OpenCV 3.4.1源码 4. Arm Cortex-A7 NXP i.MX6Q 5. 已经sudo为root 执行过程 cd opencv-3.4.1 mkdir build cd build cmakd -D CMAKE_BUILD_TYPE=Relase -D CMAKE_INSTALL_PREFIX=/usr/local .. make make install 出错提示: [ 0%] Built target gen-pkgconfig [ 9%] Built target libwebp [ 14%] Built target IlmImf [ 20%] Built target libprotobuf [ 23%] Built target carotene_objs [ 24%] Built target tegra_hal [ 24%] Built target opencv_ts_pch_dephelp [ 24%] Built target pch_Generate_opencv_ts [ 25%] Built target opencv_core_pch_dephelp [ 25%] Built target pch_Generate_opencv_core [ 31%] Built target opencv_core [ 31%] Built target opencv_imgproc_pch_dephelp [ 31%] Built target pch_Generate_opencv_imgproc [ 31%] Building CXX object modules/imgproc/CMakeFiles/opencv_imgproc.dir/src/smooth.cpp.o /home/linaro/opencv-3.4.1/modules/imgproc/src/smooth.cpp: In function ‘void cv::vlineSmooth1N(const FT* const*, const FT*, int, ET*, int) [with ET = unsigned char, FT = {anonymous}::ufixedpoint16]’: /home/linaro/opencv-3.4.1/modules/imgproc/src/smooth.cpp:2676:31: error: conversion from ‘{anonymous}::ufixedpoint32’ to ‘cv::uint8_t {aka unsigned char}’ is ambiguous /home/linaro/opencv-3.4.1/modules/imgproc/src/smooth.cpp:2676:31: note: candidates are: /home/linaro/opencv-3.4.1/modules/imgproc/src/fixedpoint.inl.hpp:223:22: note: {anonymous}::ufixedpoint32::operator float() const /home/linaro/opencv-3.4.1/modules/imgproc/src/fixedpoint.inl.hpp:222:22: note: {anonymous}::ufixedpoint32::operator double() const /home/linaro/opencv-3.4.1/modules/imgproc/src/fixedpoint.inl.hpp:221:22: note: {anonymous}::ufixedpoint32::operator ET() const [with ET = unsigned char] /home/linaro/opencv-3.4.1/modules/imgproc/src/smooth.cpp: In function ‘void cv::vlineSmooth1N1(const FT* const*, const FT*, int, ET*, int) [with ET = unsigned char, FT = {anonymous}::ufixedpoint16]’: /home/linaro/opencv-3.4.1/modules/imgproc/src/smooth.cpp:2693:24: error: conversion from ‘const {anonymous}::ufixedpoint16’ to ‘cv::uint8_t {aka unsigned char}’ is ambiguous /home/linaro/opencv-3.4.1/modules/imgproc/src/smooth.cpp:2693:24: note: candidates are: /home/linaro/opencv-3.4.1/modules/imgproc/src/fixedpoint.inl.hpp:289:22: note: {anonymous}::ufixedpoint16::operator float() const /home/linaro/opencv-3.4.1/modules/imgproc/src/fixedpoint.inl.hpp:288:22: note: {anonymous}::ufixedpoint16::operator double() const /home/linaro/opencv-3.4.1/modules/imgproc/src/fixedpoint.inl.hpp:287:22: note: {anonymous}::ufixedpoint16::operator ET() const [with ET = unsigned char] /home/linaro/opencv-3.4.1/modules/imgproc/src/smooth.cpp: In function ‘void cv::vlineSmooth3N(const FT* const*, const FT*, int, ET*, int) [with ET = unsigned char, FT = {anonymous}::ufixedpoint16]’: /home/linaro/opencv-3.4.1/modules/imgproc/src/smooth.cpp:2740:71: error: conversion from ‘{anonymous}::ufixedpoint32’ to ‘cv::uint8_t {aka unsigned char}’ is ambiguous /home/linaro/opencv-3.4.1/modules/imgproc/src/smooth.cpp:2740:71: note: candidates are: /home/linaro/opencv-3.4.1/modules/imgproc/src/fixedpoint.inl.hpp:223:22: note: {anonymous}::ufixedpoint32::operator float() const /home/linaro/opencv-3.4.1/modules/imgproc/src/fixedpoint.inl.hpp:222:22: note: {anonymous}::ufixedpoint32::operator double() const /home/linaro/opencv-3.4.1/modules/imgproc/src/fixedpoint.inl.hpp:221:22: note: {anonymous}::ufixedpoint32::operator ET() const [with ET = unsigned char] /home/linaro/opencv-3.4.1/modules/imgproc/src/smooth.cpp: In function ‘void cv::vlineSmooth5N(const FT* const*, const FT*, int, ET*, int) [with ET = unsigned char, FT = {anonymous}::ufixedpoint16]’: /home/linaro/opencv-3.4.1/modules/imgproc/src/smooth.cpp:2816:109: error: conversion from ‘{anonymous}::ufixedpoint32’ to ‘cv::uint8_t {aka unsigned char}’ is ambiguous /home/linaro/opencv-3.4.1/modules/imgproc/src/smooth.cpp:2816:109: note: candidates are: /home/linaro/opencv-3.4.1/modules/imgproc/src/fixedpoint.inl.hpp:223:22: note: {anonymous}::ufixedpoint32::operator float() const /home/linaro/opencv-3.4.1/modules/imgproc/src/fixedpoint.inl.hpp:222:22: note: {anonymous}::ufixedpoint32::operator double() const /home/linaro/opencv-3.4.1/modules/imgproc/src/fixedpoint.inl.hpp:221:22: note: {anonymous}::ufixedpoint32::operator ET() const [with ET = unsigned char] /home/linaro/opencv-3.4.1/modules/imgproc/src/smooth.cpp: In function ‘void cv::vlineSmooth(const FT* const*, const FT*, int, ET*, int) [with ET = unsigned char, FT = {anonymous}::ufixedpoint16]’: /home/linaro/opencv-3.4.1/modules/imgproc/src/smooth.cpp:2919:18: error: conversion from ‘{anonymous}::ufixedpoint32’ to ‘cv::uint8_t {aka unsigned char}’ is ambiguous /home/linaro/opencv-3.4.1/modules/imgproc/src/smooth.cpp:2914:23: note: candidates are: /home/linaro/opencv-3.4.1/modules/imgproc/src/fixedpoint.inl.hpp:223:22: note: {anonymous}::ufixedpoint32::operator float() const /home/linaro/opencv-3.4.1/modules/imgproc/src/fixedpoint.inl.hpp:222:22: note: {anonymous}::ufixedpoint32::operator double() const /home/linaro/opencv-3.4.1/modules/imgproc/src/fixedpoint.inl.hpp:221:22: note: {anonymous}::ufixedpoint32::operator ET() const [with ET = unsigned char] make[2]: *** [modules/imgproc/CMakeFiles/opencv_imgproc.dir/src/smooth.cpp.o] Error 1 make[1]: *** [modules/imgproc/CMakeFiles/opencv_imgproc.dir/all] Error 2 make: *** [all] Error 2 说明: 关键之处是 /home/linaro/opencv-3.4.1/modules/imgproc/src/smooth.cpp:2919:18: error: conversion from ‘{anonymous}::ufixedpoint32’ to ‘cv::uint8_t {aka unsigned char}’ is ambiguous 类型转换错误。 请教各位大侠,这个错误出在哪里,如何解决呢? 谢谢!
相见恨晚的超实用网站
相见恨晚的超实用网站 持续更新中。。。
字节跳动视频编解码面经
三四月份投了字节跳动的实习(图形图像岗位),然后hr打电话过来问了一下会不会opengl,c++,shador,当时只会一点c++,其他两个都不会,也就直接被拒了。 七月初内推了字节跳动的提前批,因为内推没有具体的岗位,hr又打电话问要不要考虑一下图形图像岗,我说实习投过这个岗位不合适,不会opengl和shador,然后hr就说秋招更看重基础。我当时想着能进去就不错了,管他哪个岗呢,就同意了面试...
Java学习的正确打开方式
在博主认为,对于入门级学习java的最佳学习方法莫过于视频+博客+书籍+总结,前三者博主将淋漓尽致地挥毫于这篇博客文章中,至于总结在于个人,实际上越到后面你会发现学习的最好方式就是阅读参考官方文档其次就是国内的书籍,博客次之,这又是一个层次了,这里暂时不提后面再谈。博主将为各位入门java保驾护航,各位只管冲鸭!!!上天是公平的,只要不辜负时间,时间自然不会辜负你。 何谓学习?博主所理解的学习,它是一个过程,是一个不断累积、不断沉淀、不断总结、善于传达自己的个人见解以及乐于分享的过程。
程序员必须掌握的核心算法有哪些?
由于我之前一直强调数据结构以及算法学习的重要性,所以就有一些读者经常问我,数据结构与算法应该要学习到哪个程度呢?,说实话,这个问题我不知道要怎么回答你,主要取决于你想学习到哪些程度,不过针对这个问题,我稍微总结一下我学过的算法知识点,以及我觉得值得学习的算法。这些算法与数据结构的学习大多数是零散的,并没有一本把他们全部覆盖的书籍。下面是我觉得值得学习的一些算法以及数据结构,当然,我也会整理一些看过...
大学四年自学走来,这些私藏的实用工具/学习网站我贡献出来了
大学四年,看课本是不可能一直看课本的了,对于学习,特别是自学,善于搜索网上的一些资源来辅助,还是非常有必要的,下面我就把这几年私藏的各种资源,网站贡献出来给你们。主要有:电子书搜索、实用工具、在线视频学习网站、非视频学习网站、软件下载、面试/求职必备网站。 注意:文中提到的所有资源,文末我都给你整理好了,你们只管拿去,如果觉得不错,转发、分享就是最大的支持了。 一、电子书搜索 对于大部分程序员...
linux系列之常用运维命令整理笔录
本博客记录工作中需要的linux运维命令,大学时候开始接触linux,会一些基本操作,可是都没有整理起来,加上是做开发,不做运维,有些命令忘记了,所以现在整理成博客,当然vi,文件操作等就不介绍了,慢慢积累一些其它拓展的命令,博客不定时更新 free -m 其中:m表示兆,也可以用g,注意都要小写 Men:表示物理内存统计 total:表示物理内存总数(total=used+free) use...
比特币原理详解
一、什么是比特币 比特币是一种电子货币,是一种基于密码学的货币,在2008年11月1日由中本聪发表比特币白皮书,文中提出了一种去中心化的电子记账系统,我们平时的电子现金是银行来记账,因为银行的背后是国家信用。去中心化电子记账系统是参与者共同记账。比特币可以防止主权危机、信用风险。其好处不多做赘述,这一层面介绍的文章很多,本文主要从更深层的技术原理角度进行介绍。 二、问题引入 假设现有4个人...
python学习方法总结(内附python全套学习资料)
不要再问我python好不好学了 我之前做过半年少儿编程老师,一个小学四年级的小孩子都能在我的教学下独立完成python游戏,植物大战僵尸简单版,如果要肯花时间,接下来的网络开发也不是问题,人工智能也可以学个调包也没啥问题。。。。。所以python真的是想学就一定能学会的!!!! --------------------华丽的分割线-------------------------------- ...
python 简易微信实现(注册登录+数据库存储+聊天+GUI+文件传输)
socket+tkinter详解+简易微信实现 历经多天的努力,查阅了许多大佬的博客后终于实现了一个简易的微信O(∩_∩)O~~ 简易数据库的实现 使用pands+CSV实现数据库框架搭建 import socket import threading from pandas import * import pymysql import csv # 创建DataFrame对象 # 存储用户数据的表(...
程序员接私活怎样防止做完了不给钱?
首先跟大家说明一点,我们做 IT 类的外包开发,是非标品开发,所以很有可能在开发过程中会有这样那样的需求修改,而这种需求修改很容易造成扯皮,进而影响到费用支付,甚至出现做完了项目收不到钱的情况。 那么,怎么保证自己的薪酬安全呢? 我们在开工前,一定要做好一些证据方面的准备(也就是“讨薪”的理论依据),这其中最重要的就是需求文档和验收标准。一定要让需求方提供这两个文档资料作为开发的基础。之后开发...
网页实现一个简单的音乐播放器(大佬别看。(⊙﹏⊙))
今天闲着无事,就想写点东西。然后听了下歌,就打算写个播放器。 于是乎用h5 audio的加上js简单的播放器完工了。 演示地点演示 html代码如下` music 这个年纪 七月的风 音乐 ` 然后就是css`*{ margin: 0; padding: 0; text-decoration: none; list-...
Python十大装B语法
Python 是一种代表简单思想的语言,其语法相对简单,很容易上手。不过,如果就此小视 Python 语法的精妙和深邃,那就大错特错了。本文精心筛选了最能展现 Python 语法之精妙的十个知识点,并附上详细的实例代码。如能在实战中融会贯通、灵活使用,必将使代码更为精炼、高效,同时也会极大提升代码B格,使之看上去更老练,读起来更优雅。
数据库优化 - SQL优化
以实际SQL入手,带你一步一步走上SQL优化之路!
2019年11月中国大陆编程语言排行榜
2019年11月2日,我统计了某招聘网站,获得有效程序员招聘数据9万条。针对招聘信息,提取编程语言关键字,并统计如下: 编程语言比例 rank pl_ percentage 1 java 33.62% 2 cpp 16.42% 3 c_sharp 12.82% 4 javascript 12.31% 5 python 7.93% 6 go 7.25% 7 p...
通俗易懂地给女朋友讲:线程池的内部原理
餐盘在灯光的照耀下格外晶莹洁白,女朋友拿起红酒杯轻轻地抿了一小口,对我说:“经常听你说线程池,到底线程池到底是个什么原理?”
《奇巧淫技》系列-python!!每天早上八点自动发送天气预报邮件到QQ邮箱
将代码部署服务器,每日早上定时获取到天气数据,并发送到邮箱。 也可以说是一个小型人工智障。 知识可以运用在不同地方,不一定非是天气预报。
经典算法(5)杨辉三角
杨辉三角 是经典算法,这篇博客对它的算法思想进行了讲解,并有完整的代码实现。
Python实例大全(基于Python3.7.4)
博客说明: 这是自己写的有关python语言的一篇综合博客。 只作为知识广度和编程技巧学习,不过于追究学习深度,点到即止、会用即可。 主要是基础语句,如三大控制语句(顺序、分支、循环),随机数的生成,数据类型的区分和使用; 也会涉及常用的算法和数据结构,以及面试题相关经验; 主体部分是针对python的数据挖掘和数据分析,主要先攻爬虫方向:正则表达式匹配,常用数据清洗办法,scrapy及其他爬虫框架,数据存储方式及其实现; 最后还会粗略涉及人工智能领域,玩转大数据与云计算、进行相关的预测和分析。
腾讯算法面试题:64匹马8个跑道需要多少轮才能选出最快的四匹?
昨天,有网友私信我,说去阿里面试,彻底的被打击到了。问了为什么网上大量使用ThreadLocal的源码都会加上private static?他被难住了,因为他从来都没有考虑过这个问题。无独有偶,今天笔者又发现有网友吐槽了一道腾讯的面试题,我们一起来看看。 腾讯算法面试题:64匹马8个跑道需要多少轮才能选出最快的四匹? 在互联网职场论坛,一名程序员发帖求助到。二面腾讯,其中一个算法题:64匹...
面试官:你连RESTful都不知道我怎么敢要你?
干货,2019 RESTful最贱实践
刷了几千道算法题,这些我私藏的刷题网站都在这里了!
遥想当年,机缘巧合入了 ACM 的坑,周边巨擘林立,从此过上了"天天被虐似死狗"的生活… 然而我是谁,我可是死狗中的战斗鸡,智力不够那刷题来凑,开始了夜以继日哼哧哼哧刷题的日子,从此"读题与提交齐飞, AC 与 WA 一色 ",我惊喜的发现被题虐既刺激又有快感,那一刻我泪流满面。这么好的事儿作为一个正直的人绝不能自己独享,经过激烈的颅内斗争,我决定把我私藏的十几个 T 的,阿不,十几个刷题网...
为啥国人偏爱Mybatis,而老外喜欢Hibernate/JPA呢?
关于SQL和ORM的争论,永远都不会终止,我也一直在思考这个问题。昨天又跟群里的小伙伴进行了一番讨论,感触还是有一些,于是就有了今天这篇文。 声明:本文不会下关于Mybatis和JPA两个持久层框架哪个更好这样的结论。只是摆事实,讲道理,所以,请各位看官勿喷。 一、事件起因 关于Mybatis和JPA孰优孰劣的问题,争论已经很多年了。一直也没有结论,毕竟每个人的喜好和习惯是大不相同的。我也看...
SQL-小白最佳入门sql查询一
不要偷偷的查询我的个人资料,即使你再喜欢我,也不要这样,真的不好;
JavaScript 为什么能活到现在?
作者 | 司徒正美 责编 |郭芮 出品 | CSDN(ID:CSDNnews) JavaScript能发展到现在的程度已经经历不少的坎坷,早产带来的某些缺陷是永久性的,因此浏览器才有禁用JavaScript的选项。甚至在jQuery时代有人问出这样的问题,jQuery与JavaScript哪个快?在Babel.js出来之前,发明一门全新的语言代码代替JavaScript...
项目中的if else太多了,该怎么重构?
介绍 最近跟着公司的大佬开发了一款IM系统,类似QQ和微信哈,就是聊天软件。我们有一部分业务逻辑是这样的 if (msgType = "文本") { // dosomething } else if(msgType = "图片") { // doshomething } else if(msgType = "视频") { // doshomething } else { // doshom...
Nginx 原理和架构
Nginx 是一个免费的,开源的,高性能的 HTTP 服务器和反向代理,以及 IMAP / POP3 代理服务器。Nginx 以其高性能,稳定性,丰富的功能,简单的配置和低资源消耗而闻名。 Nginx 的整体架构 Nginx 里有一个 master 进程和多个 worker 进程。master 进程并不处理网络请求,主要负责调度工作进程:加载配置、启动工作进程及非停升级。worker 进程负责处...
致 Python 初学者
欢迎来到“Python进阶”专栏!来到这里的每一位同学,应该大致上学习了很多 Python 的基础知识,正在努力成长的过程中。在此期间,一定遇到了很多的困惑,对未来的学习方向感到迷茫。我非常理解你们所面临的处境。我从2007年开始接触 python 这门编程语言,从2009年开始单一使用 python 应对所有的开发工作,直至今天。回顾自己的学习过程,也曾经遇到过无数的困难,也曾经迷茫过、困惑过。开办这个专栏,正是为了帮助像我当年一样困惑的 Python 初学者走出困境、快速成长。希望我的经验能真正帮到你
Python 编程开发 实用经验和技巧
Python是一门很灵活的语言,也有很多实用的方法,有时候实现一个功能可以用多种方法实现,我这里总结了一些常用的方法和技巧,包括小数保留指定位小数、判断变量的数据类型、类方法@classmethod、制表符中文对齐、遍历字典、datetime.timedelta的使用等,会持续更新......
吐血推荐珍藏的Visual Studio Code插件
作为一名Java工程师,由于工作需要,最近一个月一直在写NodeJS,这种经历可以说是一部辛酸史了。好在有神器Visual Studio Code陪伴,让我的这段经历没有更加困难。眼看这段经历要告一段落了,今天就来给大家分享一下我常用的一些VSC的插件。 VSC的插件安装方法很简单,只需要点击左侧最下方的插件栏选项,然后就可以搜索你想要的插件了。 下面我们进入正题 Material Theme ...
“狗屁不通文章生成器”登顶GitHub热榜,分分钟写出万字形式主义大作
一、垃圾文字生成器介绍 最近在浏览GitHub的时候,发现了这样一个骨骼清奇的雷人项目,而且热度还特别高。 项目中文名:狗屁不通文章生成器 项目英文名:BullshitGenerator 根据作者的介绍,他是偶尔需要一些中文文字用于GUI开发时测试文本渲染,因此开发了这个废话生成器。但由于生成的废话实在是太过富于哲理,所以最近已经被小伙伴们给玩坏了。 他的文风可能是这样的: 你发现,...
程序员:我终于知道post和get的区别
是一个老生常谈的话题,然而随着不断的学习,对于以前的认识有很多误区,所以还是需要不断地总结的,学而时习之,不亦说乎
相关热词 c#委托 逆变与协变 c#新建一个项目 c#获取dll文件路径 c#子窗体调用主窗体事件 c# 拷贝目录 c# 调用cef 网页填表c#源代码 c#部署端口监听项目、 c#接口中的属性使用方法 c# 昨天
立即提问