opencv配置不成功问题 3C

我按照网上和csdn一些博客上的教程配置opencv 3.2+vs2015,总是不成功,后来换成3.1也不成功,include都会出错,不知道什么原因,求大神解答。
网上的全是告诉我先配置环境变量、配置VC++的库目录还有包含目录,还有链接器的附加依赖项神马的,可还是配置不成功,头文件总是include不进去。。。![![图片说明](https://img-ask.csdn.net/upload/201702/11/1486783510_475176.png)图片说明](https://img-ask.csdn.net/upload/201702/11/1486783279_389459.png)图片说明

3个回答

OPENCV3.2只支持VS2015 X64环境,其实配置起来各个版本都差不多,进入环境变量里面找到Path项在后面添加opencv的bin目录路径,在OPENCV属性页做相应配置,注意包含目录需要有include,以及里面的opencv,opencv2三个文件夹的路径,lib路径只有一个,还有就是在链接器-输入目录下添加opencv_world320.lib(对应release模式)或opencv_world320d.lib(对应debug模式),这样就没问题了。
注意要选择x64编译环境

3.2的没用过,环境变量和包含路径选X86试试,老版本的不管系统是32位还是64位,路径目录都是选择X86,因为编译都是使用32位编译;如果选用X64,则程序运行时候会出错。

Csdn user default icon
上传中...
上传图片
插入图片
抄袭、复制答案,以达到刷声望分或其他目的的行为,在CSDN问答是严格禁止的,一经发现立刻封号。是时候展现真正的技术了!
其他相关推荐
初次配置opencv2.4.2和vs2010配置不成功,求助!!!!

初次学习opencv在配置的时候详细的按照教程来配置的,程序编译也没有问题; 最后运行的时候提示出现以下错误: “opencvtest.exe”: 已加载“D:\vision\opencvtest\Debug\opencvtest.exe”,已加载符号。 “opencvtest.exe”: 已加载“C:\Windows\SysWOW64\ntdll.dll”,已加载符号(去除源信息)。 “opencvtest.exe”: 已加载“C:\Windows\SysWOW64\kernel32.dll”,已加载符号(去除源信息)。 “opencvtest.exe”: 已加载“C:\Windows\SysWOW64\KernelBase.dll”,已加载符号(去除源信息)。 “opencvtest.exe”: 已加载“C:\Windows\SysWOW64\opencv_core242d.dll”,Cannot find or open the PDB file “opencvtest.exe”: 已加载“C:\Windows\SysWOW64\msvcp100d.dll”,已加载符号(去除源信息)。 程序“[6332] opencvtest.exe: 本机”已退出,返回值为 -1073741701 (0xc000007b)![图片说明](https://img-ask.csdn.net/upload/201709/23/1506168670_700950.png)。 这个要怎么解决啊?困扰一下午了,希望大神们带带我这个新手!

大神们帮帮忙,opencv配置编译不成功(要哭了)

win7在vs2010上配置opencv3.0 按网上教程配置好了环境变量以及vs2010 输入opencv的一个小程序: #include <opencv2\opencv.hpp> #include<iostream> using namespace cv; void main() { IplImage *src; src = cvLoadImage("lena.jpg"); //这里将lena.jpg和lena.cpp文件放在同一个文件夹下 cvNamedWindow("lena",CV_WINDOW_AUTOSIZE); cvShowImage("lena",src); cvWaitKey(0); cvDestroyWindow("lena"); cvReleaseImage(&src); } 编译结果: 1>------ Build started: Project: lena, Configuration: Debug Win32 ------ 1>Build started 2015/3/9 9:06:02. 1>InitializeBuildStatus: 1> Touching "Debug\lena.unsuccessfulbuild". 1>ClCompile: 1> lena.cpp 1>d:\opencv\build\include\opencv2\core\mat.hpp(1413): warning C4819: The file contains a character that cannot be represented in the current code page (936). Save the file in Unicode format to prevent data loss 1>d:\opencv\build\include\opencv2\core\mat.hpp(1413): warning C4819: The file contains a character that cannot be represented in the current code page (936). Save the file in Unicode format to prevent data loss 1>c:\users\apple\desktop\documents\visual studio 2010\projects\lena\lena\lena.cpp(6): error C2065: 'IplImage' : undeclared identifier 1>c:\users\apple\desktop\documents\visual studio 2010\projects\lena\lena\lena.cpp(6): error C2065: 'src' : undeclared identifier 1>c:\users\apple\desktop\documents\visual studio 2010\projects\lena\lena\lena.cpp(7): error C2065: 'src' : undeclared identifier 1>c:\users\apple\desktop\documents\visual studio 2010\projects\lena\lena\lena.cpp(7): error C3861: 'cvLoadImage': identifier not found 1>c:\users\apple\desktop\documents\visual studio 2010\projects\lena\lena\lena.cpp(8): error C2065: 'CV_WINDOW_AUTOSIZE' : undeclared identifier 1>c:\users\apple\desktop\documents\visual studio 2010\projects\lena\lena\lena.cpp(8): error C3861: 'cvNamedWindow': identifier not found 1>c:\users\apple\desktop\documents\visual studio 2010\projects\lena\lena\lena.cpp(9): error C2065: 'src' : undeclared identifier 1>c:\users\apple\desktop\documents\visual studio 2010\projects\lena\lena\lena.cpp(9): error C3861: 'cvShowImage': identifier not found 1>c:\users\apple\desktop\documents\visual studio 2010\projects\lena\lena\lena.cpp(10): error C3861: 'cvWaitKey': identifier not found 1>c:\users\apple\desktop\documents\visual studio 2010\projects\lena\lena\lena.cpp(11): error C3861: 'cvDestroyWindow': identifier not found 1>c:\users\apple\desktop\documents\visual studio 2010\projects\lena\lena\lena.cpp(12): error C2065: 'src' : undeclared identifier 1>c:\users\apple\desktop\documents\visual studio 2010\projects\lena\lena\lena.cpp(12): error C3861: 'cvReleaseImage': identifier not found 1> 1>Build FAILED. 1> 1>Time Elapsed 00:00:02.25 ========== Build: 0 succeeded, 1 failed, 0 up-to-date, 0 skipped ========== 然后尝试输入: #include <stdio.h> #include <iostream> int main() { printf("Hello world!"); return 0; } 编译也不成功 1>------ Build started: Project: lena, Configuration: Debug Win32 ------ 1>Build started 2015/3/9 9:12:16. 1>InitializeBuildStatus: 1> Touching "Debug\lena.unsuccessfulbuild". 1>ClCompile: 1> lena.cpp 1>ManifestResourceCompile: 1> All outputs are up-to-date. 1>LINK : fatal error LNK1104: cannot open file 'opencv_calib3d300.lib' 1> 1>Build FAILED. 1> 1>Time Elapsed 00:00:03.02 ========== Build: 0 succeeded, 1 failed, 0 up-to-date, 0 skipped ========== 为什么啊55555~,版本号也是对的呀,为什么打不开opencv_calib3d300.lib

opencv安装不成功,求大神们指点!!

为啥配置opencv2.4.4后,用VS2012运行下面代码时会出现“fatal error LNK1112: 模块计算机类型“X86”与目标计算机类型“x64”冲突”? #define _CRT_SECURE_NO_DEPRECATE #include <iostream> #include "opencv/cv.h" #include "opencv/cxcore.h" #include "opencv/highgui.h" #include "opencv/cvwimage.h" using namespace std; int _tmain(int argc,char* argv[]) { IplImage* img = cvLoadImage("D:\\Jellyfish.jpg"); cvNamedWindow("example1",CV_WINDOW_AUTOSIZE); cvShowImage("example1",img); cvWaitKey(0); cvReleaseImage(&img); cvDestroyWindow("example1"); return 0; }

Cmake 配置 Opencv3.0 出现问题

试了多次,用Cmake 配置Opencv 出现如下提示: CMake Error at CMakeLists.txt:98 (project): No CMAKE_CXX_COMPILER could be found. vs 为64位的vs 15;opencv3.2 求大神指导,捣鼓了几个小时不知道怎么解决!!!!

opencv配置成功后,进行测试时出错

CMake Warning at /home/obvious/opencv/cmake/OpenCVConfig.cmake:166 (message): Found OpenCV Windows Pack but it has no binaries compatible with your configuration. You should manually point CMake variable OpenCV_DIR to your build of OpenCV library. Call Stack (most recent call first): CMakeLists.txt:10 (find_package) CMake Error at CMakeLists.txt:10 (find_package): Found package configuration file: /home/obvious/opencv/cmake/OpenCVConfig.cmake but it set OpenCV_FOUND to FALSE so package "OpenCV" is considered to be NOT FOUND. ![图片说明](https://img-ask.csdn.net/upload/201703/05/1488699720_108187.png)

opencv3.2配置contrib

自己配置opencv3.2+vs2015+contrib老是出错,求做过的大神分享一个cmake成功后用来放置合成的工程的输出文件夹,这样我可以直接配置。万分感谢,急!急!!

opencv3.0+VS2013配置出错

亲们,配置opencv总是出错啊,所有的链接库我都配置好几遍了,还是有问题啊 1>------ 已启动生成: 项目: opencv_test, 配置: Debug Win32 ------ 1>LINK : fatal error LNK1104: 无法打开文件“opencv_ts300d.obj” ========== 生成: 成功 0 个,失败 1 个,最新 0 个,跳过 0 个 ==========

JavaWeb servlet中调用opencv类库的问题?

我想在servlet 中调用的opencv , 由于我已经通过Java的main方法成功配置并且已经调用成功啦,但是用在servlet里面通过浏览器访问servlet就会报加载类库失败的错误 , 错误如下: java.lang.UnsatisfiedLinkError: no opencv_java247 in java.library.path java.lang.ClassLoader.loadLibrary(ClassLoader.java:1709) java.lang.Runtime.loadLibrary0(Runtime.java:823) java.lang.System.loadLibrary(System.java:1030) opencv.Code.image_proc2(Code.java:100) opencv.Code.go(Code.java:51) PhpServlet.doGet(PhpServlet.java:21) javax.servlet.http.HttpServlet.service(HttpServlet.java:617) javax.servlet.http.HttpServlet.service(HttpServlet.java:717) 请各位大神指教 , 急急急。。。。。

在ubuntu下配置opencv,cmake成功了,而make时候报错

1 [ 6%] Generating precomp.hpp.gch/opencv_core_Release.gch 2 In file included from /usr/include/c++/6/bits/stl_algo.h:59:0, 3 from /usr/include/c++/6/algorithm:62, 4 from /opt/opencv/opencv-3.1.0/modules/core/include/opencv2/core/base.hpp:53, 5 from /opt/opencv/opencv-3.1.0/modules/core/include/opencv2/core.hpp:54, 6 from /opt/opencv/opencv-3.1.0/modules/core/include/opencv2/core/utility.hpp:52, 7 from /opt/opencv/build/modules/core/precomp.hpp:49: 8 /usr/include/c++/6/cstdlib:75:25: fatal error: stdlib.h: 没有那个文件或目录 9 #include_next <stdlib.h> 10 ^ 11 compilation terminated. 12 modules/core/CMakeFiles/pch_Generate_opencv_core.dir/build.make:62: recipe for target 'modules/core/precomp.hpp.gch/opencv_core_Release.gch' failed 13 make[2]: *** [modules/core/precomp.hpp.gch/opencv_core_Release.gch] Error 1 14 CMakeFiles/Makefile2:1178: recipe for target 'modules/core/CMakeFiles/pch_Generate_opencv_core.dir/all' failed 15 make[1]: *** [modules/core/CMakeFiles/pch_Generate_opencv_core.dir/all] Error 2 16 Makefile:160: recipe for target 'all' failed 17 make: *** [all] Error 2 ![图片说明](https://img-ask.csdn.net/upload/201703/03/1488542516_717767.png)

用cmake编译opencv3.4.0后无法找到opencv_world340.lib 的问题

按照网上给的操作做到了最后一部添加依赖项的时候要求添加”opencv_ts340.lib opencv_world340.lib “这些文件,然而惊讶的发现x86->vc11-lib里面没有这些文件,只有其它的lib。怎么办呢?编译都显示成功的呀。 以下是试运行的代码 #include<iostream> #include <opencv2/core/core.hpp> #include <opencv2/highgui/highgui.hpp> using namespace cv; int main() { // 读入一张图片(游戏原画) Mat img = imread("pic.jpg"); // 创建一个名为 "游戏原画"窗口 namedWindow("游戏原画"); // 在窗口中显示游戏原画 imshow("游戏原画", img); // 等待6000 ms后窗口自动关闭 waitKey(6000); }

opencv4在vs2017下配置以后运行测试程序一直报错

如图所示,计算机环境变量等均以配置,不知为何一直报错![图片说明](https://img-ask.csdn.net/upload/201812/21/1545378739_376814.png)![图片说明](https://img-ask.csdn.net/upload/201812/21/1545378748_588932.png)![图片说明](https://img-ask.csdn.net/upload/201812/21/1545378774_168807.png)![图片说明](https://img-ask.csdn.net/upload/201812/21/1545378780_751525.png)![图片说明](https://img-ask.csdn.net/upload/201812/21/1545378788_218955.png)

opencv3.0.0生成成功 但是vs2013intellisense报100个错误

opencv3.0.0生成成功,测试图片运行时也能正常显示,但是vs2013环境下intellisense会提示100个莫名其妙的错误,如果新建新项目同样是会报100个与下列错误一样的错误,同样可以生成成功,也可以运行,到底是什么原因呢?**** 编程环境为win7 64位专业版+opencv3.0.0+visual studio2013 Intellisense100个错误如下所示:**** opencv3.0.0生成成功,测试图片运行时也能正常显示,但是vs2013环境下intellisense会提示100个莫名其妙的错误,如果新建新项目同样是会报100个与下列错误一样的错误,同样可以生成成功,也可以运行,到底是什么原因呢?**** 编程环境为win7 64位专业版+opencv3.0.0+visual studio2013 Intellisense100个错误如下所示:**** 16 IntelliSense: “operator=”必须是成员函数 c:\Program Files (x86)\Microsoft Visual Studio 12.0\VC\include\sstream 72 8 Project1 59 IntelliSense: “operator=”必须是成员函数 c:\Program Files (x86)\Microsoft Visual Studio 12.0\VC\include\sstream 440 8 Project1 71 IntelliSense: “operator=”必须是成员函数 c:\Program Files (x86)\Microsoft Visual Studio 12.0\VC\include\sstream 533 8 Project1 83 IntelliSense: “operator=”必须是成员函数 c:\Program Files (x86)\Microsoft Visual Studio 12.0\VC\include\sstream 632 8 Project1 2 IntelliSense: Ptr 不是模板 f:\opencv\build\include\opencv2\core\operations.hpp 371 1 Project1 6 IntelliSense: 不允许使用类型名 f:\opencv\build\include\opencv2\core\operations.hpp 377 15 Project1 29 IntelliSense: 此声明没有存储类或类型说明符 c:\Program Files (x86)\Microsoft Visual Studio 12.0\VC\include\sstream 149 4 Project1 37 IntelliSense: 此声明没有存储类或类型说明符 c:\Program Files (x86)\Microsoft Visual Studio 12.0\VC\include\sstream 182 4 Project1 96 IntelliSense: 此声明没有存储类或类型说明符 f:\opencv\build\include\opencv2\core\utility.hpp 889 35 Project1 97 IntelliSense: 此声明没有存储类或类型说明符 f:\opencv\build\include\opencv2\core\persistence.hpp 1195 42 Project1 24 IntelliSense: 非成员函数上不允许使用类型限定符 c:\Program Files (x86)\Microsoft Visual Studio 12.0\VC\include\sstream 92 15 Project1 64 IntelliSense: 非成员函数上不允许使用类型限定符 c:\Program Files (x86)\Microsoft Visual Studio 12.0\VC\include\sstream 446 17 Project1 66 IntelliSense: 非成员函数上不允许使用类型限定符 c:\Program Files (x86)\Microsoft Visual Studio 12.0\VC\include\sstream 451 15 Project1 76 IntelliSense: 非成员函数上不允许使用类型限定符 c:\Program Files (x86)\Microsoft Visual Studio 12.0\VC\include\sstream 539 17 Project1 78 IntelliSense: 非成员函数上不允许使用类型限定符 c:\Program Files (x86)\Microsoft Visual Studio 12.0\VC\include\sstream 544 15 Project1 88 IntelliSense: 非成员函数上不允许使用类型限定符 c:\Program Files (x86)\Microsoft Visual Studio 12.0\VC\include\sstream 638 17 Project1 90 IntelliSense: 非成员函数上不允许使用类型限定符 c:\Program Files (x86)\Microsoft Visual Studio 12.0\VC\include\sstream 643 15 Project1 20 IntelliSense: 后面有“::”的名称一定是类名或命名空间名 c:\Program Files (x86)\Microsoft Visual Studio 12.0\VC\include\sstream 88 19 Project1 21 IntelliSense: 后面有“::”的名称一定是类名或命名空间名 c:\Program Files (x86)\Microsoft Visual Studio 12.0\VC\include\sstream 89 19 Project1 22 IntelliSense: 后面有“::”的名称一定是类名或命名空间名 c:\Program Files (x86)\Microsoft Visual Studio 12.0\VC\include\sstream 90 19 Project1 34 IntelliSense: 后面有“::”的名称一定是类名或命名空间名 c:\Program Files (x86)\Microsoft Visual Studio 12.0\VC\include\sstream 152 21 Project1 39 IntelliSense: 后面有“::”的名称一定是类名或命名空间名 c:\Program Files (x86)\Microsoft Visual Studio 12.0\VC\include\sstream 184 5 Project1 41 IntelliSense: 后面有“::”的名称一定是类名或命名空间名 c:\Program Files (x86)\Microsoft Visual Studio 12.0\VC\include\sstream 184 23 Project1 53 IntelliSense: 后面有“::”的名称一定是类名或命名空间名 c:\Program Files (x86)\Microsoft Visual Studio 12.0\VC\include\sstream 353 22 Project1 4 IntelliSense: 仅函数声明中允许内联说明符 f:\opencv\build\include\opencv2\core\operations.hpp 376 8 Project1 18 IntelliSense: 类声明外部的说明符无效 c:\Program Files (x86)\Microsoft Visual Studio 12.0\VC\include\sstream 74 2 Project1 61 IntelliSense: 类声明外部的说明符无效 c:\Program Files (x86)\Microsoft Visual Studio 12.0\VC\include\sstream 442 2 Project1 73 IntelliSense: 类声明外部的说明符无效 c:\Program Files (x86)\Microsoft Visual Studio 12.0\VC\include\sstream 535 2 Project1 85 IntelliSense: 类声明外部的说明符无效 c:\Program Files (x86)\Microsoft Visual Studio 12.0\VC\include\sstream 634 2 Project1 95 IntelliSense: 全局范围没有 "_C_double_complex" c:\Program Files (x86)\Microsoft Visual Studio 12.0\VC\include\complex 44 15 Project1 32 IntelliSense: 未定义标识符 "_Al" c:\Program Files (x86)\Microsoft Visual Studio 12.0\VC\include\sstream 151 21 Project1 31 IntelliSense: 未定义标识符 "_Elem" c:\Program Files (x86)\Microsoft Visual Studio 12.0\VC\include\sstream 151 4 Project1 33 IntelliSense: 未定义标识符 "_Elem" c:\Program Files (x86)\Microsoft Visual Studio 12.0\VC\include\sstream 152 4 Project1

编译opencv contrib(opencv扩展库)库失败

环境:vs2015 community with update 3, Opencv3.2.0vc14, opencv_contrib 3.2.0 目标:自己编译opencv+opencv_contrib库。 编译出错提示(部分): 严重性 代码 说明 项目 文件 行 禁止显示状态 错误 C2610 “std::tuple<cv::Size,perf::`anonymous-namespace'::MatDepth>::tuple(const std::tuple<cv::Size,perf::`anonymous-namespace'::MatDepth> &)”: 不是可默认为的特殊成员函数 opencv_perf_core D:\Program Files (x86)\Microsoft Visual Studio 14.0\VC\include\tuple 607 严重性 代码 说明 项目 文件 行 禁止显示状态 错误 C2610 “std::tuple<cv::Size,perf::`anonymous-namespace'::MatDepth>::tuple(std::tuple<cv::Size,perf::`anonymous-namespace'::MatDepth> &&)”: 不是可默认为的特殊成员函数 opencv_perf_core D:\Program Files (x86)\Microsoft Visual Studio 14.0\VC\include\tuple 608 严重性 代码 说明 项目 文件 行 禁止显示状态 错误 C2382 “std::tuple<cv::Size,perf::`anonymous-namespace'::MatDepth>::operator =”: 重定义;不同的异常规范 opencv_perf_core D:\opencv\sources\modules\ts\include\opencv2\ts\ts_perf.hpp 385 严重性 代码 说明 项目 文件 行 禁止显示状态 错误 C2264 “std::tuple<cv::Size,perf::`anonymous-namespace'::MatDepth>::tuple”: 函数定义或声明中有错误;未调用函数 opencv_perf_core D:\opencv\sources\modules\core\perf\opencl\perf_channels.cpp 165 严重性 代码 说明 项目 文件 行 禁止显示状态 错误 C2264 “std::tuple<cv::Size,perf::`anonymous-namespace'::MatDepth>::tuple”: 函数定义或声明中有错误;未调用函数 opencv_perf_core D:\opencv\sources\modules\core\perf\opencl\perf_channels.cpp 187

vs2019配置opencv3.4.5和opencv_contrib-3.4.5编译成功后生成install报错

按照网上的教程cmake成功了,重新生成解决方案也成功了,现在点仅生成install报错,很多回答都是管理员权限,我试了没有用,到底是什么问题啊?卡在这里很长时间了

vs2013,opencv 2.4.8怎么配置都弄不好

楼主是一名菜鸟。近来在配置opencv屡屡受挫,在网上试了n个版本的教程都没成功过 始终一编译 “1 error C1083: 无法打开包括文件: “opencv2\opencv.hpp”: No such file or directory c:\users\hzy\documents\visual studio 2013\projects\test\test\test.cpp 1 1 test” 老是这样子,不知道这里可以上图

vs 2017 调试出现问题,不想用OpenCV lib

![图片说明](https://img-ask.csdn.net/upload/201710/06/1507249183_640474.png) 之前弄过OPENCV 现在每次调试时都这样,现在写的不是OpenCV。请问要怎么恢复到vss 默认的状态

vs2019+opencv3.4.5+opencv_contrib3.4.5,cmake成功但是重新生成时有大量失败的情况

按照教程成功生成opencv.sln,在vs里点重新生成解决方案时候有很多失败,我看了下全是报的无法打开opencvworld345d.lib ![图片说明](https://img-ask.csdn.net/upload/201906/28/1561687517_322868.png) 我发现那个路径下确实没有opencvworld345d.lib。是我cmake的时候不完全吗?

在Win10 VS2015下配置opencv3.3出问题

我按百度上的配置完后,跑一段代码来测试是否配置成功 ``` #include <opencv.hpp> #include <iostream> using namespace cv; using namespace std; int main() { cout << "OpenCV Version: " << CV_VERSION << endl; Mat img = imread("img.jpg"); imshow("img", img); waitKey(0); return 0; } ``` 结果报了这么多问题,程序可以运行,但是窗口一闪而过,看不到图片,打开exe文件就会报错而中止 'computer vision1.exe' (Win32): Loaded 'C:\C++ 试作品\VS2015 Project\MFC 工程\computer vision1\x64\Debug\computer vision1.exe'. Symbols loaded. 'computer vision1.exe' (Win32): Loaded 'C:\Windows\System32\ntdll.dll'. Cannot find or open the PDB file. 'computer vision1.exe' (Win32): Loaded 'C:\Windows\System32\kernel32.dll'. Cannot find or open the PDB file. 'computer vision1.exe' (Win32): Loaded 'C:\Windows\System32\KernelBase.dll'. Cannot find or open the PDB file. 'computer vision1.exe' (Win32): Loaded 'C:\Windows\System32\vcruntime140d.dll'. Cannot find or open the PDB file. 'computer vision1.exe' (Win32): Loaded 'C:\Windows\System32\opencv_world330d.dll'. Cannot find or open the PDB file. 'computer vision1.exe' (Win32): Loaded 'C:\Windows\System32\msvcp140d.dll'. Cannot find or open the PDB file. 'computer vision1.exe' (Win32): Loaded 'C:\Windows\System32\opencv_world330.dll'. Cannot find or open the PDB file. 'computer vision1.exe' (Win32): Loaded 'C:\Windows\System32\ucrtbased.dll'. Cannot find or open the PDB file. 'computer vision1.exe' (Win32): Loaded 'C:\Windows\System32\user32.dll'. Cannot find or open the PDB file. 'computer vision1.exe' (Win32): Loaded 'C:\Windows\System32\gdi32.dll'. Cannot find or open the PDB file. 'computer vision1.exe' (Win32): Loaded 'C:\Windows\System32\win32u.dll'. Cannot find or open the PDB file. 'computer vision1.exe' (Win32): Loaded 'C:\Windows\System32\gdi32full.dll'. Cannot find or open the PDB file. 'computer vision1.exe' (Win32): Loaded 'C:\Windows\System32\ole32.dll'. Cannot find or open the PDB file. 'computer vision1.exe' (Win32): Loaded 'C:\Windows\System32\combase.dll'. Cannot find or open the PDB file. 'computer vision1.exe' (Win32): Loaded 'C:\Windows\System32\oleaut32.dll'. Cannot find or open the PDB file. 'computer vision1.exe' (Win32): Loaded 'C:\Windows\System32\ucrtbase.dll'. Cannot find or open the PDB file. 'computer vision1.exe' (Win32): Loaded 'C:\Windows\System32\msvcp_win.dll'. Cannot find or open the PDB file. 'computer vision1.exe' (Win32): Loaded 'C:\Windows\System32\rpcrt4.dll'. Cannot find or open the PDB file. 'computer vision1.exe' (Win32): Loaded 'C:\Windows\System32\comdlg32.dll'. Cannot find or open the PDB file. 'computer vision1.exe' (Win32): Loaded 'C:\Windows\System32\msvcrt.dll'. Cannot find or open the PDB file. 'computer vision1.exe' (Win32): Loaded 'C:\Windows\System32\bcryptprimitives.dll'. Cannot find or open the PDB file. 'computer vision1.exe' (Win32): Loaded 'C:\Windows\System32\sechost.dll'. Cannot find or open the PDB file. 'computer vision1.exe' (Win32): Loaded 'C:\Windows\System32\SHCore.dll'. Cannot find or open the PDB file. 'computer vision1.exe' (Win32): Loaded 'C:\Windows\System32\advapi32.dll'. Cannot find or open the PDB file. 'computer vision1.exe' (Win32): Loaded 'C:\Windows\System32\shlwapi.dll'. Cannot find or open the PDB file. 'computer vision1.exe' (Win32): Loaded 'C:\Windows\System32\shell32.dll'. Cannot find or open the PDB file. 'computer vision1.exe' (Win32): Loaded 'C:\Windows\System32\msvfw32.dll'. Cannot find or open the PDB file. 'computer vision1.exe' (Win32): Loaded 'C:\Windows\System32\avicap32.dll'. Cannot find or open the PDB file. 'computer vision1.exe' (Win32): Loaded 'C:\Windows\System32\avifil32.dll'. Cannot find or open the PDB file. 'computer vision1.exe' (Win32): Loaded 'C:\Windows\System32\cfgmgr32.dll'. Cannot find or open the PDB file. 'computer vision1.exe' (Win32): Loaded 'C:\Windows\System32\winmm.dll'. Cannot find or open the PDB file. 'computer vision1.exe' (Win32): Loaded 'C:\Windows\System32\winmmbase.dll'. Cannot find or open the PDB file. 'computer vision1.exe' (Win32): Loaded 'C:\Windows\System32\windows.storage.dll'. Cannot find or open the PDB file. 'computer vision1.exe' (Win32): Loaded 'C:\Windows\System32\powrprof.dll'. Cannot find or open the PDB file. 'computer vision1.exe' (Win32): Loaded 'C:\Windows\System32\concrt140d.dll'. Cannot find or open the PDB file. 'computer vision1.exe' (Win32): Loaded 'C:\Windows\WinSxS\amd64_microsoft.windows.common-controls_6595b64144ccf1df_5.82.14393.447_none_0d5aa7fbb6d35646\comctl32.dll'. Cannot find or open the PDB file. 'computer vision1.exe' (Win32): Loaded 'C:\Windows\WinSxS\amd64_microsoft.windows.common-controls_6595b64144ccf1df_5.82.14393.447_none_0d5aa7fbb6d35646\comctl32.dll'. Cannot find or open the PDB file. 'computer vision1.exe' (Win32): Loaded 'C:\Windows\System32\kernel.appcore.dll'. Cannot find or open the PDB file. 'computer vision1.exe' (Win32): Loaded 'C:\Windows\System32\profapi.dll'. Cannot find or open the PDB file. 'computer vision1.exe' (Win32): Loaded 'C:\Windows\System32\msacm32.dll'. Cannot find or open the PDB file. 'computer vision1.exe' (Win32): Unloaded 'C:\Windows\WinSxS\amd64_microsoft.windows.common-controls_6595b64144ccf1df_5.82.14393.447_none_0d5aa7fbb6d35646\comctl32.dll' 'computer vision1.exe' (Win32): Loaded 'C:\Windows\System32\msvcp140.dll'. Cannot find or open the PDB file. 'computer vision1.exe' (Win32): Loaded 'C:\Windows\System32\vcruntime140.dll'. Cannot find or open the PDB file. 'computer vision1.exe' (Win32): Loaded 'C:\Windows\System32\concrt140.dll'. Cannot find or open the PDB file. 'computer vision1.exe' (Win32): Loaded 'C:\Windows\System32\imm32.dll'. Cannot find or open the PDB file. 'computer vision1.exe' (Win32): Loaded 'C:\Windows\System32\uxtheme.dll'. Cannot find or open the PDB file. 'computer vision1.exe' (Win32): Loaded 'C:\Windows\System32\msctf.dll'. Cannot find or open the PDB file. 'computer vision1.exe' (Win32): Loaded 'C:\Windows\System32\dwmapi.dll'. Cannot find or open the PDB file. 'computer vision1.exe' (Win32): Loaded 'C:\Windows\System32\OpenCL.DLL'. Cannot find or open the PDB file. 'computer vision1.exe' (Win32): Loaded 'C:\Windows\System32\DriverStore\FileRepository\igdlh64.inf_amd64_e1474e9d5907af3f\IntelOpenCL64.dll'. Cannot find or open the PDB file. 'computer vision1.exe' (Win32): Loaded 'C:\Program Files (x86)\Common Files\Intel\OpenCL\bin\x64\intelocl64.dll'. Cannot find or open the PDB file. 'computer vision1.exe' (Win32): Loaded 'C:\Windows\System32\opengl32.dll'. Cannot find or open the PDB file. 'computer vision1.exe' (Win32): Loaded 'C:\Program Files (x86)\Common Files\Intel\OpenCL\bin\x64\task_executor64.dll'. Cannot find or open the PDB file. 'computer vision1.exe' (Win32): Loaded 'C:\Windows\System32\ddraw.dll'. Cannot find or open the PDB file. 'computer vision1.exe' (Win32): Loaded 'C:\Windows\System32\dciman32.dll'. Cannot find or open the PDB file. 'computer vision1.exe' (Win32): Loaded 'C:\Windows\System32\glu32.dll'. Cannot find or open the PDB file. 'computer vision1.exe' (Win32): Loaded 'C:\Program Files (x86)\Common Files\Intel\OpenCL\bin\x64\cpu_device64.dll'. Cannot find or open the PDB file. 'computer vision1.exe' (Win32): Loaded 'C:\Windows\System32\version.dll'. Cannot find or open the PDB file. 'computer vision1.exe' (Win32): Loaded 'C:\Windows\System32\DriverStore\FileRepository\igdlh64.inf_amd64_e1474e9d5907af3f\igdrcl64.dll'. Cannot find or open the PDB file. 'computer vision1.exe' (Win32): Loaded 'C:\Windows\System32\dxgi.dll'. Cannot find or open the PDB file. 'computer vision1.exe' (Win32): Loaded 'C:\Windows\System32\ResourcePolicyClient.dll'. Cannot find or open the PDB file. 'computer vision1.exe' (Win32): Unloaded 'C:\Windows\System32\ResourcePolicyClient.dll' 'computer vision1.exe' (Win32): Loaded 'C:\Windows\System32\DriverStore\FileRepository\igdlh64.inf_amd64_e1474e9d5907af3f\igdfcl64.dll'. Cannot find or open the PDB file. 'computer vision1.exe' (Win32): Loaded 'C:\Windows\System32\DriverStore\FileRepository\igdlh64.inf_amd64_e1474e9d5907af3f\igdmcl64.dll'. Cannot find or open the PDB file. 'computer vision1.exe' (Win32): Loaded 'C:\Windows\System32\dbghelp.dll'. Cannot find or open the PDB file. 'computer vision1.exe' (Win32): Loaded 'C:\Windows\System32\DriverStore\FileRepository\igdlh64.inf_amd64_e1474e9d5907af3f\igc64.dll'. Cannot find or open the PDB file. The thread 0x1cd4 has exited with code 0 (0x0). The thread 0x1750 has exited with code 0 (0x0). The thread 0x3668 has exited with code 0 (0x0). The thread 0x2b88 has exited with code 0 (0x0). The program '[6504] computer vision1.exe' has exited with code 0 (0x0).

关于如何生成opencv_haartraining.exe的方法

大家好,我想问一下,关于在opencv2.4.13中,如何使用haartraining文件夹中的一系列源代码文件生成的opencv_haartraining.exe和opencv_createsamples.exe两个可执行文件的? ![图片说明](https://img-ask.csdn.net/upload/201701/31/1485844108_600955.png) 我想尝试改动源代码进而提高opencv_haartraining.exe训练的.xml文件的性能 我曾尝试过两种方法: 1、根据haartraining中的源程序和头文件的关系,逐一的添加到工程中,但到最后还是有很多报错 2、有百度知道中讲到,使用Cmake对haartraining中的CMakelist.txt文件进行编译生成工程,并用vs打开工程即可看到opencv_haartraining.exe所包含的文件 但这两种方式,中间过程都会产生错误,所以现在还没有成功。 希望csdn中在这方面有所研究的大神,可以帮忙解决下这个问题,谢谢

在中国程序员是青春饭吗?

今年,我也32了 ,为了不给大家误导,咨询了猎头、圈内好友,以及年过35岁的几位老程序员……舍了老脸去揭人家伤疤……希望能给大家以帮助,记得帮我点赞哦。 目录: 你以为的人生 一次又一次的伤害 猎头界的真相 如何应对互联网行业的「中年危机」 一、你以为的人生 刚入行时,拿着傲人的工资,想着好好干,以为我们的人生是这样的: 等真到了那一天,你会发现,你的人生很可能是这样的: ...

再不跳槽,应届毕业生拿的都比我多了!

跳槽几乎是每个人职业生涯的一部分,很多HR说“三年两跳”已经是一个跳槽频繁与否的阈值了,可为什么市面上有很多程序员不到一年就跳槽呢?他们不担心影响履历吗? PayScale之前发布的**《员工最短任期公司排行榜》中,两家码农大厂Amazon和Google**,以1年和1.1年的员工任期中位数分列第二、第四名。 PayScale:员工最短任期公司排行榜 意外的是,任期中位数极小的这两家公司,薪资...

我以为我学懂了数据结构,直到看了这个导图才发现,我错了

数据结构与算法思维导图

数据库——玩转SQL语句(以MySQL为例)

一、前言 照着大学的SQL server来学

技术大佬:我去,你写的 switch 语句也太老土了吧

昨天早上通过远程的方式 review 了两名新来同事的代码,大部分代码都写得很漂亮,严谨的同时注释也很到位,这令我非常满意。但当我看到他们当中有一个人写的 switch 语句时,还是忍不住破口大骂:“我擦,小王,你丫写的 switch 语句也太老土了吧!” 来看看小王写的代码吧,看完不要骂我装逼啊。 private static String createPlayer(PlayerTypes p...

华为初面+综合面试(Java技术面)附上面试题

华为面试整体流程大致分为笔试,性格测试,面试,综合面试,回学校等结果。笔试来说,华为的难度较中等,选择题难度和网易腾讯差不多。最后的代码题,相比下来就简单很多,一共3道题目,前2题很容易就AC,题目已经记不太清楚,不过难度确实不大。最后一题最后提交的代码过了75%的样例,一直没有发现剩下的25%可能存在什么坑。 笔试部分太久远,我就不怎么回忆了。直接将面试。 面试 如果说腾讯的面试是挥金如土...

和黑客斗争的 6 天!

互联网公司工作,很难避免不和黑客们打交道,我呆过的两家互联网公司,几乎每月每天每分钟都有黑客在公司网站上扫描。有的是寻找 Sql 注入的缺口,有的是寻找线上服务器可能存在的漏洞,大部分都...

讲一个程序员如何副业月赚三万的真实故事

loonggg读完需要3分钟速读仅需 1 分钟大家好,我是你们的校长。我之前讲过,这年头,只要肯动脑,肯行动,程序员凭借自己的技术,赚钱的方式还是有很多种的。仅仅靠在公司出卖自己的劳动时...

上班一个月,后悔当初着急入职的选择了

最近有个老铁,告诉我说,上班一个月,后悔当初着急入职现在公司了。他之前在美图做手机研发,今年美图那边今年也有一波组织优化调整,他是其中一个,在协商离职后,当时捉急找工作上班,因为有房贷供着,不能没有收入来源。所以匆忙选了一家公司,实际上是一个大型外包公司,主要派遣给其他手机厂商做外包项目。**当时承诺待遇还不错,所以就立马入职去上班了。但是后面入职后,发现薪酬待遇这块并不是HR所说那样,那个HR自...

总结了 150 余个神奇网站,你不来瞅瞅吗?

原博客再更新,可能就没了,之后将持续更新本篇博客。

副业收入是我做程序媛的3倍,工作外的B面人生是怎样的?

提到“程序员”,多数人脑海里首先想到的大约是:为人木讷、薪水超高、工作枯燥…… 然而,当离开工作岗位,撕去层层标签,脱下“程序员”这身外套,有的人生动又有趣,马上展现出了完全不同的A/B面人生! 不论是简单的爱好,还是正经的副业,他们都干得同样出色。偶尔,还能和程序员的特质结合,产生奇妙的“化学反应”。 @Charlotte:平日素颜示人,周末美妆博主 大家都以为程序媛也个个不修边幅,但我们也许...

MySQL数据库面试题(2020最新版)

文章目录数据库基础知识为什么要使用数据库什么是SQL?什么是MySQL?数据库三大范式是什么mysql有关权限的表都有哪几个MySQL的binlog有有几种录入格式?分别有什么区别?数据类型mysql有哪些数据类型引擎MySQL存储引擎MyISAM与InnoDB区别MyISAM索引与InnoDB索引的区别?InnoDB引擎的4大特性存储引擎选择索引什么是索引?索引有哪些优缺点?索引使用场景(重点)...

如果你是老板,你会不会踢了这样的员工?

有个好朋友ZS,是技术总监,昨天问我:“有一个老下属,跟了我很多年,做事勤勤恳恳,主动性也很好。但随着公司的发展,他的进步速度,跟不上团队的步伐了,有点...

我入职阿里后,才知道原来简历这么写

私下里,有不少读者问我:“二哥,如何才能写出一份专业的技术简历呢?我总感觉自己写的简历太烂了,所以投了无数份,都石沉大海了。”说实话,我自己好多年没有写过简历了,但我认识的一个同行,他在阿里,给我说了一些他当年写简历的方法论,我感觉太牛逼了,实在是忍不住,就分享了出来,希望能够帮助到你。 01、简历的本质 作为简历的撰写者,你必须要搞清楚一点,简历的本质是什么,它就是为了来销售你的价值主张的。往深...

程序员写出这样的代码,能不挨骂吗?

当你换槽填坑时,面对一个新的环境。能够快速熟练,上手实现业务需求是关键。但是,哪些因素会影响你快速上手呢?是原有代码写的不够好?还是注释写的不够好?昨夜...

离职半年了,老东家又发 offer,回不回?

有小伙伴问松哥这个问题,他在上海某公司,在离职了几个月后,前公司的领导联系到他,希望他能够返聘回去,他很纠结要不要回去? 俗话说好马不吃回头草,但是这个小伙伴既然感到纠结了,我觉得至少说明了两个问题:1.曾经的公司还不错;2.现在的日子也不是很如意。否则应该就不会纠结了。 老实说,松哥之前也有过类似的经历,今天就来和小伙伴们聊聊回头草到底吃不吃。 首先一个基本观点,就是离职了也没必要和老东家弄的苦...

HTTP与HTTPS的区别

面试官问HTTP与HTTPS的区别,我这样回答让他竖起大拇指!

程序员毕业去大公司好还是小公司好?

虽然大公司并不是人人都能进,但我仍建议还未毕业的同学,尽力地通过校招向大公司挤,但凡挤进去,你这一生会容易很多。 大公司哪里好?没能进大公司怎么办?答案都在这里了,记得帮我点赞哦。 目录: 技术氛围 内部晋升与跳槽 啥也没学会,公司倒闭了? 不同的人脉圈,注定会有不同的结果 没能去大厂怎么办? 一、技术氛围 纵观整个程序员技术领域,哪个在行业有所名气的大牛,不是在大厂? 而且众所...

程序员为什么千万不要瞎努力?

本文作者用对比非常鲜明的两个开发团队的故事,讲解了敏捷开发之道 —— 如果你的团队缺乏统一标准的环境,那么即使勤劳努力,不仅会极其耗时而且成果甚微,使用...

为什么程序员做外包会被瞧不起?

二哥,有个事想询问下您的意见,您觉得应届生值得去外包吗?公司虽然挺大的,中xx,但待遇感觉挺低,马上要报到,挺纠结的。

当HR压你价,说你只值7K,你该怎么回答?

当HR压你价,说你只值7K时,你可以流畅地回答,记住,是流畅,不能犹豫。 礼貌地说:“7K是吗?了解了。嗯~其实我对贵司的面试官印象很好。只不过,现在我的手头上已经有一份11K的offer。来面试,主要也是自己对贵司挺有兴趣的,所以过来看看……”(未完) 这段话主要是陪HR互诈的同时,从公司兴趣,公司职员印象上,都给予对方正面的肯定,既能提升HR的好感度,又能让谈判气氛融洽,为后面的发挥留足空间。...

面试阿里p7,被按在地上摩擦,鬼知道我经历了什么?

面试阿里p7被问到的问题(当时我只知道第一个):@Conditional是做什么的?@Conditional多个条件是什么逻辑关系?条件判断在什么时候执...

终于懂了TCP和UDP协议区别

终于懂了TCP和UDP协议区别

无代码时代来临,程序员如何保住饭碗?

编程语言层出不穷,从最初的机器语言到如今2500种以上的高级语言,程序员们大呼“学到头秃”。程序员一边面临编程语言不断推陈出新,一边面临由于许多代码已存在,程序员编写新应用程序时存在重复“搬砖”的现象。 无代码/低代码编程应运而生。无代码/低代码是一种创建应用的方法,它可以让开发者使用最少的编码知识来快速开发应用程序。开发者通过图形界面中,可视化建模来组装和配置应用程序。这样一来,开发者直...

面试了一个 31 岁程序员,让我有所触动,30岁以上的程序员该何去何从?

最近面试了一个31岁8年经验的程序猿,让我有点感慨,大龄程序猿该何去何从。

大三实习生,字节跳动面经分享,已拿Offer

说实话,自己的算法,我一个不会,太难了吧

程序员垃圾简历长什么样?

已经连续五年参加大厂校招、社招的技术面试工作,简历看的不下于万份 这篇文章会用实例告诉你,什么是差的程序员简历! 疫情快要结束了,各个公司也都开始春招了,作为即将红遍大江南北的新晋UP主,那当然要为小伙伴们做点事(手动狗头)。 就在公众号里公开征简历,义务帮大家看,并一一点评。《启舰:春招在即,义务帮大家看看简历吧》 一石激起千层浪,三天收到两百多封简历。 花光了两个星期的所有空闲时...

《Oracle Java SE编程自学与面试指南》最佳学习路线图(2020最新版)

01、Java入门(Getting Started);02、集成开发环境(IDE);03、项目结构(Eclipse JavaProject);04、类和对象(Classes and Objects);05:词法结构(Lexical Structure);06:数据类型和变量(Data Type and Variables);07:运算符(Operators);08:控制流程语句(Control Flow Statements);

Java岗开发3年,公司临时抽查算法,离职后这几题我记一辈子

前几天我们公司做了一件蠢事,非常非常愚蠢的事情。我原以为从学校出来之后,除了找工作有测试外,不会有任何与考试有关的事儿。 但是,天有不测风云,公司技术总监、人事总监两位大佬突然降临到我们事业线,叫上我老大,给我们组织了一场别开生面的“考试”。 那是一个风和日丽的下午,我翘着二郎腿,左手端着一杯卡布奇诺,右手抓着我的罗技鼠标,滚动着轮轴,穿梭在头条热点之间。 “淡黄的长裙~蓬松的头发...

大牛都会用的IDEA调试技巧!!!

导读 前天面试了一个985高校的实习生,问了他平时用什么开发工具,他想也没想的说IDEA,于是我抛砖引玉的问了一下IDEA的调试用过吧,你说说怎么设置断点...

立即提问
相关内容推荐