使用Opencv对arduino进行开发. 2C

当在vs中导入include 时出现没有找到目标源文件是因为什么。

1个回答

Csdn user default icon
上传中...
上传图片
插入图片
抄袭、复制答案,以达到刷声望分或其他目的的行为,在CSDN问答是严格禁止的,一经发现立刻封号。是时候展现真正的技术了!
其他相关推荐
opencv3.4.3配置 opencv contrib后,无法读取opencv_aruco343d.dll,怎么解决?
我需要opencv的sift算法,opencv3.4.3要用的话,需要配置opencv contrib。 我根据网上教程配置完以后,运行一段代码出现“无法读取opencv_aruco343d.dll” 的问题,我重新编译,生成过这个dll文件。但还是不行,不知道问题出哪里了。
opencv3.1.0中没有opencv2\legacy\compat.hpp
opencv3.1.0中没有opencv2\legacy\compat.hpp 该如何解决 想用cvQueryHistValue_1D(,)该怎么办
YOLO v3 OpenCV-3.4.1
balbal..... 下载完weight后,在终端输入: ./darknet detect cfg/yolov3.cfg yolov3.weights data/dog.jpg 我是根据网上Yolo v3教程一步一步来的,装了最新的opencv,发现如下问题: 104 conv 256 3 x 3 / 1 52 x 52 x 128 -> 52 x 52 x 256 1.595 BFLOPs 105 conv 255 1 x 1 / 1 52 x 52 x 256 -> 52 x 52 x 255 0.353 BFLOPs 106 yolo Loading weights from yolov3.weights...Done! data/dog.jpg: Predicted in 0.045922 seconds. dog: 99% truck: 92% bicycle: 99% OpenCV(3.4.1) Error: Assertion failed ((flags & FIXED_TYPE) != 0) in type, file /home/kiraq/home/installation/opencv-3.4.1/modules/core/src/matrix_wrap.cpp, line 807 terminate called after throwing an instance of 'cv::Exception' what(): OpenCV(3.4.1) /home/kiraq/home/installation/opencv-3.4.1/modules/core/src/matrix_wrap.cpp:807: error: (-215) (flags & FIXED_TYPE) != 0 in function type Aborted (core dumped) 请问如何解决?
VS2010下使用opencv2.4.8出现错误
VS2010下使用opencv2.4.8出现错误LINK : fatal error LNK1104: 无法打开文件“opencv_ts300d.lib”链接库附加依赖项里是opencv_ts248d.lib啊 刚开始接触opencv,有很多不懂
为什么vs2019配置opencv包含目录的路径..\opencv\build\include还要再配置..\opencv\build\include\opencv2
在使用vs2019开发opencv应用的过程中发现,配置项目属性中包含目录和库目录时,需要增加..\opencv\build\include和..\opencv\build\include\opencv2这两个路径,opencv2包含在include下面,那么为什么不能只用\opencv\build\include这一个路径(会找不到头文件)
连续装两个版本的opencv都会出现缺少opencv_core249d.dll
我的电脑win7系统,用的是vs2010,不连续装了两个版本的opencv(3.0.0和3.2.0)都会出现缺少opencv__core249d.dll无法使用,按照其他博客说明移动opencv文件夹里的dll文件至系统盘内也无法解决问题,还望各位帮忙
error LNK1181: 无法打开输入文件“opencv_ml2410d.lib”怎么解决
在vs2013下配置opencv2.4.10,配置好后一直报错error LNK1181: 无法打开输入文件“opencv_ml2410d.lib”,我确定在附加依赖项里有这个文件。![图片说明](https://img-ask.csdn.net/upload/201511/10/1447093510_991977.png)
请教:尝试opencv2.4.13在linux下编译程序的报错
源代码:#include <opencv2/highgui/highgui.hpp> #include <opencv2/imgproc/imgproc.hpp> #include <opencv2/core/core.hpp> using namespace cv; int main() { VideoCapture cap(0); if(!cap.isOpened()) { return -1; } Mat frame; bool stop = false; while(!stop) { cap.read(frame); imshow("Video",frame); if(waitKey(30)==27) //Esc键退出 { stop = true; } } return 0; } 报错:~$ g++ -o opencvq opencv.cpp /tmp/ccQJKVIi.o: In function `main': opencv.cpp:(.text+0x29): undefined reference to `cv::VideoCapture::VideoCapture(int)' opencv.cpp:(.text+0x38): undefined reference to `cv::VideoCapture::isOpened() const' opencv.cpp:(.text+0x80): undefined reference to `cv::VideoCapture::read(cv::Mat&)' opencv.cpp:(.text+0xf9): undefined reference to `cv::Mat::ones(cv::Size_<int>, int)' opencv.cpp:(.text+0x146): undefined reference to `cv::VideoCapture::read(cv::Mat&)' opencv.cpp:(.text+0x33d): undefined reference to `cv::_OutputArray::_OutputArray(cv::Mat&)' opencv.cpp:(.text+0x356): undefined reference to `cv::_InputArray::_InputArray(cv::Mat const&)' opencv.cpp:(.text+0x36f): undefined reference to `cv::_InputArray::_InputArray(cv::Mat const&)' opencv.cpp:(.text+0x3a1): undefined reference to `cv::addWeighted(cv::_InputArray const&, double, cv::_InputArray const&, double, double, cv::_OutputArray const&, int)' opencv.cpp:(.text+0x3ba): undefined reference to `cv::_InputArray::_InputArray(cv::Mat const&)' opencv.cpp:(.text+0x3fd): undefined reference to `cv::imshow(std::string const&, cv::_InputArray const&)' opencv.cpp:(.text+0x425): undefined reference to `cv::waitKey(int)' opencv.cpp:(.text+0x489): undefined reference to `cv::VideoCapture::~VideoCapture()' opencv.cpp:(.text+0x51a): undefined reference to `cv::VideoCapture::~VideoCapture()' /tmp/ccQJKVIi.o: In function `cv::Mat::~Mat()': opencv.cpp:(.text._ZN2cv3MatD2Ev[_ZN2cv3MatD5Ev]+0x39): undefined reference to `cv::fastFree(void*)' /tmp/ccQJKVIi.o: In function `cv::Mat::release()': opencv.cpp:(.text._ZN2cv3Mat7releaseEv[_ZN2cv3Mat7releaseEv]+0x47): undefined reference to `cv::Mat::deallocate()' /tmp/ccQJKVIi.o: In function `cv::Mat::operator()(cv::Rect_<int> const&) const': opencv.cpp:(.text._ZNK2cv3MatclERKNS_5Rect_IiEE[_ZNK2cv3MatclERKNS_5Rect_IiEE]+0x27): undefined reference to `cv::Mat::Mat(cv::Mat const&, cv::Rect_<int> const&)' collect2: error: ld returned 1 exit status 第一次使用,在此请教各位前辈,谢谢了
请问这段opencv代码为什么在debug下无法编译通过,但是release可以通过?
``` #include<opencv2\core\core.hpp> #include<opencv2\highgui\highgui.hpp> using namespace cv; void main() { Mat image=imread("E:\\images\\07.jpg"); namedWindow("img"); imshow("img", image); waitKey(0); } ``` 编译环境为opencv2.4.11+vs2013。这段最简单的测试程序无法在debug下编译通过。 ![图片说明](https://img-ask.csdn.net/upload/201509/17/1442475731_362233.png) ![图片说明](https://img-ask.csdn.net/upload/201509/17/1442475692_384048.png) 附加依赖项为 opencv_calib3d2411.lib opencv_contrib2411.lib opencv_core2411.lib opencv_features2d2411.lib opencv_flann2411.lib opencv_gpu2411.lib opencv_highgui2411.lib opencv_imgproc2411.lib opencv_legacy2411.lib opencv_ml2411d.lib opencv_objdetect2411.lib opencv_ts2411.lib opencv_video2411.lib opencv_nonfree2411.lib opencv_ocl2411.lib opencv_photo2411.lib opencv_stitching2411.lib opencv_superres2411.lib opencv_videostab2411.lib opencv_calib3d2411d.lib opencv_contrib2411d.lib opencv_core2411d.lib opencv_features2d2411d.lib opencv_flann2411d.lib opencv_gpu2411d.lib opencv_highgui2411d.lib opencv_imgproc2411d.lib opencv_legacy2411d.lib opencv_objdetect2411d.lib opencv_ts2411d.lib opencv_video2411d.lib opencv_nonfree2411d.lib opencv_ocl2411d.lib opencv_photo2411d.lib opencv_stitching2411d.lib opencv_superres2411d.lib opencv_videostab2411d.lib 报的错误是 ![图片说明](https://img-ask.csdn.net/upload/201509/17/1442475851_593908.png)
谁能帮忙看一下OpenCV 3.4.1源码的类型转换编译错误?
环境: 1. Ubuntu 12.04 LTS 2. cmake 3.5.1 3. OpenCV 3.4.1源码 4. Arm Cortex-A7 NXP i.MX6Q 5. 已经sudo为root 执行过程 cd opencv-3.4.1 mkdir build cd build cmakd -D CMAKE_BUILD_TYPE=Relase -D CMAKE_INSTALL_PREFIX=/usr/local .. make make install 出错提示: [ 0%] Built target gen-pkgconfig [ 9%] Built target libwebp [ 14%] Built target IlmImf [ 20%] Built target libprotobuf [ 23%] Built target carotene_objs [ 24%] Built target tegra_hal [ 24%] Built target opencv_ts_pch_dephelp [ 24%] Built target pch_Generate_opencv_ts [ 25%] Built target opencv_core_pch_dephelp [ 25%] Built target pch_Generate_opencv_core [ 31%] Built target opencv_core [ 31%] Built target opencv_imgproc_pch_dephelp [ 31%] Built target pch_Generate_opencv_imgproc [ 31%] Building CXX object modules/imgproc/CMakeFiles/opencv_imgproc.dir/src/smooth.cpp.o /home/linaro/opencv-3.4.1/modules/imgproc/src/smooth.cpp: In function ‘void cv::vlineSmooth1N(const FT* const*, const FT*, int, ET*, int) [with ET = unsigned char, FT = {anonymous}::ufixedpoint16]’: /home/linaro/opencv-3.4.1/modules/imgproc/src/smooth.cpp:2676:31: error: conversion from ‘{anonymous}::ufixedpoint32’ to ‘cv::uint8_t {aka unsigned char}’ is ambiguous /home/linaro/opencv-3.4.1/modules/imgproc/src/smooth.cpp:2676:31: note: candidates are: /home/linaro/opencv-3.4.1/modules/imgproc/src/fixedpoint.inl.hpp:223:22: note: {anonymous}::ufixedpoint32::operator float() const /home/linaro/opencv-3.4.1/modules/imgproc/src/fixedpoint.inl.hpp:222:22: note: {anonymous}::ufixedpoint32::operator double() const /home/linaro/opencv-3.4.1/modules/imgproc/src/fixedpoint.inl.hpp:221:22: note: {anonymous}::ufixedpoint32::operator ET() const [with ET = unsigned char] /home/linaro/opencv-3.4.1/modules/imgproc/src/smooth.cpp: In function ‘void cv::vlineSmooth1N1(const FT* const*, const FT*, int, ET*, int) [with ET = unsigned char, FT = {anonymous}::ufixedpoint16]’: /home/linaro/opencv-3.4.1/modules/imgproc/src/smooth.cpp:2693:24: error: conversion from ‘const {anonymous}::ufixedpoint16’ to ‘cv::uint8_t {aka unsigned char}’ is ambiguous /home/linaro/opencv-3.4.1/modules/imgproc/src/smooth.cpp:2693:24: note: candidates are: /home/linaro/opencv-3.4.1/modules/imgproc/src/fixedpoint.inl.hpp:289:22: note: {anonymous}::ufixedpoint16::operator float() const /home/linaro/opencv-3.4.1/modules/imgproc/src/fixedpoint.inl.hpp:288:22: note: {anonymous}::ufixedpoint16::operator double() const /home/linaro/opencv-3.4.1/modules/imgproc/src/fixedpoint.inl.hpp:287:22: note: {anonymous}::ufixedpoint16::operator ET() const [with ET = unsigned char] /home/linaro/opencv-3.4.1/modules/imgproc/src/smooth.cpp: In function ‘void cv::vlineSmooth3N(const FT* const*, const FT*, int, ET*, int) [with ET = unsigned char, FT = {anonymous}::ufixedpoint16]’: /home/linaro/opencv-3.4.1/modules/imgproc/src/smooth.cpp:2740:71: error: conversion from ‘{anonymous}::ufixedpoint32’ to ‘cv::uint8_t {aka unsigned char}’ is ambiguous /home/linaro/opencv-3.4.1/modules/imgproc/src/smooth.cpp:2740:71: note: candidates are: /home/linaro/opencv-3.4.1/modules/imgproc/src/fixedpoint.inl.hpp:223:22: note: {anonymous}::ufixedpoint32::operator float() const /home/linaro/opencv-3.4.1/modules/imgproc/src/fixedpoint.inl.hpp:222:22: note: {anonymous}::ufixedpoint32::operator double() const /home/linaro/opencv-3.4.1/modules/imgproc/src/fixedpoint.inl.hpp:221:22: note: {anonymous}::ufixedpoint32::operator ET() const [with ET = unsigned char] /home/linaro/opencv-3.4.1/modules/imgproc/src/smooth.cpp: In function ‘void cv::vlineSmooth5N(const FT* const*, const FT*, int, ET*, int) [with ET = unsigned char, FT = {anonymous}::ufixedpoint16]’: /home/linaro/opencv-3.4.1/modules/imgproc/src/smooth.cpp:2816:109: error: conversion from ‘{anonymous}::ufixedpoint32’ to ‘cv::uint8_t {aka unsigned char}’ is ambiguous /home/linaro/opencv-3.4.1/modules/imgproc/src/smooth.cpp:2816:109: note: candidates are: /home/linaro/opencv-3.4.1/modules/imgproc/src/fixedpoint.inl.hpp:223:22: note: {anonymous}::ufixedpoint32::operator float() const /home/linaro/opencv-3.4.1/modules/imgproc/src/fixedpoint.inl.hpp:222:22: note: {anonymous}::ufixedpoint32::operator double() const /home/linaro/opencv-3.4.1/modules/imgproc/src/fixedpoint.inl.hpp:221:22: note: {anonymous}::ufixedpoint32::operator ET() const [with ET = unsigned char] /home/linaro/opencv-3.4.1/modules/imgproc/src/smooth.cpp: In function ‘void cv::vlineSmooth(const FT* const*, const FT*, int, ET*, int) [with ET = unsigned char, FT = {anonymous}::ufixedpoint16]’: /home/linaro/opencv-3.4.1/modules/imgproc/src/smooth.cpp:2919:18: error: conversion from ‘{anonymous}::ufixedpoint32’ to ‘cv::uint8_t {aka unsigned char}’ is ambiguous /home/linaro/opencv-3.4.1/modules/imgproc/src/smooth.cpp:2914:23: note: candidates are: /home/linaro/opencv-3.4.1/modules/imgproc/src/fixedpoint.inl.hpp:223:22: note: {anonymous}::ufixedpoint32::operator float() const /home/linaro/opencv-3.4.1/modules/imgproc/src/fixedpoint.inl.hpp:222:22: note: {anonymous}::ufixedpoint32::operator double() const /home/linaro/opencv-3.4.1/modules/imgproc/src/fixedpoint.inl.hpp:221:22: note: {anonymous}::ufixedpoint32::operator ET() const [with ET = unsigned char] make[2]: *** [modules/imgproc/CMakeFiles/opencv_imgproc.dir/src/smooth.cpp.o] Error 1 make[1]: *** [modules/imgproc/CMakeFiles/opencv_imgproc.dir/all] Error 2 make: *** [all] Error 2 说明: 关键之处是 /home/linaro/opencv-3.4.1/modules/imgproc/src/smooth.cpp:2919:18: error: conversion from ‘{anonymous}::ufixedpoint32’ to ‘cv::uint8_t {aka unsigned char}’ is ambiguous 类型转换错误。 请教各位大侠,这个错误出在哪里,如何解决呢? 谢谢!
opencv求助..........
怎么将这张图片的大象还原?![图片](https://img-ask.csdn.net/upload/201704/21/1492744058_837793.jpg)
cv2.error:Opencv(3.4.3)
s = robot.get_camera_data() plt.imshow(s) plt.show() s_ = robot.get_camera_data() print (s_.shape) plt.imshow(s_) plt.show() flow = cv2.calcOpticalFlowFarneback(s, s_, None, 0.5, 3, 15, 3, 5, 1.2, 0) ``` s与s_分别为在仿真环境中采集到的3通道图片数据,但是 运行代码报错,在网上也没有找到相关问题,谢谢大家。 ``` cv2.error: OpenCV(3.4.3) C:\projects\opencv-python\opencv\modules\video\src\optflowgf.cpp:1114: error: (-215:Assertion failed) prev0.size() == next0.size() && prev0.channels() == next0.channels() && prev0.channels() == 1 && pyrScale_ < 1 in function 'cv::`anonymous-namespace'::FarnebackOpticalFlowImpl::calc' 此处为代码运行错误。
python(3.7)+opencv(3.4.4)视频处理
python(3.7)+opencv(3.4.4)视频处理 人工智能导论期末作业 想法如下: ①读取视频,并将每一帧的图片其用RGB分量输出 ②判断视频中RGB随时间突变的点,输出一条分量变化曲线 请帮忙写一下代码,进行实现
VS2017下opencv_4.0.1使用SIFT算法时为何总是在detect函数(detectAndCompute也是)处报内存错误?
环境: * windows * vistual studio2017 * opencv_4.0.1 前提: * 已配置过opencv_contrib-4.0.1 * 使用 debug ✖64 问题描述: 总是在detect(detectAndCompute也是)这个函数位置处出现错误: 0x00007FFB87B3A388 处(位于 image.exe 中)有未经处理的异常: Microsoft C++ 异常: cv::Exception,位于内存位置 0x0000001D36F1E9F0 处。 代码如下: ``` #include <iostream> #include <opencv2/opencv.hpp> #include <opencv2/core/core.hpp> #include <opencv2/highgui/highgui.hpp> #include <opencv2/xfeatures2d.hpp> #include <opencv2/xfeatures2d/nonfree.hpp> #include <opencv2/features2d/features2d.hpp> #include <vector> using namespace std; using namespace cv; using namespace xfeatures2d; using namespace cv::xfeatures2d; int main() { //Feature2D siftfd; SIFT siftfd; //Ptr<SIFT> siftfd = SIFT::create(); //SiftFeatureDetector siftfd; //sift s; //s.create(); Mat image1 = imread("car1.jpg"); Mat image2 = imread("car2.jpg"); namedWindow("car1_before", WINDOW_FREERATIO); namedWindow("car2_before", WINDOW_FREERATIO); imshow("car1_before", image1); imshow("car2_before", image2); //ptr<siftfeaturedetector> siftfd = siftfeaturedetector::create(); //ptr<sift> siftfd = sift::create(); //feature2d siftfd; //vector<KeyPoint>kp1, kp2; //keypoint类型的容器 vector<KeyPoint>kp1; Mat draw; //kp1.resize(100); //kp2.resize(100); //siftfd.detectAndCompute(image1, Mat(), kp1, draw); siftfd.detect(image1, kp1); Mat outimage1; drawKeypoints(image1, kp1, outimage1); namedWindow("car1_after", WINDOW_FREERATIO); imshow("car1_after", outimage1); waitKey(); return 0; ``` 报错情况: ![图片说明](https://img-ask.csdn.net/upload/201903/02/1551507714_139491.png)
opencv配置在qt5.6上的问题
通过cmake 3.7.2 Configure OpenCV3.2的source文件遇到以下问题: Make Error at D:/pack/opencv/cmake-3.7.2-64位/cmake-3.7.2-win64-x64/share/cmake-3.7/Modules/CMakeTestCXXCompiler.cmake:44 (message): The C++ compiler "D:/qtcreator/Tools/mingw492_32/bin/g++.exe" is not able to compile a simple test program. It fails with the following output: Change Dir: D:/pack/opencv/release/CMakeFiles/CMakeTmp Run Build Command:"D:/qtcreator/Tools/mingw492_32/bin/mingw32-make.exe" "cmTC_97ee7/fast" D:/qtcreator/Tools/mingw492_32/bin/mingw32-make.exe -f CMakeFiles\cmTC_97ee7.dir\build.make CMakeFiles/cmTC_97ee7.dir/build mingw32-make.exe[1]: Entering directory 'D:/pack/opencv/release/CMakeFiles/CMakeTmp' CMakeFiles\cmTC_97ee7.dir\build.make:64: recipe for target 'CMakeFiles/cmTC_97ee7.dir/testCXXCompiler.cxx.obj' failed process_begin: CreateProcess(NULL, D:\pack\opencv\cmake-3.7.2-64位\cmake-3.7.2-win64-x64\bin\cmake.exe -E cmake_echo_color --switch= --progress-dir=D:\pack\opencv\release\CMakeFiles\CMakeTmp\CMakeFiles --progress-num=1 "Building CXX object CMakeFiles/cmTC_97ee7.dir/testCXXCompiler.cxx.obj", ...) failed. make (e=2): 系统找不到指定的文件。 mingw32-make.exe[1]: *** [CMakeFiles/cmTC_97ee7.dir/testCXXCompiler.cxx.obj] Error 2 mingw32-make.exe[1]: Leaving directory 'D:/pack/opencv/release/CMakeFiles/CMakeTmp' makefile:125: recipe for target 'cmTC_97ee7/fast' failed mingw32-make.exe: *** [cmTC_97ee7/fast] Error 2 CMake will not be able to correctly generate this project. Call Stack (most recent call first): CMakeLists.txt:98 (project)
在qtcreator下出现LINK : fatal error LNK1104: 无法打开文件“opencv_core.lib”
在网上找了好多解决方法都没能把问题解决~在debug下出现这种问题,查看qtcreator的opencv配置也没有什么问题啊 配置添加如下: INCLUDEPATH+=D:\OpenCV\opencv\build\include\opencv2\ D:\OpenCV\opencv\build\include\opencv\ D:\OpenCV\opencv\build\include CONFIG(release,debug|release) { LIBS+=D:\OpenCV\opencv\build\x86\vc10\lib\opencv_calib3d246.lib\ D:\OpenCV\opencv\build\x86\vc10\lib\opencv_contrib246.lib\ D:\OpenCV\opencv\build\x86\vc10\lib\opencv_core246.lib\ D:\OpenCV\opencv\build\x86\vc10\lib\opencv_features2d246.lib\ D:\OpenCV\opencv\build\x86\vc10\lib\opencv_flann246.lib\ D:\OpenCV\opencv\build\x86\vc10\lib\opencv_gpu246.lib\ D:\OpenCV\opencv\build\x86\vc10\lib\opencv_highgui246.lib\ D:\OpenCV\opencv\build\x86\vc10\lib\opencv_imgproc246.lib\ D:\OpenCV\opencv\build\x86\vc10\lib\opencv_legacy246.lib\ D:\OpenCV\opencv\build\x86\vc10\lib\opencv_ml246.lib\ D:\OpenCV\opencv\build\x86\vc10\lib\opencv_objdetect246.lib\ D:\OpenCV\opencv\build\x86\vc10\lib\opencv_ts246.lib\ D:\OpenCV\opencv\build\x86\vc10\lib\opencv_video246.lib } CONFIG(debug,debug|release) { LIBS+=D:\OpenCV\opencv\build\x86\vc10\lib\opencv_calib3d246d.lib\ D:\OpenCV\opencv\build\x86\vc10\lib\opencv_contrib246d.lib\ D:\OpenCV\opencv\build\x86\vc10\lib\opencv_core246d.lib\ D:\OpenCV\opencv\build\x86\vc10\lib\opencv_features2d246d.lib\ D:\OpenCV\opencv\build\x86\vc10\lib\opencv_flann246d.lib\ D:\OpenCV\opencv\build\x86\vc10\lib\opencv_gpu246d.lib\ D:\OpenCV\opencv\build\x86\vc10\lib\opencv_highgui246d.lib\ D:\OpenCV\opencv\build\x86\vc10\lib\opencv_imgproc246d.lib\ D:\OpenCV\opencv\build\x86\vc10\lib\opencv_legacy246d.lib\ D:\OpenCV\opencv\build\x86\vc10\lib\opencv_ml246d.lib\ D:\OpenCV\opencv\build\x86\vc10\lib\opencv_objdetect246d.lib\ D:\OpenCV\opencv\build\x86\vc10\lib\opencv_ts246d.lib\ D:\OpenCV\opencv\build\x86\vc10\lib\opencv_video246d.lib }
使用opencv2.4.9对图像做连通域的问题
使用opencv2.4.9对图像做连通域,采用四连通,使用的是two-pass算法,但是有的字符的连通域会从中间断开,也就是说一个字符被分成了两个连通域,希望知道的大神能告诉原因以及解决方法
opencv3.1.0交叉编译出错
我在给mini2440移植opencv3.1.0的时候,make编译opencv过程中出错了。log如下: CMakeFiles/opencv_perf_core.dir/perf/perf_math.cpp.obj: In function `cv::Mat::~Mat()': perf_math.cpp.text._ZN2cv3MatD1Ev[cv::Mat::~Mat()]+0x1c): undefined reference to `__sync_fetch_and_add_4' CMakeFiles/opencv_perf_core.dir/perf/perf_compare.cpp.obj: In function `Size_MatType_CmpType_compare:erfTestBody()': perf_compare.cpp.text._ZN28Size_MatType_CmpType_compare12PerfTestBodyEv+0x30c): undefined reference to `__sync_fetch_and_add_4' perf_compare.cpp.text._ZN28Size_MatType_CmpType_compare12PerfTestBodyEv+0x378): undefined reference to `__sync_fetch_and_add_4' perf_compare.cpp.text._ZN28Size_MatType_CmpType_compare12PerfTestBodyEv+0x3ec): undefined reference to `__sync_fetch_and_add_4' CMakeFiles/opencv_perf_core.dir/perf/perf_compare.cpp.obj: In function `Size_MatType_CmpType_compareScalar:erfTestBody()': perf_compare.cpp.text._ZN34Size_MatType_CmpType_compareScalar12PerfTestBodyEv+0x32c): undefined reference to `__sync_fetch_and_add_4' CMakeFiles/opencv_perf_core.dir/perf/perf_compare.cpp.obj:perf_compare.cpp.text._ZN34Size_MatType_CmpType_compareScalar12PerfTestBodyEv+0x3a0): more undefined references to `__sync_fetch_and_add_4' follow collect2: ld returned 1 exit status make[2]: *** [bin/opencv_perf_core] Error 1 make[1]: *** [modules/core/CMakeFiles/opencv_perf_core.dir/all] Error 2 make: *** [all] Error 2 我用的是Ubuntu14.04,32位虚拟机。 查网上说是CMAKE_C_FLAGS要设为-march=armv4t 可是我安装提示设置了CMAKE_C_FLAGS 和 CMAKE_CXX_FLAGS的值,错误还是没有消失。 我试过了opencv3.1。0和opencv3.2.0了,都会出现这个问题。因为项目需求要用到opencv3 所以只能自己编译最新版,,泪奔 有大神遇到过这个问题吗?
相见恨晚的超实用网站
搞学习 知乎:www.zhihu.com 简答题:http://www.jiandati.com/ 网易公开课:https://open.163.com/ted/ 网易云课堂:https://study.163.com/ 中国大学MOOC:www.icourse163.org 网易云课堂:study.163.com 哔哩哔哩弹幕网:www.bilibili.com 我要自学网:www.51zxw
爬虫福利二 之 妹子图网MM批量下载
爬虫福利一:27报网MM批量下载    点击 看了本文,相信大家对爬虫一定会产生强烈的兴趣,激励自己去学习爬虫,在这里提前祝:大家学有所成! 目标网站:妹子图网 环境:Python3.x 相关第三方模块:requests、beautifulsoup4 Re:各位在测试时只需要将代码里的变量 path 指定为你当前系统要保存的路径,使用 python xxx.py 或IDE运行即可。
字节跳动视频编解码面经
引言 本文主要是记录一下面试字节跳动的经历。 三四月份投了字节跳动的实习(图形图像岗位),然后hr打电话过来问了一下会不会opengl,c++,shador,当时只会一点c++,其他两个都不会,也就直接被拒了。 七月初内推了字节跳动的提前批,因为内推没有具体的岗位,hr又打电话问要不要考虑一下图形图像岗,我说实习投过这个岗位不合适,不会opengl和shador,然后hr就说秋招更看重基础。我当时
开源一个功能完整的SpringBoot项目框架
福利来了,给大家带来一个福利。 最近想了解一下有关Spring Boot的开源项目,看了很多开源的框架,大多是一些demo或者是一个未成形的项目,基本功能都不完整,尤其是用户权限和菜单方面几乎没有完整的。 想到我之前做的框架,里面通用模块有:用户模块,权限模块,菜单模块,功能模块也齐全了,每一个功能都是完整的。 打算把这个框架分享出来,供大家使用和学习。 为什么用框架? 框架可以学习整体
源码阅读(19):Java中主要的Map结构——HashMap容器(下1)
(接上文《源码阅读(18):Java中主要的Map结构——HashMap容器(中)》) 3.4.4、HashMap添加K-V键值对(红黑树方式) 上文我们介绍了在HashMap中table数组的某个索引位上,基于单向链表添加新的K-V键值对对象(HashMap.Node&lt;K, V&gt;类的实例),但是我们同时知道在某些的场景下,HashMap中table数据的某个索引位上,数据是按照红黑树
c++制作的植物大战僵尸,开源,一代二代结合游戏
    此游戏全部由本人自己制作完成。游戏大部分的素材来源于原版游戏素材,少部分搜集于网络,以及自己制作。 此游戏为同人游戏而且仅供学习交流使用,任何人未经授权,不得对本游戏进行更改、盗用等,否则后果自负。 目前有六种僵尸和六种植物,植物和僵尸的动画都是本人做的。qq:2117610943 开源代码下载 提取码:3vzm 点击下载--&gt; 11月28日 新增四种植物 统一植物画风,全部修
Java学习的正确打开方式
在博主认为,对于入门级学习java的最佳学习方法莫过于视频+博客+书籍+总结,前三者博主将淋漓尽致地挥毫于这篇博客文章中,至于总结在于个人,实际上越到后面你会发现学习的最好方式就是阅读参考官方文档其次就是国内的书籍,博客次之,这又是一个层次了,这里暂时不提后面再谈。博主将为各位入门java保驾护航,各位只管冲鸭!!!上天是公平的,只要不辜负时间,时间自然不会辜负你。 何谓学习?博主所理解的学习,它
程序员必须掌握的核心算法有哪些?
由于我之前一直强调数据结构以及算法学习的重要性,所以就有一些读者经常问我,数据结构与算法应该要学习到哪个程度呢?,说实话,这个问题我不知道要怎么回答你,主要取决于你想学习到哪些程度,不过针对这个问题,我稍微总结一下我学过的算法知识点,以及我觉得值得学习的算法。这些算法与数据结构的学习大多数是零散的,并没有一本把他们全部覆盖的书籍。下面是我觉得值得学习的一些算法以及数据结构,当然,我也会整理一些看过
Python——画一棵漂亮的樱花树(不同种樱花+玫瑰+圣诞树喔)
最近翻到一篇知乎,上面有不少用Python(大多是turtle库)绘制的树图,感觉很漂亮,我整理了一下,挑了一些我觉得不错的代码分享给大家(这些我都测试过,确实可以生成喔~) one 樱花树 动态生成樱花 效果图(这个是动态的): 实现代码 import turtle as T import random import time # 画樱花的躯干(60,t) def Tree(branch
linux系列之常用运维命令整理笔录
本博客记录工作中需要的linux运维命令,大学时候开始接触linux,会一些基本操作,可是都没有整理起来,加上是做开发,不做运维,有些命令忘记了,所以现在整理成博客,当然vi,文件操作等就不介绍了,慢慢积累一些其它拓展的命令,博客不定时更新 顺便拉下票,我在参加csdn博客之星竞选,欢迎投票支持,每个QQ或者微信每天都可以投5票,扫二维码即可,http://m234140.nofollow.ax.
Python 基础(一):入门必备知识
目录1 标识符2 关键字3 引号4 编码5 输入输出6 缩进7 多行8 注释9 数据类型10 运算符10.1 常用运算符10.2 运算符优先级 1 标识符 标识符是编程时使用的名字,用于给变量、函数、语句块等命名,Python 中标识符由字母、数字、下划线组成,不能以数字开头,区分大小写。 以下划线开头的标识符有特殊含义,单下划线开头的标识符,如:_xxx ,表示不能直接访问的类属性,需通过类提供
深度学习图像算法在内容安全领域的应用
互联网给人们生活带来便利的同时也隐含了大量不良信息,防范互联网平台有害内容传播引起了多方面的高度关注。本次演讲从技术层面分享网易易盾在内容安全领域的算法实践经验,包括深度学习图
程序员接私活怎样防止做完了不给钱?
首先跟大家说明一点,我们做 IT 类的外包开发,是非标品开发,所以很有可能在开发过程中会有这样那样的需求修改,而这种需求修改很容易造成扯皮,进而影响到费用支付,甚至出现做完了项目收不到钱的情况。 那么,怎么保证自己的薪酬安全呢? 我们在开工前,一定要做好一些证据方面的准备(也就是“讨薪”的理论依据),这其中最重要的就是需求文档和验收标准。一定要让需求方提供这两个文档资料作为开发的基础。之后开发
网页实现一个简单的音乐播放器(大佬别看。(⊙﹏⊙))
今天闲着无事,就想写点东西。然后听了下歌,就打算写个播放器。 于是乎用h5 audio的加上js简单的播放器完工了。 欢迎 改进 留言。 演示地点跳到演示地点 html代码如下`&lt;!DOCTYPE html&gt; &lt;html&gt; &lt;head&gt; &lt;title&gt;music&lt;/title&gt; &lt;meta charset="utf-8"&gt
Python十大装B语法
Python 是一种代表简单思想的语言,其语法相对简单,很容易上手。不过,如果就此小视 Python 语法的精妙和深邃,那就大错特错了。本文精心筛选了最能展现 Python 语法之精妙的十个知识点,并附上详细的实例代码。如能在实战中融会贯通、灵活使用,必将使代码更为精炼、高效,同时也会极大提升代码B格,使之看上去更老练,读起来更优雅。 1. for - else 什么?不是 if 和 else 才
数据库优化 - SQL优化
前面一篇文章从实例的角度进行数据库优化,通过配置一些参数让数据库性能达到最优。但是一些“不好”的SQL也会导致数据库查询变慢,影响业务流程。本文从SQL角度进行数据库优化,提升SQL运行效率。 判断问题SQL 判断SQL是否有问题时可以通过两个表象进行判断: 系统级别表象 CPU消耗严重 IO等待严重 页面响应时间过长
2019年11月中国大陆编程语言排行榜
2019年11月2日,我统计了某招聘网站,获得有效程序员招聘数据9万条。针对招聘信息,提取编程语言关键字,并统计如下: 编程语言比例 rank pl_ percentage 1 java 33.62% 2 c/c++ 16.42% 3 c_sharp 12.82% 4 javascript 12.31% 5 python 7.93% 6 go 7.25% 7
通俗易懂地给女朋友讲:线程池的内部原理
餐厅的约会 餐盘在灯光的照耀下格外晶莹洁白,女朋友拿起红酒杯轻轻地抿了一小口,对我说:“经常听你说线程池,到底线程池到底是个什么原理?”我楞了一下,心里想女朋友今天是怎么了,怎么突然问出这么专业的问题,但做为一个专业人士在女朋友面前也不能露怯啊,想了一下便说:“我先给你讲讲我前同事老王的故事吧!” 大龄程序员老王 老王是一个已经北漂十多年的程序员,岁数大了,加班加不动了,升迁也无望,于是拿着手里
经典算法(5)杨辉三角
杨辉三角 是经典算法,这篇博客对它的算法思想进行了讲解,并有完整的代码实现。
腾讯算法面试题:64匹马8个跑道需要多少轮才能选出最快的四匹?
昨天,有网友私信我,说去阿里面试,彻底的被打击到了。问了为什么网上大量使用ThreadLocal的源码都会加上private static?他被难住了,因为他从来都没有考虑过这个问题。无独有偶,今天笔者又发现有网友吐槽了一道腾讯的面试题,我们一起来看看。 腾讯算法面试题:64匹马8个跑道需要多少轮才能选出最快的四匹? 在互联网职场论坛,一名程序员发帖求助到。二面腾讯,其中一个算法题:64匹
面试官:你连RESTful都不知道我怎么敢要你?
面试官:了解RESTful吗? 我:听说过。 面试官:那什么是RESTful? 我:就是用起来很规范,挺好的 面试官:是RESTful挺好的,还是自我感觉挺好的 我:都挺好的。 面试官:… 把门关上。 我:… 要干嘛?先关上再说。 面试官:我说出去把门关上。 我:what ?,夺门而去 文章目录01 前言02 RESTful的来源03 RESTful6大原则1. C-S架构2. 无状态3.统一的接
为啥国人偏爱Mybatis,而老外喜欢Hibernate/JPA呢?
关于SQL和ORM的争论,永远都不会终止,我也一直在思考这个问题。昨天又跟群里的小伙伴进行了一番讨论,感触还是有一些,于是就有了今天这篇文。 声明:本文不会下关于Mybatis和JPA两个持久层框架哪个更好这样的结论。只是摆事实,讲道理,所以,请各位看官勿喷。 一、事件起因 关于Mybatis和JPA孰优孰劣的问题,争论已经很多年了。一直也没有结论,毕竟每个人的喜好和习惯是大不相同的。我也看
项目中的if else太多了,该怎么重构?
介绍 最近跟着公司的大佬开发了一款IM系统,类似QQ和微信哈,就是聊天软件。我们有一部分业务逻辑是这样的 if (msgType = "文本") { // dosomething } else if(msgType = "图片") { // doshomething } else if(msgType = "视频") { // doshomething } else { // doshom...
致 Python 初学者
欢迎来到“Python进阶”专栏!来到这里的每一位同学,应该大致上学习了很多 Python 的基础知识,正在努力成长的过程中。在此期间,一定遇到了很多的困惑,对未来的学习方向感到迷茫。我非常理解你们所面临的处境。我从2007年开始接触 python 这门编程语言,从2009年开始单一使用 python 应对所有的开发工作,直至今天。回顾自己的学习过程,也曾经遇到过无数的困难,也曾经迷茫过、困惑过。开办这个专栏,正是为了帮助像我当年一样困惑的 Python 初学者走出困境、快速成长。希望我的经验能真正帮到你
Python 编程实用技巧
Python是一门很灵活的语言,也有很多实用的方法,有时候实现一个功能可以用多种方法实现,我这里总结了一些常用的方法,并会持续更新。
“狗屁不通文章生成器”登顶GitHub热榜,分分钟写出万字形式主义大作
一、垃圾文字生成器介绍 最近在浏览GitHub的时候,发现了这样一个骨骼清奇的雷人项目,而且热度还特别高。 项目中文名:狗屁不通文章生成器 项目英文名:BullshitGenerator 根据作者的介绍,他是偶尔需要一些中文文字用于GUI开发时测试文本渲染,因此开发了这个废话生成器。但由于生成的废话实在是太过富于哲理,所以最近已经被小伙伴们给玩坏了。 他的文风可能是这样的: 你发现,...
程序员:我终于知道post和get的区别
是一个老生常谈的话题,然而随着不断的学习,对于以前的认识有很多误区,所以还是需要不断地总结的,学而时习之,不亦说乎
"狗屁不通文章生成器"登顶GitHub热榜,分分钟写出万字形式主义大作
GitHub 被誉为全球最大的同性交友网站,……,陪伴我们已经走过 10+ 年时间,它托管了大量的软件代码,同时也承载了程序员无尽的欢乐。 万字申请,废话报告,魔幻形式主义大作怎么写?兄dei,狗屁不通文章生成器了解一下。这个富有灵魂的项目名吸引了众人的目光。项目仅仅诞生一周,便冲上了GitHub趋势榜榜首(Js中文网 -前端进阶资源教程)、是榜首哦
推荐几款比较实用的工具,网站
1.盘百度PanDownload 这个云盘工具是免费的,可以进行资源搜索,提速(偶尔会抽风????) 不要去某站买付费的???? PanDownload下载地址 2.BeJSON 这是一款拥有各种在线工具的网站,推荐它的主要原因是网站简洁,功能齐全,广告相比其他广告好太多了 bejson网站 3.二维码美化 这个网站的二维码美化很好看,网站界面也很...
《程序人生》系列-这个程序员只用了20行代码就拿了冠军
你知道的越多,你不知道的越多 点赞再看,养成习惯GitHub上已经开源https://github.com/JavaFamily,有一线大厂面试点脑图,欢迎Star和完善 前言 这一期不算《吊打面试官》系列的,所有没前言我直接开始。 絮叨 本来应该是没有这期的,看过我上期的小伙伴应该是知道的嘛,双十一比较忙嘛,要值班又要去帮忙拍摄年会的视频素材,还得搞个程序员一天的Vlog,还要写BU...
程序员把地府后台管理系统做出来了,还有3.0版本!12月7号最新消息:已在开发中有github地址
第一幕:缘起 听说阎王爷要做个生死簿后台管理系统,我们派去了一个程序员…… 996程序员做的梦: 第一场:团队招募 为了应对地府管理危机,阎王打算找“人”开发一套地府后台管理系统,于是就在地府总经办群中发了项目需求。 话说还是中国电信的信号好,地府都是满格,哈哈!!! 经常会有外行朋友问:看某网站做的不错,功能也简单,你帮忙做一下? 而这次,面对这样的需求,这个程序员...
相关热词 c# 图片上传 c# gdi 占用内存 c#中遍历字典 c#控制台模拟dos c# 斜率 最小二乘法 c#进程延迟 c# mysql完整项目 c# grid 总行数 c# web浏览器插件 c# xml 生成xsd
立即提问