新手cocos2d-js编译问题 1C

C:\Users\Administrator>cocos compile -s "e:\cocosCode\JsTestII" -p android
编译模式:debug
使用 Eclipse 工程:e:\cocosCode\JsTestII\frameworks\runtime-src\proj.android
正在执行:'"C:\Program Files\Android\android-sdk\tools\android" update project -
t android-13 -p e:\cocosCode\JsTestII\frameworks\runtime-src\proj.android'

Updated project.properties
Updated local.properties
Updated file e:\cocosCode\JsTestII\frameworks\runtime-src\proj.android\proguard-
project.txt
正在执行:'"C:\Program Files\Android\android-sdk\tools\android" update lib-proje
ct -p e:\cocosCode\JsTestII\frameworks\cocos2d-x\cocos\platform\android\java -t
android-13'

Updated project.properties
Updated local.properties
Updated file e:\cocosCode\JsTestII\frameworks\cocos2d-x\cocos\platform\android\j
ava\proguard-project.txt
正在执行 ndk-build...
NDK 编译模式:debug
正在执行:'"android-ndk-r10c\ndk-build" -C e:\cocosCode\JsTestII\frameworks\runt
ime-src\proj.android -j4 NDK_MODULE_PATH=e:\cocosCode\JsTestII\frameworks\cocos2
d-x;e:\cocosCode\JsTestII\frameworks\cocos2d-x\cocos;e:\cocosCode\JsTestII\frame
works\cocos2d-x\external NDK_TOOLCHAIN_VERSION=4.9 NDK_DEBUG=1'

系统找不到指定的路径。
执行命令出错,返回值:1。
C:\Users\Administrator>

这个是什么问题,新手一枚,请指教

1个回答

本人用cocosx-3.14 ndk用r10d(r13b也出现这问题)

Csdn user default icon
上传中...
上传图片
插入图片
抄袭、复制答案,以达到刷声望分或其他目的的行为,在CSDN问答是严格禁止的,一经发现立刻封号。是时候展现真正的技术了!
其他相关推荐
急急急 coco2d-js编译问题
C:\Users\Administrator>cocos compile -s "e:\cocosCode\JsTestII" -p android 编译模式:debug 使用 Eclipse 工程:e:\cocosCode\JsTestII\frameworks\runtime-src\proj.android 正在执行:'"C:\Program Files\Android\android-sdk\tools\android" update project - t android-13 -p e:\cocosCode\JsTestII\frameworks\runtime-src\proj.android' Updated project.properties Updated local.properties Updated file e:\cocosCode\JsTestII\frameworks\runtime-src\proj.android\proguard- project.txt 正在执行:'"C:\Program Files\Android\android-sdk\tools\android" update lib-proje ct -p e:\cocosCode\JsTestII\frameworks\cocos2d-x\cocos\platform\android\java -t android-13' Updated project.properties Updated local.properties Updated file e:\cocosCode\JsTestII\frameworks\cocos2d-x\cocos\platform\android\j ava\proguard-project.txt 正在执行 ndk-build... NDK 编译模式:debug 正在执行:'"android-ndk-r10c\ndk-build" -C e:\cocosCode\JsTestII\frameworks\runt ime-src\proj.android -j4 NDK_MODULE_PATH=e:\cocosCode\JsTestII\frameworks\cocos2 d-x;e:\cocosCode\JsTestII\frameworks\cocos2d-x\cocos;e:\cocosCode\JsTestII\frame works\cocos2d-x\external NDK_TOOLCHAIN_VERSION=4.9 NDK_DEBUG=1' 系统找不到指定的路径。 执行命令出错,返回值:1 我用的是cocos2d-x3.14.1, ndk用r10c不知是哪里有问题,请高手指教
cocos2d-js打包apk,安装完之后闪退
我用cocos2d-js v3.5 版本的新创的一个项目直接打包debug版本,显示打包成功,但是安装之后,进去就闪退,安装的 ndk: android-ndk-r10d, sdk: installer_r24-windows; path: python-2.7.9.amd64; ant: apache-ant-1.9.6; java: Java\jdk1.8.0_45; 配置环境: JAVA_HOME : D:\Program Files\Java\jdk1.8.0_45; path : %JAVA_HOME%\bin;%JAVA_HOME%\jre\bin; CLASSPATH :.;%JAVA_HOME%\lib; ant配置: ANT_HOME: D:\Cocos \apache-ant- 1.9.6; path : D:\Cocos \apache-ant- 1.9.6\bin; classpath :D:\Cocos \apache-ant- 1.9.6\lib; ant与java -version都是成功的; 不知道为什么会打包成功了,也可以安装,但是安装之后闪退;
cocos2d-js如何关闭转屏
cocos2d-js如何关闭转屏 如何用户开启转屏功能 如何强制竖屏 不让手机随重力感应转屏
cocos2d-js发布失败,在线等,急,谢谢了
各位请帮我看下这个是什么问题,我是新手刚学的cocos2d js,发布失败 ![图片说明](https://img-ask.csdn.net/upload/201809/30/1538241147_393222.jpg)
Android Studio debug cocos2d-x工程,成功编译后,报错无法进虚拟机
``` ……以上编译内容省略 :AnimalPlanet:assembleDebug Skipping task ':AnimalPlanet:assembleDebug' as it has no actions. :AnimalPlanet:assembleDebug UP-TO-DATE :AnimalPlanet:assembleDebug (Thread[Task worker for ':' Thread 3,5,main]) completed. Took 0.001 secs. BUILD SUCCESSFUL in 1s 51 actionable tasks: 1 executed, 50 up-to-date Traceback (most recent call last): File "D:\environment\cocos2d-x-3.13.1\tools\cocos2d-console\bin\/cocos.py", line 998, in <module> run_plugin(command, argv, plugins) File "D:\environment\cocos2d-x-3.13.1\tools\cocos2d-console\bin\/cocos.py", line 916, in run_plugin plugin.run(argv, dependencies_objects) File "D:\environment\cocos2d-x-3.13.1\tools\cocos2d-console\plugins\plugin_compile\project_compile.py", line 1546, in run self.build_android() File "D:\environment\cocos2d-x-3.13.1\tools\cocos2d-console\plugins\plugin_compile\project_compile.py", line 527, in build_android self.apk_path = builder.do_build_apk(build_mode, self._no_apk, output_dir, self._custom_step_args, self) File "D:\environment\cocos2d-x-3.13.1\tools\cocos2d-console\plugins\plugin_compile\build_android.py", line 462, in do_build_apk shutil.copy(gen_apk_path, output_dir) File "C:\Python27\lib\shutil.py", line 119, in copy copyfile(src, dst) File "C:\Python27\lib\shutil.py", line 82, in copyfile with open(src, 'rb') as fsrc: IOError: [Errno 2] No such file or directory: 'D:\\work\\AnimalPlanet-_Iran\\proj.android-studio\\app/build/outputs/apk\\AnimalPlanet-debug.apk' Process finished with exit code 1 ``` 如果单处APK没问题,但这样没法调试Java部分(sdk接入),着急啊,感谢有经营的大神指点。
cocos2d-js drawNode 绘制图形
我想问绘制圆弧怎么画 ![图片说明](https://img-ask.csdn.net/upload/201808/15/1534315198_985572.png)
cocos2d-x移植安卓的一个问题实在是找不到解决途径了
Updated project.properties Updated local.properties Updated file D:\CocosDevelop\PopStars\proj.android\..\cocos2d\cocos\platform\android\java\proguard-project.txt Traceback (most recent call last): File "D:\cocos2d-x-3.2\tools\cocos2d-console\bin\/cocos.py", line 504, in <module> run_plugin(command, argv, plugins) File "D:\cocos2d-x-3.2\tools\cocos2d-console\bin\/cocos.py", line 469, in run_plugin dependencies_objects[dep_name] = run_plugin(dep_name, argv, plugins) File "D:\cocos2d-x-3.2\tools\cocos2d-console\bin\/cocos.py", line 469, in run_plugin dependencies_objects[dep_name] = run_plugin(dep_name, argv, plugins) File "D:\cocos2d-x-3.2\tools\cocos2d-console\bin\/cocos.py", line 471, in run_plugin plugin.run(argv, dependencies_objects) File "D:\cocos2d-x-3.2\tools\cocos2d-console\bin\..\plugins\project_compile\project_compile.py", line 1075, in run self.build_android() File "D:\cocos2d-x-3.2\tools\cocos2d-console\bin\..\plugins\project_compile\project_compile.py", line 332, in build_android self.apk_path = builder.do_build_apk(sdk_root, ant_root, self._ap, build_mode, output_dir, self._custom_step_args, self) File "D:\cocos2d-x-3.2\tools\cocos2d-console\bin\..\plugins\project_compile\build_android.py", line 307, in do_build_apk self._copy_resources(custom_step_args) File "D:\cocos2d-x-3.2\tools\cocos2d-console\bin\..\plugins\project_compile\build_android.py", line 445, in _copy_resources shutil.rmtree(assets_dir) File "C:\Python27\lib\shutil.py", line 247, in rmtree rmtree(fullname, ignore_errors, onerror) File "C:\Python27\lib\shutil.py", line 247, in rmtree rmtree(fullname, ignore_errors, onerror) File "C:\Python27\lib\shutil.py", line 252, in rmtree onerror(os.remove, fullname, sys.exc_info()) File "C:\Python27\lib\shutil.py", line 250, in rmtree os.remove(fullname) WindowsError: [Error 5] : 'D:\\CocosDevelop\\PopStars\\proj.android\\assets\\stars\\.svn\\all-wcprops' 是在做消灭星星时候遇到,PC正常运行,当我PC上实现音乐播放之后就出错了,另外在游戏中也用到了自己使用cocostudio制作的UI,
cocos2d-x 能够接入html5 runtime吗?
比如说就像cocos2d-x Android和IOS 上的WebView接入网站这样; 我想用cocos2d-x 实现QQ手机游戏大厅类似的平台; 求大神帮助!
cocos2d-js 如何监听到手机锁屏
cocos2d-js 做html5 方向适配 出现三星手机原生浏览器锁屏后,任然播放游戏声音 cocos2d-js有没有监听事件 可以监听到手机锁屏的?
cocos2d-x v3.10在vs2012中编译出错
我从cocos官网下载了最新的cocos2d-x V3.10版本,本地解压后,打开build文件夹下的相应的win32的sln解决文件后, 在vs2012(中文旗舰版)中,编译出错了,望各路大神不吝赐教,感激不尽!!!(我电脑的os是win7的) ↓↓↓↓↓↓↓↓↓↓↓↓↓↓↓↓↓↓↓↓↓↓↓↓↓↓↓↓↓↓↓Log如下↓↓↓↓↓↓↓↓↓↓↓↓↓↓↓↓↓↓↓↓↓↓↓↓↓↓↓↓↓↓↓ 1>------ 已启动生成: 项目: libcocos2d, 配置: Debug Win32 ------ 1>项目文件包含 ToolsVersion="12.0"。此工具集可能未知或缺失。在这种情况下,通过安装 MSBuild 的正确版本,或许可以解决此问题。否则,该 build 可能已因策略原因而被强制为某个特定 ToolsVersion。将该项目视为其已具有 ToolsVersion="4.0"。有关详细信息,请参阅 http://go.microsoft.com/fwlink/?LinkId=291333。 1>项目文件包含 ToolsVersion="12.0"。此工具集可能未知或缺失。在这种情况下,通过安装 MSBuild 的正确版本,或许可以解决此问题。否则,该 build 可能已因策略原因而被强制为某个特定 ToolsVersion。将该项目视为其已具有 ToolsVersion="4.0"。有关详细信息,请参阅 http://go.microsoft.com/fwlink/?LinkId=291333。 1>项目文件包含 ToolsVersion="12.0"。此工具集可能未知或缺失。在这种情况下,通过安装 MSBuild 的正确版本,或许可以解决此问题。否则,该 build 可能已因策略原因而被强制为某个特定 ToolsVersion。将该项目视为其已具有 ToolsVersion="4.0"。有关详细信息,请参阅 http://go.microsoft.com/fwlink/?LinkId=291333。 1>项目文件包含 ToolsVersion="12.0"。此工具集可能未知或缺失。在这种情况下,通过安装 MSBuild 的正确版本,或许可以解决此问题。否则,该 build 可能已因策略原因而被强制为某个特定 ToolsVersion。将该项目视为其已具有 ToolsVersion="4.0"。有关详细信息,请参阅 http://go.microsoft.com/fwlink/?LinkId=291333。 1> UIScale9Sprite.cpp 1>..\ui\UIScale9Sprite.cpp(1172): error C2059: 语法错误:“{” 1>..\ui\UIScale9Sprite.cpp(1172): error C2143: 语法错误 : 缺少“;”(在“{”的前面) 1>..\ui\UIScale9Sprite.cpp(1172): error C2143: 语法错误 : 缺少“;”(在“}”的前面) 1>..\ui\UIScale9Sprite.cpp(1176): error C2059: 语法错误:“{” 1>..\ui\UIScale9Sprite.cpp(1176): error C2143: 语法错误 : 缺少“;”(在“{”的前面) 1>..\ui\UIScale9Sprite.cpp(1176): error C2143: 语法错误 : 缺少“;”(在“}”的前面) 1>..\ui\UIScale9Sprite.cpp(1210): error C2059: 语法错误:“{” 1>..\ui\UIScale9Sprite.cpp(1210): error C2143: 语法错误 : 缺少“;”(在“{”的前面) 1>..\ui\UIScale9Sprite.cpp(1210): error C2143: 语法错误 : 缺少“;”(在“}”的前面) 1>..\ui\UIScale9Sprite.cpp(1299): error C2059: 语法错误:“{” 1>..\ui\UIScale9Sprite.cpp(1299): error C2143: 语法错误 : 缺少“;”(在“{”的前面) 1>..\ui\UIScale9Sprite.cpp(1299): error C2143: 语法错误 : 缺少“;”(在“}”的前面) 2>------ 已启动生成: 项目: cpp-tests, 配置: Debug Win32 ------ 2> 复制了 0 个文件 2> 找不到文件 - *.dll 2> 复制了 0 个文件 2> LabelTestNew.cpp 2> NavMeshTest.cpp 2> UIScale9SpriteTest.cpp 2> controller.cpp 2>C:\cocos2d-x-3.10\external\chipmunk\include\chipmunk\chipmunk.h(26): warning C4005: “_USE_MATH_DEFINES”: 宏重定义 (..\Classes\controller.cpp) 2> 命令行参数: 参见前面的“_USE_MATH_DEFINES”定义 2>..\Classes\UITest\CocoStudioGUITest\UIScale9SpriteTest.cpp(989): error C2552: “spriteFrameNameArray”: 不能用初始值设定项列表初始化非聚合 2> “std::vector<_Ty>”: 不聚合带基的类型 2> with 2> [ 2> _Ty=std::string 2> ] 2> DrawPrimitivesTest.cpp 2>c:\cocos2d-x-3.10\tests\cpp-tests\classes\ActionManagerTest/ActionManagerTest.h(92): error C2864: “StopActionsByFlagsTest::kMoveFlag”: 只有静态常量整型数据成员才可以在类中初始化 (..\Classes\controller.cpp) 2>c:\cocos2d-x-3.10\tests\cpp-tests\classes\ActionManagerTest/ActionManagerTest.h(93): error C2864: “StopActionsByFlagsTest::kScaleFlag”: 只有静态常量整型数据成员才可以在类中初始化 (..\Classes\controller.cpp) 2>c:\cocos2d-x-3.10\tests\cpp-tests\classes\ActionManagerTest/ActionManagerTest.h(94): error C2864: “StopActionsByFlagsTest::kRotateFlag”: 只有静态常量整型数据成员才可以在类中初始化 (..\Classes\controller.cpp) 2>c:\cocos2d-x-3.10\tests\cpp-tests\classes\ActionManagerTest/ActionManagerTest.h(95): error C2864: “StopActionsByFlagsTest::kRepeatForeverFlag”: 只有静态常量整型数据成员才可以在类中初始化 (..\Classes\controller.cpp) 2>c:\cocos2d-x-3.10\tests\cpp-tests\classes\ActionManagerTest/ActionManagerTest.h(86): error C2512: “StopActionsByFlagsTest”: 没有合适的默认构造函数可用 (..\Classes\controller.cpp) 2>..\Classes\LabelTest\LabelTestNew.cpp(1027): warning C4018: “<”: 有符号/无符号不匹配 2>c:\cocos2d-x-3.10\external\bullet\bulletcollision\broadphasecollision\btDbvtBroadphase.h(62): warning C4099: “btDbvtBroadphase”: 类型名称以前使用“class”现在使用的是“struct” (..\Classes\NavMeshTest\NavMeshTest.cpp) 2> c:\cocos2d-x-3.10\cocos\physics3d\CCPhysics3DWorld.h(39) : 参见“btDbvtBroadphase”的声明 2>..\Classes\LabelTest\LabelTestNew.cpp(1841): warning C4819: 该文件包含不能在当前代码页(936)中表示的字符。请将该文件保存为 Unicode 格式以防止数据丢失 2>..\Classes\LabelTest\LabelTestNew.cpp(2524): error C2552: “labelTypes”: 不能用初始值设定项列表初始化非聚合 2> “std::vector<_Ty>”: 不聚合带基的类型 2> with 2> [ 2> _Ty=std::string 2> ] 2>..\Classes\NavMeshTest\NavMeshTest.cpp(181): error C2143: 语法错误 : 缺少“;”(在“{”的前面) 2>..\Classes\NavMeshTest\NavMeshTest.cpp(181): error C2143: 语法错误 : 缺少“;”(在“}”的前面) 2>..\Classes\LabelTest\LabelTestNew.cpp(2665): error C2552: “labelTypes”: 不能用初始值设定项列表初始化非聚合 2> “std::vector<_Ty>”: 不聚合带基的类型 2> with 2> [ 2> _Ty=std::string 2> ] 2> ActionManagerTest.cpp 2>..\Classes\DrawPrimitivesTest\DrawPrimitivesTest.cpp(317): error C2552: “cocos2d::V3F_C4B_T2F::vertices”: 不能用初始值设定项列表初始化非聚合 2> “cocos2d::Vec3”: 不聚合带用户定义的构造函数的类型 2>..\Classes\DrawPrimitivesTest\DrawPrimitivesTest.cpp(318): error C2552: “cocos2d::V3F_C4B_T2F::vertices”: 不能用初始值设定项列表初始化非聚合 2> “cocos2d::Vec3”: 不聚合带用户定义的构造函数的类型 2>..\Classes\DrawPrimitivesTest\DrawPrimitivesTest.cpp(319): error C2552: “cocos2d::V3F_C4B_T2F::vertices”: 不能用初始值设定项列表初始化非聚合 2> “cocos2d::Vec3”: 不聚合带用户定义的构造函数的类型 2>..\Classes\DrawPrimitivesTest\DrawPrimitivesTest.cpp(320): error C2552: “cocos2d::V3F_C4B_T2F::vertices”: 不能用初始值设定项列表初始化非聚合 2> “cocos2d::Vec3”: 不聚合带用户定义的构造函数的类型 2>c:\cocos2d-x-3.10\tests\cpp-tests\classes\actionmanagertest\ActionManagerTest.h(92): error C2864: “StopActionsByFlagsTest::kMoveFlag”: 只有静态常量整型数据成员才可以在类中初始化 (..\Classes\ActionManagerTest\ActionManagerTest.cpp) 2>c:\cocos2d-x-3.10\tests\cpp-tests\classes\actionmanagertest\ActionManagerTest.h(93): error C2864: “StopActionsByFlagsTest::kScaleFlag”: 只有静态常量整型数据成员才可以在类中初始化 (..\Classes\ActionManagerTest\ActionManagerTest.cpp) 2>c:\cocos2d-x-3.10\tests\cpp-tests\classes\actionmanagertest\ActionManagerTest.h(94): error C2864: “StopActionsByFlagsTest::kRotateFlag”: 只有静态常量整型数据成员才可以在类中初始化 (..\Classes\ActionManagerTest\ActionManagerTest.cpp) 2>c:\cocos2d-x-3.10\tests\cpp-tests\classes\actionmanagertest\ActionManagerTest.h(95): error C2864: “StopActionsByFlagsTest::kRepeatForeverFlag”: 只有静态常量整型数据成员才可以在类中初始化 (..\Classes\ActionManagerTest\ActionManagerTest.cpp) 2>c:\cocos2d-x-3.10\tests\cpp-tests\classes\actionmanagertest\ActionManagerTest.h(86): error C2512: “StopActionsByFlagsTest”: 没有合适的默认构造函数可用 (..\Classes\ActionManagerTest\ActionManagerTest.cpp) ========== 生成: 成功 0 个,失败 2 个,最新 4 个,跳过 0 个 ==========
关于Cocos2d-x 入门的几个小问题
刚开始接触Cocos 2d-x ,按着官网的文档在windows平台用VS2013创建了一个新项目。 现在有几个问题比较疑惑。 1、我新建的项目里面什么也没有添加,就是官方的一个DEMO,但是编译后就有Debug 就有200M+,这是不是代表我要开发任何一个小的游戏,游戏体积最小都是200M起步? 2、如果我现在在VS编译好的代码,在WINDOWS可以正常运行,现在想转到其他平台比如 安卓 平台,是不是需要我把所有代码拷贝到Java开发环境编译一次就好了,不用任何修改? 3、Cocos Studio是干什么用的?现在准备做一款棋牌类游戏,如果我不用这个工具只用Cocos2d-x的类库在VS下开发是否可行,效率是否会很低?
cocos2d-x如何让自己自定义的精灵能够动态地添加监听事件
cocos2d-x如何让自己自定义的精灵能够动态地添加监听事件
cocos2d-js 旋转之后切换地图
var Skip = function(){ cc.director.runScene(new HelloWorldScene()); } var RT = cc.rotateBy(1.5,360*5+RtDegree,0); var callback = cc.callFunc(Skip()); var Sq = cc.sequence(RT,cc.delayTime(2),callback); sp_award.runAction(Sq); ———————————————————————————————— 我想做先旋转后切换,但是这样写,为什么直接就切换地图了?求答案如何先旋转后切换
cocos2d-x 编译安卓.so文件出错
![图片说明](https://img-ask.csdn.net/upload/201505/01/1430441559_747862.jpg) 百度了一个星期都找不到方法,将近崩溃啦,重新配置环境也配置了好多次,各种ndk版本也换了好多,都不能解决问题,眼睛都废了。所以求各位大神出手相救。。。。
cocos2d-x 使用 中 CCPoint 未导出,请教解决方案。
使用VS2010 编译时提示如下: 1>Test.obj : error LNK2019: 无法解析的外部符号 "__declspec(dllimport) public: __thiscall cocos2d::CCPoint::CCPoint(float,float)" (__imp_??0CCPoint@cocos2d@@QAE@MM@Z),该符号在函数 "void __cdecl cocos2d::`dynamic initializer for 'CCPointZero''(void)" (??__ECCPointZero@cocos2d@@YAXXZ) 中被引用 1>Test.obj : error LNK2019: 无法解析的外部符号 "__declspec(dllimport) public: __thiscall cocos2d::CCSize::CCSize(float,float)" (__imp_??0CCSize@cocos2d@@QAE@MM@Z),该符号在函数 "void __cdecl cocos2d::`dynamic initializer for 'CCSizeZero''(void)" (??__ECCSizeZero@cocos2d@@YAXXZ) 中被引用 1>Test.obj : error LNK2019: 无法解析的外部符号 "__declspec(dllimport) public: __thiscall cocos2d::CCRect::CCRect(float,float,float,float)" (__imp_??0CCRect@cocos2d@@QAE@MMMM@Z),该符号在函数 "void __cdecl cocos2d::`dynamic initializer for 'CCRectZero''(void)" (??__ECCRectZero@cocos2d@@YAXXZ) 中被引用 1>.\Debug\Test.exe : fatal error LNK1120: 3 个无法解析的外部命令 我想是 CCPoint 所在的lib或DLL不在工程目录下,请教是那个lib或DLL。
请教一个Cocos2d-lua的简单问题
我在游戏一开始执行代码 cc.Director:getInstance():setNotificationNode(cc.Node:create()) --创建 然后监听消息在执行此代码 cc.Director:getInstance():getNotificationNode():addChild(require("app.views.AnnouncementLayer.lua"):create()) --调用 但是为什么我在AnnouncementLayer里写的action全都无法执行呢?如cc.moveBy:create()之类的都无法执行!
cocos2d-js+websocket如何服务器发出指令后操作layer上的sprite对象
如题,前台程序通过websocket可以接收到服务器的信息,比如服务器返回一个坐标值x,y 然后假设MainLayer有一个名为monster的精灵,想写一个函数让精灵改变位置,可是为什么总是提示“this.monster is undefined”未定义对象。 MainLayer.js var aa; aa = function (x, y) { var action0 = cc.Sequence.create(cc.MoveTo.create(1, cc.p(x, y))); // this.monster.runAction(action0); }; 而如果是在MainLayer上有一个按钮 ,写动作abc() MainLayer.prototype.abc = function () { cc.log("ac"); var action0 = cc.Sequence.create(cc.MoveTo.create(1, cc.p(11, 222))); // this.monster.runAction(action0); } 点按钮操作monster又可以移动,是该怎么写aa()中对象的操作啊?
cocos2d-js打包apk键盘监听不好用
用cocos2d-js写了个小东西在web端运行都没问题打包web也可以,但是打包成apk就不能监控到键盘监听不知道该怎么解决
cocos2d-x新建工程时勾选支持lua的时候,出现很多无法解析的外部符号问题~~
cocos2d-x的版本是2.1.3版本,用的是VS2010的~~~我已经加复制了cocos2dx,CocosDenshion,scripting那几个文件夹,也已经把cocos2d-x目录下的debug.win32下的全部lib和dll复制到了我的工程debug.win32下面了,然后就卡在这个错误上了 错误列表的错误是这样的: error LNK2001: 无法解析的外部符号 _lua_createtable 还有很长很多条~~求解决方案!!!
Kafka实战(三) - Kafka的自我修养与定位
Apache Kafka是消息引擎系统,也是一个分布式流处理平台(Distributed Streaming Platform) Kafka是LinkedIn公司内部孵化的项目。LinkedIn最开始有强烈的数据强实时处理方面的需求,其内部的诸多子系统要执行多种类型的数据处理与分析,主要包括业务系统和应用程序性能监控,以及用户行为数据处理等。 遇到的主要问题: 数据正确性不足 数据的收集主要...
volatile 与 synchronize 详解
Java支持多个线程同时访问一个对象或者对象的成员变量,由于每个线程可以拥有这个变量的拷贝(虽然对象以及成员变量分配的内存是在共享内存中的,但是每个执行的线程还是可以拥有一份拷贝,这样做的目的是加速程序的执行,这是现代多核处理器的一个显著特性),所以程序在执行过程中,一个线程看到的变量并不一定是最新的。 volatile 关键字volatile可以用来修饰字段(成员变量),就是告知程序任何对该变量...
Java学习的正确打开方式
在博主认为,对于入门级学习java的最佳学习方法莫过于视频+博客+书籍+总结,前三者博主将淋漓尽致地挥毫于这篇博客文章中,至于总结在于个人,实际上越到后面你会发现学习的最好方式就是阅读参考官方文档其次就是国内的书籍,博客次之,这又是一个层次了,这里暂时不提后面再谈。博主将为各位入门java保驾护航,各位只管冲鸭!!!上天是公平的,只要不辜负时间,时间自然不会辜负你。 何谓学习?博主所理解的学习,它是一个过程,是一个不断累积、不断沉淀、不断总结、善于传达自己的个人见解以及乐于分享的过程。
程序员必须掌握的核心算法有哪些?
由于我之前一直强调数据结构以及算法学习的重要性,所以就有一些读者经常问我,数据结构与算法应该要学习到哪个程度呢?,说实话,这个问题我不知道要怎么回答你,主要取决于你想学习到哪些程度,不过针对这个问题,我稍微总结一下我学过的算法知识点,以及我觉得值得学习的算法。这些算法与数据结构的学习大多数是零散的,并没有一本把他们全部覆盖的书籍。下面是我觉得值得学习的一些算法以及数据结构,当然,我也会整理一些看过...
有哪些让程序员受益终生的建议
从业五年多,辗转两个大厂,出过书,创过业,从技术小白成长为基层管理,联合几个业内大牛回答下这个问题,希望能帮到大家,记得帮我点赞哦。 敲黑板!!!读了这篇文章,你将知道如何才能进大厂,如何实现财务自由,如何在工作中游刃有余,这篇文章很长,但绝对是精品,记得帮我点赞哦!!!! 一腔肺腑之言,能看进去多少,就看你自己了!!! 目录: 在校生篇: 为什么要尽量进大厂? 如何选择语言及方...
大学四年自学走来,这些私藏的实用工具/学习网站我贡献出来了
大学四年,看课本是不可能一直看课本的了,对于学习,特别是自学,善于搜索网上的一些资源来辅助,还是非常有必要的,下面我就把这几年私藏的各种资源,网站贡献出来给你们。主要有:电子书搜索、实用工具、在线视频学习网站、非视频学习网站、软件下载、面试/求职必备网站。 注意:文中提到的所有资源,文末我都给你整理好了,你们只管拿去,如果觉得不错,转发、分享就是最大的支持了。 一、电子书搜索 对于大部分程序员...
linux系列之常用运维命令整理笔录
本博客记录工作中需要的linux运维命令,大学时候开始接触linux,会一些基本操作,可是都没有整理起来,加上是做开发,不做运维,有些命令忘记了,所以现在整理成博客,当然vi,文件操作等就不介绍了,慢慢积累一些其它拓展的命令,博客不定时更新 free -m 其中:m表示兆,也可以用g,注意都要小写 Men:表示物理内存统计 total:表示物理内存总数(total=used+free) use...
比特币原理详解
一、什么是比特币 比特币是一种电子货币,是一种基于密码学的货币,在2008年11月1日由中本聪发表比特币白皮书,文中提出了一种去中心化的电子记账系统,我们平时的电子现金是银行来记账,因为银行的背后是国家信用。去中心化电子记账系统是参与者共同记账。比特币可以防止主权危机、信用风险。其好处不多做赘述,这一层面介绍的文章很多,本文主要从更深层的技术原理角度进行介绍。 二、问题引入 假设现有4个人...
GitHub开源史上最大规模中文知识图谱
近日,一直致力于知识图谱研究的 OwnThink 平台在 Github 上开源了史上最大规模 1.4 亿中文知识图谱,其中数据是以(实体、属性、值),(实体、关系、实体)混合的形式组织,数据格式采用 csv 格式。 到目前为止,OwnThink 项目开放了对话机器人、知识图谱、语义理解、自然语言处理工具。知识图谱融合了两千五百多万的实体,拥有亿级别的实体属性关系,机器人采用了基于知识图谱的语义感...
程序员接私活怎样防止做完了不给钱?
首先跟大家说明一点,我们做 IT 类的外包开发,是非标品开发,所以很有可能在开发过程中会有这样那样的需求修改,而这种需求修改很容易造成扯皮,进而影响到费用支付,甚至出现做完了项目收不到钱的情况。 那么,怎么保证自己的薪酬安全呢? 我们在开工前,一定要做好一些证据方面的准备(也就是“讨薪”的理论依据),这其中最重要的就是需求文档和验收标准。一定要让需求方提供这两个文档资料作为开发的基础。之后开发...
网页实现一个简单的音乐播放器(大佬别看。(⊙﹏⊙))
今天闲着无事,就想写点东西。然后听了下歌,就打算写个播放器。 于是乎用h5 audio的加上js简单的播放器完工了。 演示地点演示 html代码如下` music 这个年纪 七月的风 音乐 ` 然后就是css`*{ margin: 0; padding: 0; text-decoration: none; list-...
微信支付崩溃了,但是更让马化腾和张小龙崩溃的竟然是……
loonggg读完需要3分钟速读仅需1分钟事件还得还原到昨天晚上,10 月 29 日晚上 20:09-21:14 之间,微信支付发生故障,全国微信支付交易无法正常进行。然...
Python十大装B语法
Python 是一种代表简单思想的语言,其语法相对简单,很容易上手。不过,如果就此小视 Python 语法的精妙和深邃,那就大错特错了。本文精心筛选了最能展现 Python 语法之精妙的十个知识点,并附上详细的实例代码。如能在实战中融会贯通、灵活使用,必将使代码更为精炼、高效,同时也会极大提升代码B格,使之看上去更老练,读起来更优雅。
数据库优化 - SQL优化
以实际SQL入手,带你一步一步走上SQL优化之路!
2019年11月中国大陆编程语言排行榜
2019年11月2日,我统计了某招聘网站,获得有效程序员招聘数据9万条。针对招聘信息,提取编程语言关键字,并统计如下: 编程语言比例 rank pl_ percentage 1 java 33.62% 2 cpp 16.42% 3 c_sharp 12.82% 4 javascript 12.31% 5 python 7.93% 6 go 7.25% 7 p...
通俗易懂地给女朋友讲:线程池的内部原理
餐盘在灯光的照耀下格外晶莹洁白,女朋友拿起红酒杯轻轻地抿了一小口,对我说:“经常听你说线程池,到底线程池到底是个什么原理?”
《奇巧淫技》系列-python!!每天早上八点自动发送天气预报邮件到QQ邮箱
将代码部署服务器,每日早上定时获取到天气数据,并发送到邮箱。 也可以说是一个小型人工智障。 知识可以运用在不同地方,不一定非是天气预报。
经典算法(5)杨辉三角
杨辉三角 是经典算法,这篇博客对它的算法思想进行了讲解,并有完整的代码实现。
英特尔不为人知的 B 面
从 PC 时代至今,众人只知在 CPU、GPU、XPU、制程、工艺等战场中,英特尔在与同行硬件芯片制造商们的竞争中杀出重围,且在不断的成长进化中,成为全球知名的半导体公司。殊不知,在「刚硬」的背后,英特尔「柔性」的软件早已经做到了全方位的支持与支撑,并持续发挥独特的生态价值,推动产业合作共赢。 而对于这一不知人知的 B 面,很多人将其称之为英特尔隐形的翅膀,虽低调,但是影响力却不容小觑。 那么,在...
腾讯算法面试题:64匹马8个跑道需要多少轮才能选出最快的四匹?
昨天,有网友私信我,说去阿里面试,彻底的被打击到了。问了为什么网上大量使用ThreadLocal的源码都会加上private static?他被难住了,因为他从来都没有考虑过这个问题。无独有偶,今天笔者又发现有网友吐槽了一道腾讯的面试题,我们一起来看看。 腾讯算法面试题:64匹马8个跑道需要多少轮才能选出最快的四匹? 在互联网职场论坛,一名程序员发帖求助到。二面腾讯,其中一个算法题:64匹...
面试官:你连RESTful都不知道我怎么敢要你?
干货,2019 RESTful最贱实践
刷了几千道算法题,这些我私藏的刷题网站都在这里了!
遥想当年,机缘巧合入了 ACM 的坑,周边巨擘林立,从此过上了"天天被虐似死狗"的生活… 然而我是谁,我可是死狗中的战斗鸡,智力不够那刷题来凑,开始了夜以继日哼哧哼哧刷题的日子,从此"读题与提交齐飞, AC 与 WA 一色 ",我惊喜的发现被题虐既刺激又有快感,那一刻我泪流满面。这么好的事儿作为一个正直的人绝不能自己独享,经过激烈的颅内斗争,我决定把我私藏的十几个 T 的,阿不,十几个刷题网...
为啥国人偏爱Mybatis,而老外喜欢Hibernate/JPA呢?
关于SQL和ORM的争论,永远都不会终止,我也一直在思考这个问题。昨天又跟群里的小伙伴进行了一番讨论,感触还是有一些,于是就有了今天这篇文。 声明:本文不会下关于Mybatis和JPA两个持久层框架哪个更好这样的结论。只是摆事实,讲道理,所以,请各位看官勿喷。 一、事件起因 关于Mybatis和JPA孰优孰劣的问题,争论已经很多年了。一直也没有结论,毕竟每个人的喜好和习惯是大不相同的。我也看...
白话阿里巴巴Java开发手册高级篇
不久前,阿里巴巴发布了《阿里巴巴Java开发手册》,总结了阿里巴巴内部实际项目开发过程中开发人员应该遵守的研发流程规范,这些流程规范在一定程度上能够保证最终的项目交付质量,通过在时间中总结模式,并推广给广大开发人员,来避免研发人员在实践中容易犯的错误,确保最终在大规模协作的项目中达成既定目标。 无独有偶,笔者去年在公司里负责升级和制定研发流程、设计模板、设计标准、代码标准等规范,并在实际工作中进行...
SQL-小白最佳入门sql查询一
不要偷偷的查询我的个人资料,即使你再喜欢我,也不要这样,真的不好;
项目中的if else太多了,该怎么重构?
介绍 最近跟着公司的大佬开发了一款IM系统,类似QQ和微信哈,就是聊天软件。我们有一部分业务逻辑是这样的 if (msgType = "文本") { // dosomething } else if(msgType = "图片") { // doshomething } else if(msgType = "视频") { // doshomething } else { // doshom...
Nginx 原理和架构
Nginx 是一个免费的,开源的,高性能的 HTTP 服务器和反向代理,以及 IMAP / POP3 代理服务器。Nginx 以其高性能,稳定性,丰富的功能,简单的配置和低资源消耗而闻名。 Nginx 的整体架构 Nginx 里有一个 master 进程和多个 worker 进程。master 进程并不处理网络请求,主要负责调度工作进程:加载配置、启动工作进程及非停升级。worker 进程负责处...
YouTube排名第一的励志英文演讲《Dream(梦想)》
Idon’t know what that dream is that you have, I don't care how disappointing it might have been as you've been working toward that dream,but that dream that you’re holding in your mind, that it’s po...
“狗屁不通文章生成器”登顶GitHub热榜,分分钟写出万字形式主义大作
一、垃圾文字生成器介绍 最近在浏览GitHub的时候,发现了这样一个骨骼清奇的雷人项目,而且热度还特别高。 项目中文名:狗屁不通文章生成器 项目英文名:BullshitGenerator 根据作者的介绍,他是偶尔需要一些中文文字用于GUI开发时测试文本渲染,因此开发了这个废话生成器。但由于生成的废话实在是太过富于哲理,所以最近已经被小伙伴们给玩坏了。 他的文风可能是这样的: 你发现,...
程序员:我终于知道post和get的区别
是一个老生常谈的话题,然而随着不断的学习,对于以前的认识有很多误区,所以还是需要不断地总结的,学而时习之,不亦说乎
相关热词 c# 二进制截断字符串 c#实现窗体设计器 c#检测是否为微信 c# plc s1200 c#里氏转换原则 c# 主界面 c# do loop c#存为组套 模板 c# 停掉协程 c# rgb 读取图片
立即提问