maven更新后war项目报错 5C

我点了update project后,项目就报错了,是怎么回事?
图片说明
图片说明
图片说明

0

5个回答

看一下你的Window的Preferences下有没有1.8图片说明

1

图片说明瞅瞅这里

0
qq_36375934
qq_charm 看图
一年多之前 回复

先清空项目( project clean) ,再 meaven update Project 一遍 试试,不行就去删本地的meaven包,再update 一遍

0

图片说明

0
fanxiangdaoli
fanxiangdaoli 你的Maven 依赖没有被部署,参考下这个https://blog.csdn.net/who_is_xiaoming/article/details/52790718
一年多之前 回复

本地仓库清空。我之前就是这个问题。。

0
Csdn user default icon
上传中...
上传图片
插入图片
抄袭、复制答案,以达到刷声望分或其他目的的行为,在CSDN问答是严格禁止的,一经发现立刻封号。是时候展现真正的技术了!
其他相关推荐
Eclipse更新Maven项目报错
** Maven项目在更新过程中,更新缓慢,更新中途中断,而导致报错 ** 进入到上面jar包所示目录下,可以直接删掉hive-jdbc目录,然后在更新maven项目,也可以删掉未更新完成的文件再次更新。 下图可以看到lastUpdated,这里指的是未更新完成,将它删除然后更新。 更新缓慢,可以修改更新源 打开eclipse–>Windows–>Preferences 打开se...
更新SDK后项目报错
项目第一行package com.jay.test.activity;都报错。原因:项目没有启动SDK,因此注意到project中没有了android4.2.2的jar包。解决方法:右键自己的project名,右键Properties,左边一列中选android,project build target中显示已经选中了android4.2.2,重新选择一个别的,比如android4.2.3,确认后再
更新SDK后出现项目报错
今天在使用eclipse的时候导入新的v7包后老出错,找了半天资料终于看 到原来是我的原先的sdk有点旧了需要更新一下sdk了,于是打开sdk  manger勾选了之后开始更新,但是更新完之后出现了新的问题我原先的 项目都不能用了,还出现了导入的v7包也有红叉,这是为什么呢,在网 上找了半天资料之后,终于找到了原来是编译的错误,新的V7包需要最 高
Maven项目报错
选中报错的maven项目,右键 》 maven 》 update project,确认
maven项目报错
[root@kube-master iff]# kubectl logs iff-dm-3029278244-9qrp6 -n iffjava.lang.IllegalArgumentException: Prefix string too short at java.io.File.createTempFile(File.java:2001) at java...
【maven】maven 新建项目报错
【问题描述】 报错: Could not calculate build plan: Pluginorg.apache.maven.plugins:maven-resources-plugin:2.5 or one of its dependenciescould not be resolved: Failed to read artifact descriptor fororg.ap
weblogic部署war项目报错java.lang.ClassNotFoundException
n n n===========================================njava.lang.ClassNotFoundException: org.springframework.beans.factory.config.BeanPostProcessor找不到这个类,但是war包里面jar中有n![图片说明](https://img-ask.csdn.net/upload/201801/17/1516175198_716249.png)nn应用使用ext+spring+servlet,之前在tomcat里一直都是正常的,现在领导要求使用weblogic,安装了weblogic12c,但是部署项目时失败,麻烦哪位大神帮忙解决一下,不胜感激
maven war依赖war问题
我有个项目,下面2个子项目,一个core项目,一个web项目,由于core中有java代码和配置文件,而web项目也有java代码和各种web代码,web的java代码需要依赖core项目中java代码进行编译,我就不知道咋搞了。在网上搜到maven的maven-warpath-plugin插件。 我把core代码打成war包【这个已经执行成功】 然后web的pom.xml中添加 ...
Maven war依赖war的解决方案
Maven
maven war:war 命令参数列表
本文翻译自: http://maven.apache.org/plugins/maven-war-plugin/war-mojo.html war:war 全路径: org.apache.maven.plugins:maven-war-plugin:3.1.0:war 描述: 构建一个 WAR文件. 特征: [必须] 一个maven工程用于执行 [必须] artifacts的依赖范围: comp...
卸载MyEclipse后建立Maven项目报错
小弟初学,在学习maven的时候遇见了不少问题,希望在这里总结下一些自己遇见的问题以及解决方案,希望可以帮助到以后学习的朋友,大牛绕道,勿喷。 当时自己的MyEclipse出了问题于是就卸载掉重新安装了,可是谁知道坑爹的问题来了,卸载后建立maven项目报错,总是会有一个弹框弹出来:  Could not calculate build plan: Plugin org.apache.mav
删除Maven本地仓库后,项目报错,不能自动下载
将项目右击项目,选择run as --->maven build----> 输入clean compile后会重新下载需要的jar包,如果还有错再右击项目--->Maven--->Update Project项目即可。  ...
更换eclipse工作空间后创建maven项目报错
如何更换工作空间 如图所示,点Other选择你相应的工作空间的文件夹 创建maven项目 创建一个简单的java的maven项目,创建后发现如下图 如何解决? 这是因为没有配置maven和引入setting.xml文件,如图进行配置 配置好后再次新建一个maven项目,成功解决! 转载请注明出处,如有问题欢迎指出,谢谢! ...
创建maven项目报错解决方案
创建maven项目报错解决方案 一般是因为丢包,或者未加载完成 找到maven的这个目录Maven\localRepository\org\apache\maven\archetypes会发现两个文件夹 把他删掉,然后!!! 骚操作来了 1.电脑联网 2.打开eclipse 3.创建maven项目 4.保持网络通畅,别管他等他自动下载刚删掉的文件夹 5.成功...
Maven项目报错解决方案
刚开始用maven写项目,遇到问题的解决方案: mybatis Invalid bound statement (not found) 在pom.xml里面加入 <resources> <resource> <directory>src/main/java</directory> <!-- 此配置不可缺,否则mybatis的Mapper.xml将会丢失 --
创建Maven项目报错
Using following parameters for creating project from Old (1.x) Archetype: maven-archetype-quickstart:RELEASE ---------------------------------------------------------------------------- Parameter: g
jenkins构建maven项目报错
ERROR: Step ?Deploy war/ear to a container? aborted due to exception: java.io.IOException: Expecting Ant GLOB pattern
maven入门项目报错
maven入门项目报错 2015-04-14 13:39130***@qq.com | 浏览 3203 次  悬赏:5  编程语言软件开发 刚下载配置完maven,在命令行新建项目时报错: 建项目的命令为:mvn archetype:create -DgroupId=org.sonatype.mavenbook.ch03 -DartifactId=simple -Dpackage
Maven项目报错总结
Maven项目导入eclipse中很多时候都出现报错的情况,出错的原因大致可以分为下列几种: JDK版本不一致 网络问题无法下载,可以尝试开vpn下载私有jar包 maven仓库中的某个构件如果因为网络或者其他的原因,没有下载成功或者下载被中断,将会出现一个LastUpdated的文件,这个时候,就算网络好了,也不能正常使用这个构件。 在linux系统上可以切换到仓库的目录下执行:
Cmd命令创建maven项目报错
命令: mvn archetype:create -DgroupId=com.it.test -DartifactId=mavenDemo -DarchetypeArtifactId=maven-archetype-webapp       -DgroupId:项目属于哪一个组;一般是公司名+项目名。 -DartifactId:定义当前Maven项目在组中唯一的ID(即是你的项目名)。
IDEA创建maven项目报错
求助:IDEA创建maven项目报错,报错信息如下rnrn[INFO] Scanning for projects...rn[INFO] ------------------------------------------------------------------------rn[INFO] BUILD FAILURErn[INFO] ------------------------------------------------------------------------rn[INFO] Total time: 1.105srn[INFO] Finished at: Fri Jan 08 17:21:58 CST 2016rn[INFO] Final Memory: 4M/15Mrn[INFO] ------------------------------------------------------------------------rn[ERROR] Could not find goal 'generate' in plugin org.apache.maven.plugins:maven-archetype-plugin:1.0-alpha-4 among available goals create-from-project, create -> [Help 1]rn[ERROR] rn[ERROR] To see the full stack trace of the errors, re-run Maven with the -e switch.rn[ERROR] Re-run Maven using the -X switch to enable full debug logging.rn[ERROR] rn[ERROR] For more information about the errors and possible solutions, please read the following articles:rn[ERROR] [Help 1] http://cwiki.apache.org/confluence/display/MAVEN/MojoNotFoundExceptionrn[ERROR] Maven execution terminated abnormally (exit code 1)
MyEclipse下的maven项目报错
maven小白,引入个项目各种错,pom是别人写的,自己配置的maven,安装的nexus,大部分jar包都是自己重网上下的rntest 报错rn[code=java]The POM for org.nutz:nutz:jar:1.r.58-SNAPSHOT is missing, no dependency information available[/code]rnrn[code=java][WARNING] The POM for org.nutz:nutz-plugins-views:jar:1.r.58-SNAPSHOT is missing, no dependency information availablern[WARNING] The POM for org.apache.commons:commons-collections4:jar:4.1 is invalid, transitive dependencies (if any) will not be available, enable debug logging for more details[/code]rn[code=java][ERROR] Failed to execute goal on project nutzwk: Could not resolve dependencies for project cn.wizzer:nutzwk:war:3.2.0: The following artifacts could not be resolved: org.nutz:nutz:jar:1.r.58-SNAPSHOT, org.nutz:nutz-plugins-views:jar:1.r.58-SNAPSHOT: Could not find artifact org.nutz:nutz:jar:1.r.58-SNAPSHOT in nexus-public-snapshots (http://maven.aliyun.com/nexus/content/repositories/snapshots/) -> [Help 1]rn[ERROR] rn[ERROR] To see the full stack trace of the errors, re-run Maven with the -e switch.rn[ERROR] Re-run Maven using the -X switch to enable full debug logging.rn[ERROR] rn[ERROR] For more information about the errors and possible solutions, please read the following articles:rn[ERROR] [Help 1] http://cwiki.apache.org/confluence/display/MAVEN/DependencyResolutionException[/code]rnrn关于snaoshop版本的问题,是我settings设置的问题还是我nexus的问题?rnrn还有我的pom.xml一直报错,但是不显示哪里报错。。。rnrn求助各位,小弟先谢谢各位了
eclipse建立maven项目报错
[img=https://img-bbs.csdn.net/upload/201604/23/1461368415_783068.png][/img]rnrn
maven项目报错:找不到编译器
在运行maven项目时,报错 [ERROR] Failed to execute goal org.apache.maven.plugins:maven-compiler-plugin:3.2:compile (default-compile) on project taotao-manager-pojo: Compilation failure [ERROR] No compiler is
Eclipse创建Maven项目报错
Maven报错:maven-archetype-webapp:RELEASE from any of the configured repositories 通过Eclipse创建Maven web项目报错,截图如下: 问题原因: 在settings.xml 文件中 mirrors出了问题。默认maven3.1.0安装目录下的conf目录下的setting.xml
maven创建项目报错
今天创建MAVEN项目报了一奇怪的错误,Unable to create project from archetype [org.apache.maven.archetypes:maven-archetype-quickstart:1.1] Unable to add module to the current project as it is not of packaging type 'p...
maven 新建项目报错
Could not resolve archetype org.apache.maven.archetypes:maven-archetype-webapp:RELEASE from any of the configured repositories.  Could not resolve artifact  Failed to resolve version for org.apach
使用Maven创建项目报错
其实我自己也不知道为什么错了,但是找了好久的答案,终于解决了。现在把方案放上来,仅供参考。 修改 setting.xml文件 setting.xml文件的地址可以通过Windows-Preferences-Maven-User Settings 查看 原setting.xml文件 mirrors>     <!-- mirror       | Specifies a reposito
导入maven项目报错
今天接支付的时候,将别人的maven程序导入的时候编译报错,在网上也查了一些,有点说是jar冲突,可我第一次用maven,真不知道这个该怎么解决。求大神帮帮忙,快急死了
maven搭建项目报错
在搭建maven项目的时候,由于我已经搭建好了这个maven项目 ,在pom.xml文件中设置好了jdk的版本,后来因为设置版本太低,只能在pom.xml中修改配置,然后update这个maven项目,然后就报了下面的错误 Description Resource Path Location Type The project was not built due to ...
【Java】Maven项目报错汇总
前言          最近在做项目,在Eclipse上编写java的过程中,经常碰到各种各样的错误,所以在这里将自己碰到的部分问题汇总,下面仅写出了自己的解决方法。不代表能够解决所有人的问题!供有需要的同仁参考,如有见解或更多解决方法,请留言指出。感谢! 问题一 报错如下: BeanFactory not initialized or already closed - call 'refr...
编译Maven项目报错、
错误信息:rn[ERROR] Plugin org.apache.maven.plugins:maven-jar-plugin:2.3.1 or one of its dependencies could not be resolved: Failed to read artifact descriptor for org.apache.maven.plugins:maven-jar-plugin:jar:2.3.1: Could not transfer artifact org.apache.maven.plugins:maven-jar-plugin:pom:2.3.1 from/to central (http://repo1.maven.org/maven2): Connect times out -> [Help 1]rn[ERROR] rn[ERROR] To see the full stack trace of the errors, re-run Maven with the -e switch.rn[ERROR] Re-run Maven using the -X switch to enable full debug logging.rn[ERROR] rn[ERROR] For more information about the errors and possible solutions, please read the following articles:rn[ERROR] [Help 1] http://cwiki.apache.org/confluence/display/MAVEN/PluginResolutionExceptionrnrn什么错误?
eclipse 创建maven项目报错
创建完maven项目 报错 怎么解决?
IDEA生成MAVEN项目报错
[WARNING] Could not transfer metadata org.apache.maven.plugins:maven-archetype-plugin/maven-metadata.xml from/to central (http://repo.maven.apache.org/maven2): Connection to http://repo.maven.apache.o...
myEclipse 创建maven项目报错
刚刚为MyEclipse配置maven 开始新建项目就开始报错 rnorg.eclipse.wst.common.project.facet.core.FacetedProjectFrameworkException:Failed while installing Dynamic Web Module 3.0rn[img=https://img-bbs.csdn.net/upload/201405/07/1399469182_108948.jpg][/img]rnrn各位大神看看这是怎么回事啊
Xcode7 更新后三方框架丢失。项目报错解决方法
报错图: 关于bitCode的问题,解决如下: Enable Bitcode 设置为NO,一般就不会报错啦!
java maven项目报错解决办法
2019独角兽企业重金招聘Python工程师标准&gt;&gt;&gt; ...
eclipse导入maven项目报错
Eclipse安装maven插件,报错信息如下:  Java代码   Cannot complete the install because one or more required items could not be found.     Software being installed: Maven Integration for Eclipse (Requir
maven 项目报错注意事项
启动报错少包 选中项目->右键Properties->选择Deployment Assemby->选择Add->选中Java Build Path Entries->Next->选择Maven Dependencies->Finish->Apply->OK @Override 选中项目->右键Properties->java complier 1.6
STS创建Maven项目报错
Description Resource Path Location Type  Could not calculate build plan: Failure to transfer org.apache.maven.plugins:maven-war-plugin:pom:2.1.1 from http://repo1.maven.org/maven2 was cached in the
相关热词 c#串口测试应用程序 c# 匹配 正则表达式 c#防止窗体重绘 c#读写txt文件 c#挖地雷源代码 c#弹框选项 c# 移除 队列 c# 密码写入配置文件 c# 获取可用内存大小 c# 嵌入excel编辑