cannot find name 'require'

图片说明

1
扫码支付0.1元 ×
其他相关推荐
Angular2 问题整理
1、使用angular2-highcharts ,compile的时候出现Cannot find name 'require'.的问题。 来自Stack Overflow 在命令行中执行npm install --save @types/node, 将src/tsconfig.app.json文件中的"types": []改为 "types": [ "node"
[Egret学习]error TS2304: 找不到名称“eui”。
根据帮助文档,添加按钮组件 结果提示:error TS2304: 找不到名称“eui” 上网也找了下资料,没有找到类似的,群里求助,可能问题太菜鸟了,没人搭理我 根据经验知道是类包缺失,但是Egret的类包导入不在这里,而是在egretProperties.json 这个属性配置文件里 如图添加: 再重新,项目-构建一次就可以了 大家别笑我。。。这个问题确实难倒
使用gulp-load-plugins报错的解决
最近在使用gulp-load-plugins的时候出现了一个错误。 主要配置如下: const gulp = require('gulp') const gulpLoadPlugins = require('gulp-load-plugins') // load all gulp plugins const plugins = gulpLoadPlugins() gulp.task('com...
nodejs中使用jsonwebtoken模块遇到的错误
前端学习真的是要踩一路的坑啊,我之前学习新知识都是通过看视频,后来发现这种方式太慢,还不如看博客,实操一个项目学习的快。 最近在学习Nodejs的restful风格api的搭建,网上搜了搜发现学习资料还是不好找,博客上的资料都太老了,我找那篇博客都是2015年的了,但是感觉可操作性很强,写的比较小白,适合我这种新手,而且还可以练习使用下postman。再三犹豫下,我还是选了这篇来学习,只能说知识...
在 Windows 上搭建本地 Jekyll 编译环境时问题汇总
按照 在 Windows 上安装 Jekyll 操作。参考链接 在 Windows 上安装 Jekyll Setting up your GitHub Pages site locally with Jekyll - github Run Jekyll on Windows 故障诊断问题一 C:\WINDOWS\system32>gem install jekyll ERR
rollup+es6最佳实践
简单说下rollup就是只将调用过的模块打包,做到尽量精简的打包。使用webpack 1.X 版本是无法利用该特性来避免引入冗余模块代码的webpack2 已经出来好几款 beta 版本了,同样也加上了对 Tree-shaking 的支持1.src中的文件jquery.js// 出口 import init from './init'; init(jQuery);export default jQu
自定义百度网盘分享密码 (Javascript)
原文地址:https://www.giuem.com/baidu-pan-customize-share-password-by-javascript/ 最近看到几个小伙伴的博客都在说这个自定义密码的,作为高三狗的我忍不住也要插上一脚了。。 首先看下效果吧。(一不小心就开车了) 地址:http://pan.baidu.com/s/1o7bIomm密码:帅B
由于安全加固引起的数据库不能访问
客户环境: linux 下 oracle 11.2.0.4  rac    客户反应数据库不能访问,远程登陆到数据库 su - grid用户 id: cannot find name for user ID 1001 id: cannot find name for group ID 1000 id: cannot find name for user ID 1001 su - o
记 Mac Pro 系统升级后,编译安装 PHP-5.6.28 / PHP-7.0 报错修复过程
买 Mac Pro 的时候,系统为 OS X 10.11.5,编译 PHP-5.6.21 的时候,也遇到一些坑,安装过程记录如下: Mac Pro 编译安装 PHP 5.6.21 及 问题汇总 后来,系统升级为 OS X 10.11.6,再后来,打算升级  PHP 至 5.6.28,报错:  【报错1】 ./configure 时报错 conftest.c:9:10: fatal e...
Taro 小程序实战技术摘要
React 一个用于构建用户界面的 JAVASCRIPT 库。采用声明范式,可以轻松描述应用。通过对DOM的模拟,最大限度地减少与DOM的交互。组件复用,能够很好的应用在大项目的开发中。单向响应的数据流,使得开发变得清晰。 Taro Taro 是一套遵循 React 语法规范的 多端开发 解决方案。现如今市面上端的形态多种多样,Web、React-Native、微信小程序等各种端大行其道,当...
Cannot find module 'web3'解决方法以及其他注意事项(1)
使用NodeJS开发Dapp 我使用的系统是Win10,命令用Windows PowerShell(听说这个比cmd好很多,因为可以用linux中命令) 1.需要把环境搭载在需要执行合约的文件目录下,例如投票例子中,Voting.sol所在目录。 2.安装需要等待,不要看着不动就没耐心,不过有时候真的没有在执行,可以看看网络是否在下载,有数据传输的话,证明在运行。 3.关于进入node...
关于node下载的模块无法使用(Cannot find module)解决方法
这个问题困扰了我很久,也按百度上各式各样的方法试了没有用 今天和导师远程,知道了问题在哪,我用webstorm编译器进行演示 若使用其他编译器,可按下述原理进行修改 原理(在当前工程文件夹下要有一个package.json文件,并在此工程下安装npm模块,安装后会出现一个node_modules文件夹,里面包含着下载的模块) 过程: 测试代码: 此时运行,结果如下图, 显示
Node.js使用MongoDB模块时的常见错误
在Node.js中使用MongoDB模块,报错 Error: Cannot find module '../build/Release/bson'... 解决方案: 首先安装bson模块,npm install bson 然后将根目录下node_modules/mongodb/node_modules/bson/ext/index.js文件中(15行) bson = require('.
vscode .vue文件 vetur 报错 (第一行就给我报错)
昨天(2019.04.26)项目一打开就报错,同时,公司同事的编辑器都报错,昨天一直在忙没空关心,今天来解决了,是版本更新造成的问题 设置 “vetur.experimental.templateInterpolationService”: false 即可 哒!!报错没有啦 ...
automake:从c文件到make
如果你有一个C
java.lang.ClassNotFoundException: org.apache.commons.dbcp.BasicDataSource解决方案
java.lang.ClassNotFoundException: org.apache.commons.dbcp.BasicDataSource解决方案,需要将资源中的三个包加载到工程中
React Native学习过程中遇到的坑
本文将记录React Native学习过程中所遇到的各种各样的坑…… 在学习过程中,运行官方的demo,是必不可少的学习手段,所以我们兴致盎然的从github上下载了React Native,结果在运行程序的时候才发现,程序中还有bug导致想看的效果看不到…… module.js:338 throw err; ^ Error: Cannot find modul
pycharm编辑器:cannot import name ‘自定义函数’ 的一种解决方法
刚开始用pycharm写自动化测试没多久,遇到了一个问题,自己写的函数在调取的时候报错。尝试重装python,卸载多版本python,配置PATHONPATH文件路径,检查文件路径,检查语法,添加sys.appen(..)等,均未解决,报错如下经过排查研究发现,之前新建文件是这样的步骤新建的文件图标显示python形式,但是没有后缀名运行结果一直报错。。。后来新建了一个文件,直接选择了python...
ubuntu 编译时遇到 cannot find -lncurses 使用 解决办法
编译时遇到 cannot find -lncurses,原因是没有安装libncurses5-devncurses是一个字符终端下屏幕控制的基本库。要编译一些老程序,还经常遇得到。只需执行安装命令:sudo apt-get install libncurses5-dev
【SSH】--框架搭建错误及项目中问题
2015.11.04日 404是浏览器无法连接到服务器,500是IIS无法解析ASP,总结了一下自己的错误, 404: 1.hibernate配置文件配错,多写了主键 2.spring里面JSP跳转配错 3.DAO层没有继承HibernateDaoSupport类 4.vo层和Hibernate配置文件缺少实体映射联系 500: 1.Action里面注入的方...
Spring配置错误记录
更多Spring问题由于发生时未记录而遗忘了~~~~~~~ 现在动动手 解决方案由于不是源头分析因而仅供参考!!! 严重: Exception sending context destroyed event to listener instance of class org.springframework.web.context.ContextLoaderListener jav
Mybatis找不到jdbc.properties中的变量的错误:{jdbc_driverClassName}不起作用,的解决方案
Exception in thread "main" org.apache.ibatis.exceptions.PersistenceException:  ### Error querying database.  Cause: java.sql.SQLException: Error setting driver on UnpooledDataSource. Cause: java.la
常见的 Kerberos 错误消息 (A-M)
本节按字母顺序 (A-M) 列出了 Kerberos 命令、Kerberos 守护进程、PAM 框架、GSS 接口、NFS 服务和 Kerberos 库的常见错误消息。   All authentication systems disabled; connection refused 原因: 此版本的 rlogind 不支持任何验证机制。 解决方法: 请确保调用的 rlogind ...
关于cannot find module 'xxxx’的一个可能解决方法。
关于cannot find module 'xxxx’的一个可能解决方法。 由于学习angular2,想单独学习一下typescript下angular2使用的‘rxjs’是怎么使用的,我用npm自己安装了rxjs,并使用了如下语句 import { Observable } from 'rxjs'; 报错如下: cannot find module 'rxjs', 但是同样的语句在angular...
Linux系统中提示/usr/bin/ld: cannot find -lxxx错误的通用解决方法
https://blog.csdn.net/zqj6893/article/details/17042671
AndroidJpsBundle资源文件
解决android编译文件,添加并包含AndroidJpsBundle.properties Error:Android Source Generator: Error: Can't find bundle for base name messages.AndroidJpsBundle, locale zh_CN java.util.MissingResourceException: Can't find bundle for base name messages.AndroidJpsBundle, locale zh_CN at java.util.ResourceBundle.throwMissingResourceException(ResourceBundle.java:1564) at java.util.ResourceBundle.getBundleImpl(ResourceBundle.java:1387) at java.util.ResourceBundle.getBundle(ResourceBundle.java:773) at org.jetbrains.jps.android.AndroidJpsBundle.getBundle(AndroidJpsBundle.java:22) at org.jetbrains.jps.android.AndroidJpsBundle.message(AndroidJpsBundle.java:32)
webpack3.0问题系列 ——postcss-loader的使用
问题:把autoprefixer在webpack.config.js中设置   出现 Module build failed: Error: No PostCSS Config found in: 解决方案: 只是换了一种引入方式,解决了   1,创建postcss.config.js文件,添加如下代码:(引入autoprefixer插件) module.export
初次使用webpack 时候遇到的奇葩问题“Cannot find module 'webpack'”
在项目用用webpack 编译文件的时候 执行如下操作 于是就出现了下列报错: Cannot find module ‘webpack’ 哈哈,其实不知道什么问题, 然后自己百度,原来是版本的问题, 因为在webpack 3中,webpack本身和它的CLI以前都是在同一个包中,但在第4版中,他们已经将两者分开来更好地管理它们。 所以用 npm install webpack-cli -g 命...
cannot find -l****问题的解决办法
在ubuntu下编译C或cpp文件时,可能会出现找不到链接库的问题,其形式为:cannot find -l****这里的**一般是指的链接库,比如,刚刚装好opencv,按照网上教程一步步编译好了,最后按照教程想要编译一下/example/c下的例子试试,结果执行了./build_all.sh后,爆出一堆上面这种错误,比如,我在自己电脑上出现的错误就是找不到以下库cannot find -lcuda
SSH整合框架遇到的问题
1.Related cause: org.springframework.beans.factory.CannotLoadBeanClassException: Cannot find class [org.springframework.orm.hibernate5.LocalSessionFactoryBean] for bean with name 'sessionFactory' defi...
安装了hogan却提示找不到hogan的解决
根据新版本提示, require('hogan.js')   加上.js 就行
如何解决因为使用了注解而导致的cannot resolve method
Intellij idea  中因为代码中使用了注解功能,而导致满屏的都是红色的错误提示,cannot resolve method . 原因是因为了引入了lombok 的注解功能,解决办法是 进入intellij idea 的setting ----compile(直接搜索) ---Annotation Processors---Enable annotation processi
npm 运行错误
ERROR in ./src/index.scss Module build failed: Error: Cannot find module 'node-sass' Error: EACCES: permission denied, mkdir '/Users/mac/Desktop/.../.../node_modules/_node-sass@3.13.1@node-sass'
an introduction to search engine and web navigation
unique, cannot find it elsewhere
gulp的使用与遇过的坑
一:记录错误:Gulp Error: Cannot find module ‘jshint/src/cli’问题原因: 插件安装不完全,新版本gulp做了一些调整好像。。。。解决方法: 使用npm install –save-dev jshint gulp-jshint 而不是npm install –save-dev gulp-jshint二: 需求:利用gulp生成带版本号的静态文件,这
【Angular】搭建环境出现的问题Cannot find module 'click'
Angular搭建环境出现的问题Cannot find module 'click'解决方案:删掉原来的 node_modules 依赖,重新运行命令:cnpm install
记录Cocos Creator 编译失败问题
在使用Cocos Creator 编译安卓程序时ImportError: cannot import name _remove_dead_weakref当时python安装版本为2.7.14卸载替换安装为python2.7.10修改环境变量后问题解决但是不知为何cmd中python版本仍然是2.7.14。
ethereumjs-tx
web3签名转账所需插件,在html页面中可以引入,方便开发。
安装vue开发调试神器vue-devtools
下载chrome扩展插件 GitHub下载地址: https://github.com/vuejs/vue-devtools使用cnpm代替npm按照依赖包了,npm安装依赖包确实太慢了… cnpm安装查看上篇文章下载chrome扩展插件完成后打开命令行cmd进入vue-devtools文件夹,输入命令cnpm install如果在安装时报错 [fsevents@^1.0.0] option
CXF Web Service 安全认证出错?求大牛解决
公司最近要采用CXF Web Service技术,本人写了个Demo,一路还都OK,但是就是在加入安全认证时出现问题,在百度、谷歌搜索了N久,参考修改了N久,还是解决不了,自己本人都解决吐了,现在求各位大神,大牛解决。 问题:(1)没有加入认证时,客户端连接请求成功! (2)加入安全认证后,出现bug,在eclipse和MyEclipse出现的报错信息还不一样。 一、服务器代码:...
文章热词 机器学习教程 Objective-C培训 交互设计视频教程 颜色模型 设计制作学习
相关热词 mysql关联查询两次本表 native底部 react extjs glyph 图标 怎么学习互联网大数据 村干部学习大数据心得