在CMD中 显示O/S-Error:(os 1073)指定的服务已存在,怎么解决?

由于之前没有安装好,有卸载一次再重新安装以下步骤出现问题:

安装数据库setup.exe完成后,使用管理员身份打开CMD,在CMD中输入以下命令:
perl -l C:\DB\build_files.pl C:\app\Administrator C:\app\Administrator\product\12.1.0\dbhome_1 DB MS-20180215GQGS 1521

输入完成后,继续输入以下命令:
perl -l C:\DB\build_db.pl C:\app\Administrator C:\app\Administrator\product\12.1.0\dbhome_1 DB

在输入以上命令后出现 O/S-Error:(os 1073)指定的服务已存在,导致无法继续安装 ,需要怎么处理

图片说明

Csdn user default icon
上传中...
上传图片
插入图片
抄袭、复制答案,以达到刷声望分或其他目的的行为,在CSDN问答是严格禁止的,一经发现立刻封号。是时候展现真正的技术了!
其他相关推荐
Error: Cannot find module 'gulp-sass'
gulp watch启动项目是报错;Cannot find module 'gulp-sass' E:\workIdap\idap\src\main\resources>gulp watch internal/modules/cjs/loader.js:583 throw err; ^ Error: Cannot find module 'gulp-sass' at Function.Module._resolveFilename (internal/modules/cjs/loader.js:581:15) at Function.Module._load (internal/modules/cjs/loader.js:507:25) at Module.require (internal/modules/cjs/loader.js:637:17) at require (internal/modules/cjs/helpers.js:20:18) at Object.<anonymous> (E:\workIdap\idap\src\main\resources\gulpfile.js:11:12 ) at Module._compile (internal/modules/cjs/loader.js:689:30) at Object.Module._extensions..js (internal/modules/cjs/loader.js:700:10) at Module.load (internal/modules/cjs/loader.js:599:32) at tryModuleLoad (internal/modules/cjs/loader.js:538:12) at Function.Module._load (internal/modules/cjs/loader.js:530:3) E:\workIdap\idap\src\main\resources> ![图片说明](https://img-ask.csdn.net/upload/202002/19/1582103201_336524.png) 使用了一下解决方案 第一种 1.npm update 2.npm install gulp-sass --save-dev
ubuntu zookeeper 启动报错 [[: not found -p: not found
panda@panda-VirtualBox:~/zookeeper-server/zk1/bin$ ls README.txt zkCli.cmd zkEnv.cmd zkServer.cmd zkServer.sh zkCleanup.sh zkCli.sh zkEnv.sh zkServer-initialize.sh panda@panda-VirtualBox:~/zookeeper-server/zk1/bin$ sh zkServer.sh start zkServer.sh: 80: /home/panda/zookeeper-server/zk1/bin/zkEnv.sh: [[: not found -p: not found java is /usr/jvm/jdk1.8/bin/java Error: JAVA_HOME is not set and java could not be found in PATH. panda@panda-VirtualBox:~/zookeeper-server/zk1/bin$ https://zhidao.baidu.com/question/1644189876595332740.html?entry=qb_uhome_tag
在创建dockerFile文件中出现/bin/sh: rm: command not found
* 通过学习dockerfile命令试着自己做一下练习,在联系过程中出现 `/bin/sh: rm: command not found` * 代码 ```` FROM centos:latest MAINTAINER my<my@163.com> ENV PATH /tmp WORKDIR $PATH RUN rm -rf /tmp CMD /bin/bash ```` * Build过程 ``` Sending build context to Docker daemon 2.048 kB Step 1/6 : FROM centos:latest ---> 1e1148e4cc2c Step 2/6 : MAINTAINER my<my@163.com> ---> Running in dc6073af05a2 ---> b6f7e3b7bca8 Removing intermediate container dc6073af05a2 Step 3/6 : ENV PATH /tmp ---> Running in 7d000413c304 ---> f643d6b20259 Removing intermediate container 7d000413c304 Step 4/6 : WORKDIR $PATH ---> 340ef4b29f1c Removing intermediate container 658c7d7a96b9 Step 5/6 : RUN rm -rf /tmp ---> Running in 3aad9ab202d1 /bin/sh: rm: command not found The command '/bin/sh -c rm -rf /tmp' returned a non-zero code: 127 ``` 以上请大神指点迷津
spark: syntax error near unexpected token `"$ARG"'
root 用户下,run-example SparkPi,出现permission denied,授权访问后,再次运行出现如下错误,改用最新的spark版本1.6.1,也是出现同样的问题,请问该如何解决该问题? /opt/spark-lecture/spark-1.5.2-bin-hadoop2.6/bin/spark-class: line 76: syntax error near unexpected token `"$ARG"' /opt/spark-lecture/spark-1.5.2-bin-hadoop2.6/bin/spark-class: line 76: ` CMD+=("$ARG")'
如何创建一个带有指定版本Python和JupyterLab的环境?
&emsp;&emsp;请问要如何在Anaconda中创建一个同时拥有Python 3.7.4与JupyterLab 1.1.4的环境? &emsp;&emsp;我在cmd中通过以下命令创建了一个Python 3.7.4环境: ```batch D:\Anaconda3\envs>conda create -n dp python=3.7 WARNING: A directory already exists at the target location 'D:\Anaconda3\envs\dp' but it is not a conda environment. Continue creating environment (y/[n])? y Collecting package metadata (current_repodata.json): done Solving environment: done ## Package Plan ## environment location: D:\Anaconda3\envs\dp added / updated specs: - python=3.7 The following NEW packages will be INSTALLED: ca-certificates anaconda/pkgs/main/win-64::ca-certificates-2019.8.28-0 certifi anaconda/pkgs/main/win-64::certifi-2019.9.11-py37_0 openssl anaconda/pkgs/main/win-64::openssl-1.1.1d-he774522_2 pip anaconda/pkgs/main/win-64::pip-19.2.3-py37_0 python anaconda/pkgs/main/win-64::python-3.7.4-h5263a28_0 setuptools anaconda/pkgs/main/win-64::setuptools-41.4.0-py37_0 sqlite anaconda/pkgs/main/win-64::sqlite-3.30.0-he774522_0 vc anaconda/pkgs/main/win-64::vc-14.1-h0510ff6_4 vs2015_runtime anaconda/pkgs/main/win-64::vs2015_runtime-14.16.27012-hf0eaf9b_0 wheel anaconda/pkgs/main/win-64::wheel-0.33.6-py37_0 wincertstore anaconda/pkgs/main/win-64::wincertstore-0.2-py37_0 ``` &emsp;&emsp;Python 3.7.4被成功安装,但当继续安装JupyterLab时,会出现以下问题: ```batch D:\Anaconda3\envs>activate dp D:\Anaconda3\envs>conda.bat activate dp (dp) D:\Anaconda3\envs>conda install jupyterlab Collecting package metadata (current_repodata.json): done Solving environment: failed with initial frozen solve. Retrying with flexible solve. Solving environment: failed with repodata from current_repodata.json, will retry with next repodata source. Collecting package metadata (repodata.json): done Solving environment: failed with initial frozen solve. Retrying with flexible solve. Solving environment: | Found conflicts! Looking for incompatible packages. ... UnsatisfiableError: The following specifications were found to be incompatible with each other: Package tornado conflicts for: jupyterlab -> tornado[version='!=6.0.0,!=6.0.1,!=6.0.2'] Package jinja2 conflicts for: jupyterlab -> jinja2[version='>=2.10'] Package notebook conflicts for: jupyterlab -> notebook[version='>=4.3|>=4.3.1'] Package nodejs conflicts for: jupyterlab -> nodejs[version='<10'] Package sqlite conflicts for: python=3.7 -> sqlite[version='>=3.25.3,<4.0a0|>=3.26.0,<4.0a0|>=3.27.2,<4.0a0|>=3.28.0,<4.0a0|>=3.29.0,<4.0a0'] Package openssl conflicts for: python=3.7 -> openssl[version='>=1.1.1a,<1.1.2a|>=1.1.1b,<1.1.2a|>=1.1.1c,<1.1.2a'] Package pip conflicts for: python=3.7 -> pip Package jupyterlab_launcher conflicts for: jupyterlab -> jupyterlab_launcher[version='>=0.10.0,<0.11.0|>=0.11.0,<0.12.0|>=0.11.2,<0.12.0|>=0.13.1,<0.14.0|>=0.4.0|>=0.6.0,<0.7.0'] Package subprocess32 conflicts for: jupyterlab -> subprocess32 Package futures conflicts for: jupyterlab -> futures Package jupyterlab_server conflicts for: jupyterlab -> jupyterlab_server[version='>=0.2.0,<0.3.0|>=1.0.0,<2.0.0'] Package vc conflicts for: python=3.7 -> vc[version='14.*|>=14.1,<15.0a0'] ``` &emsp;&emsp;这个是什么问题?如何解决?感觉默认的base环境很庞大,很多东西用不到。但想要使用JupyterLab又不得不安装……
我导入koral--/android-gif-drawable这个会出错,怎么解决?
错误信息: Error:Execution failed for task ':android-gif-drawable:cleanNative'. > A problem occurred starting process 'command 'null/ndk-build.cmd''
error MSB6006: “cmd.exe”已退出,代码为 1。
1>------ 已启动生成: 项目: ZERO_CHECK, 配置: Debug Win32 ------ 1> Checking Build System 1> 系统找不到指定的路径。 1> 系统找不到指定的批处理标签 - VCReportError 1>C:\Program Files\MSBuild\Microsoft.Cpp\v4.0\Microsoft.CppCommon.targets(151,5): error MSB6006: “cmd.exe”已退出,代码为 1。 2>------ 已启动生成: 项目: boost_system, 配置: Debug Win32 ------ 3>------ 已启动生成: 项目: boost_thread, 配置: Debug Win32 ------ 2> Building Custom Rule F:/FireBreath-firebreath-1.7.0/FireBreath-firebreath-1.7.0/src/3rdParty/boost/libs/system/CMakeLists.txt 2> 系统找不到指定的路径。 2> 系统找不到指定的批处理标签 - VCReportError 3> Building Custom Rule F:/FireBreath-firebreath-1.7.0/FireBreath-firebreath-1.7.0/src/3rdParty/boost/libs/thread/CMakeLists.txt 2>C:\Program Files\MSBuild\Microsoft.Cpp\v4.0\Microsoft.CppCommon.targets(151,5): error MSB6006: “cmd.exe”已退出,代码为 1。 3> 系统找不到指定的路径。 3> 系统找不到指定的批处理标签 - VCReportError 3>C:\Program Files\MSBuild\Microsoft.Cpp\v4.0\Microsoft.CppCommon.targets(151,5): error MSB6006: “cmd.exe”已退出,代码为 1。 4>------ 已启动生成: 项目: PluginCore, 配置: Debug Win32 ------ 5>------ 已启动生成: 项目: ScriptingCore, 配置: Debug Win32 ------ 4> Building Custom Rule F:/FireBreath-firebreath-1.7.0/FireBreath-firebreath-1.7.0/src/PluginCore/CMakeLists.txt 4> 系统找不到指定的路径。 4> 系统找不到指定的批处理标签 - VCReportError 4>C:\Program Files\MSBuild\Microsoft.Cpp\v4.0\Microsoft.CppCommon.targets(151,5): error MSB6006: “cmd.exe”已退出,代码为 1。 6>------ 已启动生成: 项目: bsr_PluginAuto, 配置: Debug Win32 ------ 5> Building Custom Rule F:/FireBreath-firebreath-1.7.0/FireBreath-firebreath-1.7.0/src/ScriptingCore/CMakeLists.txt 5> 系统找不到指定的路径。 5> 系统找不到指定的批处理标签 - VCReportError 5>C:\Program Files\MSBuild\Microsoft.Cpp\v4.0\Microsoft.CppCommon.targets(151,5): error MSB6006: “cmd.exe”已退出,代码为 1。 7>------ 已启动生成: 项目: NpapiCore, 配置: Debug Win32 ------ 6> Building Custom Rule F:/FireBreath-firebreath-1.7.0/FireBreath-firebreath-1.7.0/src/PluginAuto/CMakeLists.txt 7> Building Custom Rule F:/FireBreath-firebreath-1.7.0/FireBreath-firebreath-1.7.0/src/NpapiCore/CMakeLists.txt 6> 系统找不到指定的路径。 7> 系统找不到指定的路径。 7> 系统找不到指定的批处理标签 - VCReportError 6> 系统找不到指定的批处理标签 - VCReportError 6>C:\Program Files\MSBuild\Microsoft.Cpp\v4.0\Microsoft.CppCommon.targets(151,5): error MSB6006: “cmd.exe”已退出,代码为 1。 7>C:\Program Files\MSBuild\Microsoft.Cpp\v4.0\Microsoft.CppCommon.targets(151,5): error MSB6006: “cmd.exe”已退出,代码为 1。 8>------ 已启动生成: 项目: ActiveXCore, 配置: Debug Win32 ------ 8> Building Custom Rule F:/FireBreath-firebreath-1.7.0/FireBreath-firebreath-1.7.0/src/ActiveXCore/CMakeLists.txt 8> 系统找不到指定的路径。 8> 系统找不到指定的批处理标签 - VCReportError 8>C:\Program Files\MSBuild\Microsoft.Cpp\v4.0\Microsoft.CppCommon.targets(151,5): error MSB6006: “cmd.exe”已退出,代码为 1。 9>------ 已启动生成: 项目: ptIntellCfgPlugin, 配置: Debug Win32 ------ 9> Building Custom Rule F:/FireBreath-firebreath-1.7.0/FireBreath-firebreath-1.7.0/projects/ptIntellCfgPlugin/CMakeLists.txt 9> 系统找不到指定的路径。 9> 系统找不到指定的批处理标签 - VCReportError 9>C:\Program Files\MSBuild\Microsoft.Cpp\v4.0\Microsoft.CppCommon.targets(151,5): error MSB6006: “cmd.exe”已退出,代码为 1。 ========== 生成: 成功 0 个,失败 9 个,最新 1 个,跳过 0 个 ==========
LaTeX2019安装过程问题
win10下安装,已按照LaTeXstudio的指导尝试过删除编译环境mingw;将编译环境换成只剩system23那几项;用cmd运行;用管理员身份运行;删除临时文件再试试。 但仍然每次安装进度到326的时候就会出现如下错误代码,是兼容性问题还是什么? 搞了一天唯一的收获时TLUtils是perl寓言的? 完全没有头绪,还请各位赐教了 ``` Installing [0326/3758, time/total: 10:18/02:04:05]: bib-fr [15k] TLUtils::check_file: removing C:\Users\czh908\AppData\Local\Temp\4UCzBUjHfF\J7Gnr8D0_L/bib-fr.tar.xz, checksums differ: TLUtils::check_file: TL=5b064bc1a42b98118ed3b9aecc9511e6e2ccc1b8e5813860e611da49062dca603fb0e21ce4e6f8b39f9b352f9040867bd55c558320f9d035be179a67f8edf2f9, arg=24e5ada94266ba8786470453bf8a076891e9b7efac1ff64fcb559bfe2c95875d3120634f94f464c9e40da0f45b18a78af1bc428106b31e85851a2998b58f0834 TLPDB::_install_package: consistency checks failed Installation failed. Rerunning the installer will try to restart the installation. Or you can restart by running the installer with: install-tl-windows.bat --profile installation.profile [EXTRA-ARGS] or install-tl-advanced.bat --profile installation.profile [EXTRA-ARGS] D:/LaTeX/install-tl: Writing log in current directory: C:/WINDOWS/system32/install-tl.log ```
cloudera manager 离线安装安装agent时,向主节点下载资源超时
错误日志: [19/Nov/2018 16:16:04 +0000] 2789 MainThread stacks_collection_manager INFO Using max_uncompressed_file_size_bytes: 5242880 [19/Nov/2018 16:16:04 +0000] 2789 MainThread __init__ INFO Importing metric schema from file /opt/cloudera-manager/cm-5.10.2/lib64/cmf/agent/build/env/lib/python2.6/site-packages/cmf-5.10.2-py2.6.egg/cmf/monitor/schema.json [19/Nov/2018 16:16:04 +0000] 2789 MainThread agent INFO Supervised processes will add the following to their environment (in addition to the supervisor's env): {'CDH_PARQUET_HOME': '/usr/lib/parquet', 'JSVC_HOME': '/usr/libexec/bigtop-utils', 'CMF_PACKAGE_DIR': '/opt/cloudera-manager/cm-5.10.2/lib64/cmf/service', 'CDH_HADOOP_BIN': '/usr/bin/hadoop', 'MGMT_HOME': '/opt/cloudera-manager/cm-5.10.2/share/cmf', 'CDH_IMPALA_HOME': '/usr/lib/impala', 'CDH_YARN_HOME': '/usr/lib/hadoop-yarn', 'CDH_HDFS_HOME': '/usr/lib/hadoop-hdfs', 'PATH': '/sbin:/usr/sbin:/bin:/usr/bin', 'CDH_HUE_PLUGINS_HOME': '/usr/lib/hadoop', 'CM_STATUS_CODES': u'STATUS_NONE HDFS_DFS_DIR_NOT_EMPTY HBASE_TABLE_DISABLED HBASE_TABLE_ENABLED JOBTRACKER_IN_STANDBY_MODE YARN_RM_IN_STANDBY_MODE', 'KEYTRUSTEE_KP_HOME': '/usr/share/keytrustee-keyprovider', 'CLOUDERA_ORACLE_CONNECTOR_JAR': '/usr/share/java/oracle-connector-java.jar', 'CDH_SQOOP2_HOME': '/usr/lib/sqoop2', 'KEYTRUSTEE_SERVER_HOME': '/usr/lib/keytrustee-server', 'CDH_MR2_HOME': '/usr/lib/hadoop-mapreduce', 'HIVE_DEFAULT_XML': '/etc/hive/conf.dist/hive-default.xml', 'CLOUDERA_POSTGRESQL_JDBC_JAR': '/opt/cloudera-manager/cm-5.10.2/share/cmf/lib/postgresql-9.0-801.jdbc4.jar', 'CDH_KMS_HOME': '/usr/lib/hadoop-kms', 'CDH_HBASE_HOME': '/usr/lib/hbase', 'CDH_SQOOP_HOME': '/usr/lib/sqoop', 'WEBHCAT_DEFAULT_XML': '/etc/hive-webhcat/conf.dist/webhcat-default.xml', 'CDH_OOZIE_HOME': '/usr/lib/oozie', 'CDH_ZOOKEEPER_HOME': '/usr/lib/zookeeper', 'CDH_HUE_HOME': '/usr/lib/hue', 'CLOUDERA_MYSQL_CONNECTOR_JAR': '/usr/share/java/mysql-connector-java.jar', 'CDH_HBASE_INDEXER_HOME': '/usr/lib/hbase-solr', 'CDH_MR1_HOME': '/usr/lib/hadoop-0.20-mapreduce', 'CDH_SOLR_HOME': '/usr/lib/solr', 'CDH_PIG_HOME': '/usr/lib/pig', 'CDH_SENTRY_HOME': '/usr/lib/sentry', 'CDH_CRUNCH_HOME': '/usr/lib/crunch', 'CDH_LLAMA_HOME': '/usr/lib/llama/', 'CDH_HTTPFS_HOME': '/usr/lib/hadoop-httpfs', 'ROOT': '/opt/cloudera-manager/cm-5.10.2/lib64/cmf', 'CDH_HADOOP_HOME': '/usr/lib/hadoop', 'CDH_HIVE_HOME': '/usr/lib/hive', 'ORACLE_HOME': '/usr/share/oracle/instantclient', 'CDH_HCAT_HOME': '/usr/lib/hive-hcatalog', 'CDH_KAFKA_HOME': '/usr/lib/kafka', 'CDH_SPARK_HOME': '/usr/lib/spark', 'TOMCAT_HOME': '/usr/lib/bigtop-tomcat', 'CDH_FLUME_HOME': '/usr/lib/flume-ng'} [19/Nov/2018 16:16:04 +0000] 2789 MainThread agent INFO To override these variables, use /etc/cloudera-scm-agent/config.ini. Environment variables for CDH locations are not used when CDH is installed from parcels. [19/Nov/2018 16:16:04 +0000] 2789 MainThread agent INFO Created /opt/cloudera-manager/cm-5.10.2/run/cloudera-scm-agent/process [19/Nov/2018 16:16:04 +0000] 2789 MainThread agent INFO Chmod'ing /opt/cloudera-manager/cm-5.10.2/run/cloudera-scm-agent/process to 0751 [19/Nov/2018 16:16:04 +0000] 2789 MainThread agent INFO Created /opt/cloudera-manager/cm-5.10.2/run/cloudera-scm-agent/supervisor [19/Nov/2018 16:16:04 +0000] 2789 MainThread agent INFO Chmod'ing /opt/cloudera-manager/cm-5.10.2/run/cloudera-scm-agent/supervisor to 0751 [19/Nov/2018 16:16:04 +0000] 2789 MainThread agent INFO Created /opt/cloudera-manager/cm-5.10.2/run/cloudera-scm-agent/flood [19/Nov/2018 16:16:04 +0000] 2789 MainThread agent INFO Chowning /opt/cloudera-manager/cm-5.10.2/run/cloudera-scm-agent/flood to cloudera-scm (498) cloudera-scm (498) [19/Nov/2018 16:16:04 +0000] 2789 MainThread agent INFO Chmod'ing /opt/cloudera-manager/cm-5.10.2/run/cloudera-scm-agent/flood to 0751 [19/Nov/2018 16:16:04 +0000] 2789 MainThread agent INFO Created /opt/cloudera-manager/cm-5.10.2/run/cloudera-scm-agent/supervisor/include [19/Nov/2018 16:16:04 +0000] 2789 MainThread agent INFO Chmod'ing /opt/cloudera-manager/cm-5.10.2/run/cloudera-scm-agent/supervisor/include to 0751 [19/Nov/2018 16:16:04 +0000] 2789 MainThread agent ERROR Failed to connect to previous supervisor. Traceback (most recent call last): File "/opt/cloudera-manager/cm-5.10.2/lib64/cmf/agent/build/env/lib/python2.6/site-packages/cmf-5.10.2-py2.6.egg/cmf/agent.py", line 2073, in find_or_start_supervisor self.configure_supervisor_clients() File "/opt/cloudera-manager/cm-5.10.2/lib64/cmf/agent/build/env/lib/python2.6/site-packages/cmf-5.10.2-py2.6.egg/cmf/agent.py", line 2254, in configure_supervisor_clients supervisor_options.realize(args=["-c", os.path.join(self.supervisor_dir, "supervisord.conf")]) File "/opt/cloudera-manager/cm-5.10.2/lib64/cmf/agent/build/env/lib/python2.6/site-packages/supervisor-3.0-py2.6.egg/supervisor/options.py", line 1599, in realize Options.realize(self, *arg, **kw) File "/opt/cloudera-manager/cm-5.10.2/lib64/cmf/agent/build/env/lib/python2.6/site-packages/supervisor-3.0-py2.6.egg/supervisor/options.py", line 333, in realize self.process_config() File "/opt/cloudera-manager/cm-5.10.2/lib64/cmf/agent/build/env/lib/python2.6/site-packages/supervisor-3.0-py2.6.egg/supervisor/options.py", line 341, in process_config self.process_config_file(do_usage) File "/opt/cloudera-manager/cm-5.10.2/lib64/cmf/agent/build/env/lib/python2.6/site-packages/supervisor-3.0-py2.6.egg/supervisor/options.py", line 376, in process_config_file self.usage(str(msg)) File "/opt/cloudera-manager/cm-5.10.2/lib64/cmf/agent/build/env/lib/python2.6/site-packages/supervisor-3.0-py2.6.egg/supervisor/options.py", line 164, in usage self.exit(2) SystemExit: 2 [19/Nov/2018 16:16:04 +0000] 2789 MainThread tmpfs INFO Successfully mounted tmpfs at /opt/cloudera-manager/cm-5.10.2/run/cloudera-scm-agent/process [19/Nov/2018 16:16:05 +0000] 2789 MainThread agent INFO Trying to connect to newly launched supervisor (Attempt 1) [19/Nov/2018 16:16:05 +0000] 2789 MainThread agent INFO Supervisor version: 3.0, pid: 2821 [19/Nov/2018 16:16:05 +0000] 2789 MainThread agent INFO Successfully connected to supervisor [19/Nov/2018 16:16:05 +0000] 2789 MainThread status_server INFO Using maximum impala profile bundle size of 1073741824 bytes. [19/Nov/2018 16:16:05 +0000] 2789 MainThread status_server INFO Using maximum stacks log bundle size of 1073741824 bytes. [19/Nov/2018 16:16:05 +0000] 2789 MainThread _cplogging INFO [19/Nov/2018:16:16:05] ENGINE Bus STARTING [19/Nov/2018 16:16:05 +0000] 2789 MainThread _cplogging INFO [19/Nov/2018:16:16:05] ENGINE Started monitor thread '_TimeoutMonitor'. [19/Nov/2018 16:16:06 +0000] 2789 MainThread _cplogging INFO [19/Nov/2018:16:16:06] ENGINE Serving on yingzhi01.com:9000 [19/Nov/2018 16:16:06 +0000] 2789 MainThread _cplogging INFO [19/Nov/2018:16:16:06] ENGINE Bus STARTED [19/Nov/2018 16:16:06 +0000] 2789 MainThread __init__ INFO New monitor: (<cmf.monitor.host.HostMonitor object at 0x2990c50>,) [19/Nov/2018 16:16:06 +0000] 2789 MonitorDaemon-Scheduler __init__ INFO Monitor ready to report: ('HostMonitor',) [19/Nov/2018 16:16:06 +0000] 2789 MainThread agent INFO Setting default socket timeout to 30 [19/Nov/2018 16:16:06 +0000] 2789 Monitor-HostMonitor network_interfaces INFO NIC iface eth0 doesn't support ETHTOOL (95) [19/Nov/2018 16:16:06 +0000] 2789 Monitor-HostMonitor throttling_logger ERROR Error getting directory attributes for /opt/cloudera-manager/cm-5.10.2/log/cloudera-scm-agent Traceback (most recent call last): File "/opt/cloudera-manager/cm-5.10.2/lib64/cmf/agent/build/env/lib/python2.6/site-packages/cmf-5.10.2-py2.6.egg/cmf/monitor/dir_monitor.py", line 90, in _get_directory_attributes name = pwd.getpwuid(uid)[0] KeyError: 'getpwuid(): uid not found: 1106' [19/Nov/2018 16:16:06 +0000] 2789 MainThread heartbeat_tracker INFO HB stats (seconds): num:1 LIFE_MIN:0.22 min:0.22 mean:0.22 max:0.22 LIFE_MAX:0.22 [19/Nov/2018 16:16:06 +0000] 2789 MainThread agent INFO CM server guid: dceeafae-a884-42f1-ba7b-4ee187ef3bef [19/Nov/2018 16:16:06 +0000] 2789 MainThread agent INFO Using parcels directory from server provided value: /opt/cloudera/parcels [19/Nov/2018 16:16:06 +0000] 2789 MainThread agent WARNING Expected user root for /opt/cloudera/parcels but was cloudera-scm [19/Nov/2018 16:16:06 +0000] 2789 MainThread agent WARNING Expected group root for /opt/cloudera/parcels but was cloudera-scm [19/Nov/2018 16:16:06 +0000] 2789 MainThread agent INFO Created /opt/cloudera/parcel-cache [19/Nov/2018 16:16:06 +0000] 2789 MainThread agent INFO Chowning /opt/cloudera/parcel-cache to root (0) root (0) [19/Nov/2018 16:16:06 +0000] 2789 MainThread agent INFO Chmod'ing /opt/cloudera/parcel-cache to 0755 [19/Nov/2018 16:16:06 +0000] 2789 MainThread parcel INFO Agent does create users/groups and apply file permissions [19/Nov/2018 16:16:06 +0000] 2789 MainThread downloader INFO Downloader path: /opt/cloudera/parcel-cache [19/Nov/2018 16:16:06 +0000] 2789 MainThread parcel_cache INFO Using /opt/cloudera/parcel-cache for parcel cache [19/Nov/2018 16:16:06 +0000] 2789 MainThread agent INFO Flood daemon (re)start attempt [19/Nov/2018 16:16:06 +0000] 2789 MainThread agent INFO Created /opt/cloudera/parcels/.flood [19/Nov/2018 16:16:06 +0000] 2789 MainThread agent INFO Chowning /opt/cloudera/parcels/.flood to cloudera-scm (498) cloudera-scm (498) [19/Nov/2018 16:16:06 +0000] 2789 MainThread agent INFO Chmod'ing /opt/cloudera/parcels/.flood to 0755 [19/Nov/2018 16:16:06 +0000] 2789 MainThread agent INFO Triggering supervisord update. [19/Nov/2018 16:16:36 +0000] 2789 MainThread downloader ERROR Failed rack peer update: timed out [19/Nov/2018 16:16:36 +0000] 2789 MainThread agent INFO Active parcel list updated; recalculating component info. [19/Nov/2018 16:16:36 +0000] 2789 MainThread throttling_logger WARNING CMF_AGENT_JAVA_HOME environment variable host override will be deprecated in future. JAVA_HOME setting configured from CM server takes precedence over host agent override. Configure JAVA_HOME setting from CM server. [19/Nov/2018 16:16:36 +0000] 2789 MainThread throttling_logger INFO Identified java component java8 with full version JAVA_HOME=/opt/modules/jdk1.8.0_144 java version "1.8.0_144" Java(TM) SE Runtime Environment (build 1.8.0_144-b01) Java HotSpot(TM) 64-Bit Server VM (build 25.144-b01, mixed mode) for requested version . [19/Nov/2018 16:16:36 +0000] 2789 MainThread agent WARNING Long HB processing time: 30.6659779549 [19/Nov/2018 16:16:36 +0000] 2789 MainThread agent WARNING Delayed HB: 15s since last [19/Nov/2018 16:16:44 +0000] 2789 Monitor-HostMonitor throttling_logger ERROR Timeout with args ['ntpdc', '-np'] None [19/Nov/2018 16:16:44 +0000] 2789 Monitor-HostMonitor throttling_logger ERROR Failed to collect NTP metrics Traceback (most recent call last): File "/opt/cloudera-manager/cm-5.10.2/lib64/cmf/agent/build/env/lib/python2.6/site-packages/cmf-5.10.2-py2.6.egg/cmf/monitor/host/ntp_monitor.py", line 48, in collect self.collect_ntpd() File "/opt/cloudera-manager/cm-5.10.2/lib64/cmf/agent/build/env/lib/python2.6/site-packages/cmf-5.10.2-py2.6.egg/cmf/monitor/host/ntp_monitor.py", line 66, in collect_ntpd result, stdout, stderr = self._subprocess_with_timeout(args, self._timeout) File "/opt/cloudera-manager/cm-5.10.2/lib64/cmf/agent/build/env/lib/python2.6/site-packages/cmf-5.10.2-py2.6.egg/cmf/monitor/host/ntp_monitor.py", line 38, in _subprocess_with_timeout return subprocess_with_timeout(args, timeout) File "/opt/cloudera-manager/cm-5.10.2/lib64/cmf/agent/build/env/lib/python2.6/site-packages/cmf-5.10.2-py2.6.egg/cmf/subprocess_timeout.py", line 94, in subprocess_with_timeout raise Exception("timeout with args %s" % args) Exception: timeout with args ['ntpdc', '-np'] [19/Nov/2018 16:17:06 +0000] 2789 DnsResolutionMonitor throttling_logger INFO Using java location: '/opt/modules/jdk1.8.0_144/bin/java'. [19/Nov/2018 16:17:06 +0000] 2789 MainThread downloader ERROR Failed rack peer update: timed out [19/Nov/2018 16:17:06 +0000] 2789 MainThread agent WARNING Long HB processing time: 30.1082139015 [19/Nov/2018 16:17:06 +0000] 2789 MainThread agent WARNING Delayed HB: 15s since last [19/Nov/2018 16:17:36 +0000] 2789 MainThread downloader ERROR Failed rack peer update: timed out [19/Nov/2018 16:17:36 +0000] 2789 MainThread agent WARNING Long HB processing time: 30.1235852242 [19/Nov/2018 16:17:36 +0000] 2789 MainThread agent WARNING Delayed HB: 15s since last [19/Nov/2018 16:18:07 +0000] 2789 MainThread downloader ERROR Failed rack peer update: timed out [19/Nov/2018 16:18:07 +0000] 2789 MainThread agent WARNING Long HB processing time: 30.1040799618 [19/Nov/2018 16:18:07 +0000] 2789 MainThread agent WARNING Delayed HB: 15s since last [19/Nov/2018 16:18:37 +0000] 2789 MainThread downloader ERROR Failed rack peer update: timed out [19/Nov/2018 16:18:37 +0000] 2789 MainThread agent WARNING Long HB processing time: 30.1849529743 [19/Nov/2018 16:18:37 +0000] 2789 MainThread agent WARNING Delayed HB: 15s since last [19/Nov/2018 16:19:07 +0000] 2789 MainThread downloader ERROR Failed rack peer update: timed out [19/Nov/2018 16:19:07 +0000] 2789 MainThread agent WARNING Long HB processing time: 30.1211960316 [19/Nov/2018 16:19:07 +0000] 2789 MainThread agent WARNING Delayed HB: 15s since last [19/Nov/2018 16:19:37 +0000] 2789 MainThread downloader ERROR Failed rack peer update: timed out [19/Nov/2018 16:19:37 +0000] 2789 MainThread agent WARNING Long HB processing time: 30.1215620041 [19/Nov/2018 16:19:37 +0000] 2789 MainThread agent WARNING Delayed HB: 15s since last [19/Nov/2018 16:20:01 +0000] 2789 CP Server Thread-4 _cplogging INFO 192.168.164.35 - - [19/Nov/2018:16:20:01] "GET /heartbeat HTTP/1.1" 200 2 "" "NING/1.0" [19/Nov/2018 16:20:04 +0000] 2789 CP Server Thread-5 _cplogging INFO 192.168.164.35 - - [19/Nov/2018:16:20:04] "GET /heartbeat HTTP/1.1" 200 2 "" "NING/1.0" [19/Nov/2018 16:20:07 +0000] 2789 MainThread downloader ERROR Failed rack peer update: timed out [19/Nov/2018 16:20:07 +0000] 2789 MainThread agent WARNING Long HB processing time: 30.1212861538 [19/Nov/2018 16:20:07 +0000] 2789 MainThread agent WARNING Delayed HB: 15s since last [19/Nov/2018 16:20:37 +0000] 2789 MainThread downloader ERROR Failed rack peer update: timed out [19/Nov/2018 16:20:37 +0000] 2789 MainThread agent WARNING Long HB processing time: 30.1753029823 [19/Nov/2018 16:20:37 +0000] 2789 MainThread agent WARNING Delayed HB: 15s since last [19/Nov/2018 16:20:37 +0000] 2789 Thread-13 downloader INFO Fetching torrent: http://yingzhi01.com:7180/cmf/parcel/download/CDH-5.10.2-1.cdh5.10.2.p0.5-el6.parcel.torrent [19/Nov/2018 16:20:37 +0000] 2789 Thread-13 downloader INFO Starting download of: http://yingzhi01.com:7180/cmf/parcel/download/CDH-5.10.2-1.cdh5.10.2.p0.5-el6.parcel [19/Nov/2018 16:21:07 +0000] 2789 Thread-13 downloader ERROR Unexpected exception during download Traceback (most recent call last): File "/opt/cloudera-manager/cm-5.10.2/lib64/cmf/agent/build/env/lib/python2.6/site-packages/cmf-5.10.2-py2.6.egg/cmf/downloader.py", line 279, in download self.client.AddTorrent(torrent_url) File "/opt/cloudera-manager/cm-5.10.2/lib64/cmf/agent/build/env/lib/python2.6/site-packages/cmf-5.10.2-py2.6.egg/flood/util/cmd.py", line 159, in __call__ return self.fn.__get__(self.binding)(*args, **kwargs) File "/opt/cloudera-manager/cm-5.10.2/lib64/cmf/agent/build/env/lib/python2.6/site-packages/cmf-5.10.2-py2.6.egg/flood/util/rpc.py", line 68, in <lambda> return lambda *pargs, **kwargs: self._invoke(*pargs, **kwargs) File "/opt/cloudera-manager/cm-5.10.2/lib64/cmf/agent/build/env/lib/python2.6/site-packages/cmf-5.10.2-py2.6.egg/flood/util/rpc.py", line 77, in _invoke return rpcClient.requestor.request(self.schema.name, msg) File "/opt/cloudera-manager/cm-5.10.2/lib64/cmf/agent/build/env/lib/python2.6/site-packages/cmf-5.10.2-py2.6.egg/flood/util/rpc.py", line 129, in requestor return avro.ipc.Requestor(self.SCHEMA, self.transceiver) File "/opt/cloudera-manager/cm-5.10.2/lib64/cmf/agent/build/env/lib/python2.6/site-packages/cmf-5.10.2-py2.6.egg/flood/util/rpc.py", line 125, in transceiver return avro.ipc.HTTPTransceiver(self.server.host, self.server.port) File "/opt/cloudera-manager/cm-5.10.2/lib64/cmf/agent/build/env/lib/python2.6/site-packages/avro-1.6.3-py2.6.egg/avro/ipc.py", line 469, in __init__ self.conn.connect() File "/usr/lib64/python2.6/httplib.py", line 771, in connect self.timeout) File "/usr/lib64/python2.6/socket.py", line 567, in create_connection raise error, msg timeout: timed out [19/Nov/2018 16:21:07 +0000] 2789 Thread-13 downloader INFO Finished download [ url: http://yingzhi01.com:7180/cmf/parcel/download/CDH-5.10.2-1.cdh5.10.2.p0.5-el6.parcel, state: exception, total_bytes: 0, downloaded_bytes: 0, start_time: 2018-11-19 16:20:37, download_end_time: , end_time: 2018-11-19 16:21:07, code: 600, exception_msg: timed out, path: None ] [19/Nov/2018 16:21:07 +0000] 2789 MainThread downloader ERROR Failed rack peer update: timed out [19/Nov/2018 16:21:07 +0000] 2789 MainThread agent WARNING Long HB processing time: 30.1247620583 [19/Nov/2018 16:21:07 +0000] 2789 MainThread agent WARNING Delayed HB: 15s since last [19/Nov/2018 16:21:07 +0000] 2789 Thread-13 downloader INFO Fetching torrent: http://yingzhi01.com:7180/cmf/parcel/download/CDH-5.10.2-1.cdh5.10.2.p0.5-el6.parcel.torrent [19/Nov/2018 16:21:08 +0000] 2789 Thread-13 downloader INFO Starting download of: http://yingzhi01.com:7180/cmf/parcel/download/CDH-5.10.2-1.cdh5.10.2.p0.5-el6.parcel [19/Nov/2018 16:21:38 +0000] 2789 Thread-13 downloader ERROR Unexpected exception during download 然后就是不断重复超时错误求大神指点。。。
在cmd中安装fix_yahoo_finance(pip install)报错。
![图片说明](https://img-ask.csdn.net/upload/202002/19/1582097485_429834.png) 在用python导入yahoo数据的时候需要安装引入一个模块‘fix_yahoo_finance’,在cmd中安装fix_yahoo_finance(pip install)报错。
妖兽啦!oracle 10g 精简版 在cmd 报 ORA-12514: TNS: 监听程序。。。
pl/sql 登陆 ok 但到了cmd 普通用户如scott就会报这个错误。 ![图片说明](https://img-ask.csdn.net/upload/201601/29/1454047526_685836.png) 额, sys 用户 不报错。 ![图片说明](https://img-ask.csdn.net/upload/201601/29/1454047691_922769.png) 服务跑着呢。 ![图片说明](https://img-ask.csdn.net/upload/201601/29/1454047681_475138.png) 监听器文件没改, 改了没卵用。 有大侠遇过同样问题的么!!!!!
Android Jni Ndk配置问题
在mac系统上都可以正常跑,在window上运行不了 可以编译通过,AS和jdk和gradle的版本都一样,求解决 上错误日志 Error:FAILURE: Build failed with an exception. * What went wrong: Execution failed for task ':app:externalNativeBuildDebug'. > Build command failed. Error while executing process D:\androidStudio\SDK\ndk-bundle\ndk-build.cmd with arguments {NDK_PROJECT_PATH=null APP_BUILD_SCRIPT=D:\chatcat\vchat_android\app\src\main\Android.mk NDK_APPLICATION_MK=D:\chatcat\vchat_android\app\src\main\Application.mk APP_ABI=armeabi-v7a NDK_ALL_ABIS=armeabi-v7a NDK_DEBUG=1 APP_PLATFORM=android-16 NDK_OUT=D:/chatcat/vchat_android/app/build/intermediates/ndkBuild/debug/obj NDK_LIBS_OUT=D:\chatcat\vchat_android\app\build\intermediates\ndkBuild\debug\lib NDK_APPLICATION_MK:=src/main/Application.mk D:/chatcat/vchat_android/app/build/intermediates/ndkBuild/debug/obj/local/armeabi-v7a/libapm-plugin-video-preprocessing.so} [armeabi-v7a] "Compile++ thumb": "apm-plugin-video-preprocessing <= video_preprocessing_plugin_jni.cpp" process_begin: CreateProcess(NULL, D:/androidStudio/SDK/ndk-bundle/build//../toolchains/llvm/prebuilt/windows-x86_64/bin/clang++.exe -MMD -MP -MF D:/chatcat/vchat_android/app/build/intermediates/ndkBuild/debug/obj/local/armeabi-v7a/objs/apm-plugin-video-preprocessing/video_preprocessing_plugin_jni.o.d -gcc-toolchain D:/androidStudio/SDK/ndk-bundle/build//../toolchains/arm-linux-androideabi-4.9/prebuilt/windows-x86_64 -fpic -ffunction-sections -funwind-tables -fstack-protector-strong -Wno-invalid-command-line-argument -Wno-unused-command-line-argument -no-canonical-prefixes -fno-integrated-as -g -target armv7-none-linux-androideabi16 -march=armv7-a -mfloat-abi=softfp -mfpu=vfpv3-d16 -fno-exceptions -fno-rtti -mthumb -Os -DNDEBUG -ID:/androidStudio/SDK/ndk-bundle/build//../sources/cxx-stl/stlport/stlport -ID:/androidStudio/SDK/ndk-bundle/build//../sources/cxx-stl//gabi++/include -ID:/chatcat/vchat_android/app/src/main -std=c++11 -DANDROID -D__ANDROID_API__=16 -Wa,--noexecstack -Wformat -Werror=format-security -frtti --sysroot D:/androidStudio/SDK/ndk-bundle/build//../sysroot -isystem D:/androidStudio/SDK/ndk-bundle/build
命令行运行pytest提示 OSError: [WinError 87] 参数错误。
前置操作:Python环境搭建完成,cmd安装pip install pytest 操作命令:测试脚本根目录cmd执行pytest 遇到的问题:OSError: [WinError 87] 参数错误。 详细错误图: ![图片说明](https://img-ask.csdn.net/upload/202002/19/1582105882_144273.png)
IP已经配置,但是cmd里ipconfig /all仍然看不到
已经设置了电脑IP如下 ![图片说明](https://img-ask.csdn.net/upload/202001/16/1579178370_488928.png) 但为什么在cmd里ipconfig /all还是看不到本地连接的IP? ![图片说明](https://img-ask.csdn.net/upload/202001/16/1579186779_47720.png)
安装oracle11g grid 执行root.sh时一直卡在Adding Clusterware entries to inittab
安装oracle11g(11204)grid standalone,在执行root.sh的时候卡在Adding Clusterware entries to inittab一直不动,/tmp/.oracle下面没有文件,查看/oracle/11204/grid_1/home/cfgtoollogs/crsconfig/roothas.log ...... 2019-08-21 10:41:28: Executing /oracle/11204/grid_1/home/bin/crsctl create scr grid 2019-08-21 10:41:28: Executing cmd: /oracle/11204/grid_1/home/bin/crsctl create scr grid 2019-08-21 10:41:28: Registering ohasd 2019-08-21 10:41:28: Executing cmd: /bin/rpm -q sles-release 2019-08-21 10:41:28: Command output: > package sles-release is not installed >End Command output 2019-08-21 10:41:28: init file = /oracle/11204/grid_1/home/crs/init/init.ohasd 2019-08-21 10:41:28: Copying file /oracle/11204/grid_1/home/crs/init/init.ohasd to /etc/init.d directory 2019-08-21 10:41:28: Setting init.ohasd permission in /etc/init.d directory 2019-08-21 10:41:28: init file = /oracle/11204/grid_1/home/crs/init/ohasd 2019-08-21 10:41:28: Copying file /oracle/11204/grid_1/home/crs/init/ohasd to /etc/init.d directory 2019-08-21 10:41:28: Setting ohasd permission in /etc/init.d directory 2019-08-21 10:41:28: Executing cmd: /bin/rpm -q sles-release 2019-08-21 10:41:28: Command output: > package sles-release is not installed >End Command output 2019-08-21 10:41:28: Removing "/etc/rc.d/rc3.d/S96ohasd" 2019-08-21 10:41:28: Removing file /etc/rc.d/rc3.d/S96ohasd 2019-08-21 10:41:28: Successfully removed file: /etc/rc.d/rc3.d/S96ohasd 2019-08-21 10:41:28: Creating a link "/etc/rc.d/rc3.d/S96ohasd" pointing to /etc/init.d/ohasd 2019-08-21 10:41:28: Removing "/etc/rc.d/rc5.d/S96ohasd" 2019-08-21 10:41:28: Removing file /etc/rc.d/rc5.d/S96ohasd 2019-08-21 10:41:28: Successfully removed file: /etc/rc.d/rc5.d/S96ohasd 2019-08-21 10:41:28: Creating a link "/etc/rc.d/rc5.d/S96ohasd" pointing to /etc/init.d/ohasd 2019-08-21 10:41:28: Removing "/etc/rc.d/rc0.d/K15ohasd" 2019-08-21 10:41:28: Removing file /etc/rc.d/rc0.d/K15ohasd 2019-08-21 10:41:28: Successfully removed file: /etc/rc.d/rc0.d/K15ohasd 2019-08-21 10:41:28: Creating a link "/etc/rc.d/rc0.d/K15ohasd" pointing to /etc/init.d/ohasd 2019-08-21 10:41:28: Removing "/etc/rc.d/rc1.d/K15ohasd" 2019-08-21 10:41:28: Removing file /etc/rc.d/rc1.d/K15ohasd 2019-08-21 10:41:28: Successfully removed file: /etc/rc.d/rc1.d/K15ohasd 2019-08-21 10:41:28: Creating a link "/etc/rc.d/rc1.d/K15ohasd" pointing to /etc/init.d/ohasd 2019-08-21 10:41:28: Removing "/etc/rc.d/rc2.d/K15ohasd" 2019-08-21 10:41:28: Removing file /etc/rc.d/rc2.d/K15ohasd 2019-08-21 10:41:28: Successfully removed file: /etc/rc.d/rc2.d/K15ohasd 2019-08-21 10:41:28: Creating a link "/etc/rc.d/rc2.d/K15ohasd" pointing to /etc/init.d/ohasd 2019-08-21 10:41:28: Removing "/etc/rc.d/rc4.d/K15ohasd" 2019-08-21 10:41:28: Removing file /etc/rc.d/rc4.d/K15ohasd 2019-08-21 10:41:28: Successfully removed file: /etc/rc.d/rc4.d/K15ohasd 2019-08-21 10:41:28: Creating a link "/etc/rc.d/rc4.d/K15ohasd" pointing to /etc/init.d/ohasd 2019-08-21 10:41:28: Removing "/etc/rc.d/rc6.d/K15ohasd" 2019-08-21 10:41:28: Removing file /etc/rc.d/rc6.d/K15ohasd 2019-08-21 10:41:28: Successfully removed file: /etc/rc.d/rc6.d/K15ohasd 2019-08-21 10:41:28: Creating a link "/etc/rc.d/rc6.d/K15ohasd" pointing to /etc/init.d/ohasd 2019-08-21 10:41:28: The file ohasd has been successfully linked to the RC directories 2019-08-21 10:41:28: Executing cmd: /bin/rpm -q sles-release 2019-08-21 10:41:28: Command output: > package sles-release is not installed >End Command output SS S_OHASD -state SUCCESS ' 2019-08-21 10:41:28: Removing file /tmp/filea21cdK 2019-08-21 10:41:28: Successfully removed file: /tmp/filea21cdK 2019-08-21 10:41:28: /bin/su successfully executed 2019-08-21 10:41:28: Succeeded in writing the checkpoint:'ROOTCRS_OHASD' with status:SUCCESS 2019-08-21 10:41:28: CkptFile: /oracle/11204/grid_1/base/Clusterware/ckptGridHA_edippsdr.xml 2019-08-21 10:41:28: Sync the checkpoint file '/oracle/11204/grid_1/base/Clusterware/ckptGridHA_edippsdr.xml' 2019-08-21 10:41:28: Sync '/oracle/11204/grid_1/base/Clusterware/ckptGridHA_edippsdr.xml' to the physical disk 2019-08-21 10:41:28: Starting ohasd 2019-08-21 10:41:28: Executing cmd: /bin/rpm -qf /sbin/init 2019-08-21 10:41:28: Command output: > SysVinit-2.86-15.el5 >End Command output 2019-08-21 10:41:28: itab entries=cssd|evmd|crsd|ohasd 2019-08-21 10:41:28: Executing /sbin/init q 2019-08-21 10:41:28: Executing cmd: /sbin/init q 2019-08-21 10:41:33: Created backup /etc/inittab.no_crs 2019-08-21 10:41:33: Appending to /etc/inittab.tmp: 2019-08-21 10:41:33: h1:35:respawn:/etc/init.d/init.ohasd run >/dev/null 2>&1 </dev/null 2019-08-21 10:41:33: Done updating /etc/inittab.tmp 2019-08-21 10:41:33: Saved /etc/inittab.crs 2019-08-21 10:41:33: Installed new /etc/inittab 2019-08-21 10:41:33: Executing /sbin/init q 2019-08-21 10:41:33: Executing cmd: /sbin/init q 2019-08-21 10:41:33: Executing cmd: /oracle/11204/grid_1/home/bin/crsctl start has 2019-08-21 10:41:34: Command output: > CRS-4640: Oracle High Availability Services is already active > CRS-4000: Command Start failed, or completed with errors. >End Command output 2019-08-21 10:41:34: Executing /etc/init.d/ohasd install 2019-08-21 10:41:34: Executing cmd: /etc/init.d/ohasd install 2019-08-21 10:41:34: ohasd is already active 2019-08-21 10:41:34: Started service 'ohasd' 2019-08-21 10:41:34: Checking ohasd 2019-08-21 10:41:34: Executing cmd: /oracle/11204/grid_1/home/bin/crsctl check has 因为本台服务器曾经是oracle10gRac的其中一个节点,改了一些参数,不知道是不是什么参数没设置好还是咋回事执行了超多次都卡在这....求大佬帮忙看看
编译ndk-build.cmd生成.so文件中出现这样的问题,不知道哪的原因。
E:\project\CHENWEN\proj.android\jni>ndk-build [armeabi] Compile++ thumb: cocos2dcpp_shared <= main.cpp In file included from D:/android-ndk-r10/sources/cxx-stl/gnu-libstdc++/4.6/inclu de/thread:35:0, from E:/project/CHENWEN/proj.android//jni/../../cocos2d/cocos/3 d/../base/CCConsole.h:42, from E:/project/CHENWEN/proj.android//jni/../../cocos2d/cocos/3 d/../base/ccMacros.h:35, from E:/project/CHENWEN/proj.android//jni/../../cocos2d/cocos/3 d/../base/CCRefPtr.h:30, from E:/project/CHENWEN/proj.android//jni/../../cocos2d/cocos/3 d/../cocos2d.h:42, from E:/project/CHENWEN/proj.android//jni/../../Classes/AppDele gate.h:4, from E:/project/CHENWEN/proj.android//jni/hellocpp/main.cpp:1: D:/android-ndk-r10/sources/cxx-stl/gnu-libstdc++/4.6/include/bits/c++0x_warning. h:32:2: error: #error This file requires compiler and library support for the IS O C++ 2011 standard. This support is currently experimental, and must be enabled with the -std=c++11 or -std=gnu++11 compiler options. In file included from E:/project/CHENWEN/proj.android//jni/../../cocos2d/cocos/3 d/../platform/CCGL.h:36:0, from E:/project/CHENWEN/proj.android//jni/../../cocos2d/cocos/3 d/../base/ccTypes.h:36, from E:/project/CHENWEN/proj.android//jni/../../cocos2d/cocos/3 d/../cocos2d.h:51, from E:/project/CHENWEN/proj.android//jni/../../Classes/AppDele gate.h:4, from E:/project/CHENWEN/proj.android//jni/hellocpp/main.cpp:1: E:/project/CHENWEN/proj.android//jni/../../cocos2d/cocos/3d/../platform/android/ CCGL-android.h:44:31: fatal error: GLES2/gl2platform.h: No such file or director y compilation terminated. make.exe: *** [E:/project/CHENWEN/proj.android//obj/local/armeabi/objs/cocos2dcp p_shared/hellocpp/main.o] Error 1
求教:vs2017 Cordova打包报错 Could not resolve com.android.to
![图片说明](https://img-ask.csdn.net/upload/201907/14/1563068812_838786.png) **具体错误内容如下:** 1>MSBUILD : cordova-build error : * What went wrong: 1>MSBUILD : cordova-build error : A problem occurred configuring root project 'android'. 1>MSBUILD : cordova-build error : > Could not resolve all dependencies for configuration ':classpath'. 1>MSBUILD : cordova-build error : > Could not resolve com.android.tools.build:gradle:2.1.0. 1>MSBUILD : cordova-build error : Required by: 1>MSBUILD : cordova-build error : :android:unspecified 1>MSBUILD : cordova-build error : > Could not resolve com.android.tools.build:gradle:2.1.0. 1>MSBUILD : cordova-build error : > Could not get resource 'https://repo1.maven.org/maven2/com/android/tools/build/gradle/2.1.0/gradle-2.1.0.pom'. 1>MSBUILD : cordova-build error : > Could not GET 'https://repo1.maven.org/maven2/com/android/tools/build/gradle/2.1.0/gradle-2.1.0.pom'. 1>MSBUILD : cordova-build error : > Received fatal alert: protocol_version 1>MSBUILD : cordova-build error : > Could not resolve com.android.tools.build:gradle:2.1.0. 1>MSBUILD : cordova-build error : > Could not get resource 'https://jcenter.bintray.com/com/android/tools/build/gradle/2.1.0/gradle-2.1.0.pom'. 1>MSBUILD : cordova-build error : > Could not GET 'https://jcenter.bintray.com/com/android/tools/build/gradle/2.1.0/gradle-2.1.0.pom'. 1>MSBUILD : cordova-build error : > Remote host closed connection during handshake 1>MSBUILD : cordova-build error : * Try: 1>MSBUILD : cordova-build error : Run with --stacktrace option to get the stack trace. Run with --info or --debug option to get more log output. Command finished with error code 1: cmd /s /c ""D:\VSCODE\Long.Learun.Framework.7.0.2\Code\Learun.Framework V7.01 pro\Learun.Application.Mobile\platforms\android\gradlew.bat" cdvBuildDebug -b "D:\VSCODE\Long.Learun.Framework.7.0.2\Code\Learun.Framework V7.01 pro\Learun.Application.Mobile\platforms\android\build.gradle" -Dorg.gradle.daemon=true -Pandroid.useDeprecatedNdk=true" 1>MSBUILD : cordova-build error : Error: cmd: Command failed with exit code 1 Error output:
ava.sql.SQLException: ORA-01017: 用户名/口令无效; 登录被拒绝
ava.sql.SQLException: ORA-01017: 用户名/口令无效; 登录被拒绝 cmd输入sqlplus,是可以登陆的,但是在eclipse,jsp使用jdbc连接oracle数据库时,就报错了,同样的用户名和密码.....不知道原因出在哪里。 ![图片说明](https://img-ask.csdn.net/upload/201709/13/1505313805_346376.jpg)![图片说明](https://img-ask.csdn.net/upload/201709/13/1505313814_671295.jpg)
cmd下的mysql 不能显示中文
在cmd下查数据,不能显示中文,没有乱码,直接是空的, 这是查询出来的编码 右边是我的my.ini设置 请问哪里不对![图片说明](https://img-ask.csdn.net/upload/202001/16/1579110287_274528.png)
终于明白阿里百度这样的大公司,为什么面试经常拿ThreadLocal考验求职者了
点击上面↑「爱开发」关注我们每晚10点,捕获技术思考和创业资源洞察什么是ThreadLocalThreadLocal是一个本地线程副本变量工具类,各个线程都拥有一份线程私有的数
Java学习的正确打开方式
在博主认为,对于入门级学习java的最佳学习方法莫过于视频+博客+书籍+总结,前三者博主将淋漓尽致地挥毫于这篇博客文章中,至于总结在于个人,实际上越到后面你会发现学习的最好方式就是阅读参考官方文档其次就是国内的书籍,博客次之,这又是一个层次了,这里暂时不提后面再谈。博主将为各位入门java保驾护航,各位只管冲鸭!!!上天是公平的,只要不辜负时间,时间自然不会辜负你。 何谓学习?博主所理解的学习,它是一个过程,是一个不断累积、不断沉淀、不断总结、善于传达自己的个人见解以及乐于分享的过程。
程序员必须掌握的核心算法有哪些?
由于我之前一直强调数据结构以及算法学习的重要性,所以就有一些读者经常问我,数据结构与算法应该要学习到哪个程度呢?,说实话,这个问题我不知道要怎么回答你,主要取决于你想学习到哪些程度,不过针对这个问题,我稍微总结一下我学过的算法知识点,以及我觉得值得学习的算法。这些算法与数据结构的学习大多数是零散的,并没有一本把他们全部覆盖的书籍。下面是我觉得值得学习的一些算法以及数据结构,当然,我也会整理一些看过
大学四年自学走来,这些私藏的实用工具/学习网站我贡献出来了
大学四年,看课本是不可能一直看课本的了,对于学习,特别是自学,善于搜索网上的一些资源来辅助,还是非常有必要的,下面我就把这几年私藏的各种资源,网站贡献出来给你们。主要有:电子书搜索、实用工具、在线视频学习网站、非视频学习网站、软件下载、面试/求职必备网站。 注意:文中提到的所有资源,文末我都给你整理好了,你们只管拿去,如果觉得不错,转发、分享就是最大的支持了。 一、电子书搜索 对于大部分程序员...
《奇巧淫技》系列-python!!每天早上八点自动发送天气预报邮件到QQ邮箱
此博客仅为我业余记录文章所用,发布到此,仅供网友阅读参考,如有侵权,请通知我,我会删掉。 补充 有不少读者留言说本文章没有用,因为天气预报直接打开手机就可以收到了,为何要多此一举发送到邮箱呢!!!那我在这里只能说:因为你没用,所以你没用!!! 这里主要介绍的是思路,不是天气预报!不是天气预报!!不是天气预报!!!天气预报只是用于举例。请各位不要再刚了!!! 下面是我会用到的两个场景: 每日下
Python 植物大战僵尸代码实现(2):植物卡片选择和种植
这篇文章要介绍的是: - 上方植物卡片栏的实现。 - 点击植物卡片,鼠标切换为植物图片。 - 鼠标移动时,判断当前在哪个方格中,并显示半透明的植物作为提示。
死磕YOLO系列,YOLOv1 的大脑、躯干和手脚
YOLO 是我非常喜欢的目标检测算法,堪称工业级的目标检测,能够达到实时的要求,它帮我解决了许多实际问题。 这就是 YOLO 的目标检测效果。它定位了图像中物体的位置,当然,也能预测物体的类别。 之前我有写博文介绍过它,但是每次重新读它的论文,我都有新的收获,为此我准备写一个系列的文章来详尽分析它。这是第一篇,从它的起始 YOLOv1 讲起。 YOLOv1 的论文地址:https://www.c
知乎高赞:中国有什么拿得出手的开源软件产品?(整理自本人原创回答)
知乎高赞:中国有什么拿得出手的开源软件产品? 在知乎上,有个问题问“中国有什么拿得出手的开源软件产品(在 GitHub 等社区受欢迎度较好的)?” 事实上,还不少呢~ 本人于2019.7.6进行了较为全面的 回答 - Bravo Yeung,获得该问题下回答中得最高赞(236赞和1枚专业勋章),对这些受欢迎的 Github 开源项目分类整理如下: 分布式计算、云平台相关工具类 1.SkyWalk
记一次腾讯面试:进程之间究竟有哪些通信方式?如何通信? ---- 告别死记硬背
有一次面试的时候,被问到进程之间有哪些通信方式,不过由于之前没深入思考且整理过,说的并不好。想必大家也都知道进程有哪些通信方式,可是我猜很多人都是靠着”背“来记忆的,所以今天的这篇文章,讲给大家详细着讲解他们是如何通信的,让大家尽量能够理解他们之间的区别、优缺点等,这样的话,以后面试官让你举例子,你也能够顺手拈来。 1、管道 我们来看一条 Linux 的语句 netstat -tulnp | gr...
20行Python代码爬取王者荣耀全英雄皮肤
引言 王者荣耀大家都玩过吧,没玩过的也应该听说过,作为时下最火的手机MOBA游戏,咳咳,好像跑题了。我们今天的重点是爬取王者荣耀所有英雄的所有皮肤,而且仅仅使用20行Python代码即可完成。 准备工作 爬取皮肤本身并不难,难点在于分析,我们首先得得到皮肤图片的url地址,话不多说,我们马上来到王者荣耀的官网: 我们点击英雄资料,然后随意地选择一位英雄,接着F12打开调试台,找到英雄原皮肤的图片
网络(8)-HTTP、Socket、TCP、UDP的区别和联系
TCP/IP协议是传输层协议,主要解决数据如何在网络中传输,而HTTP是应用层协议,主要解决如何包装数据。 一、TCP与UDP的不同 1. 是否需要建立连接。 UDP在传送数据之前不需要先建立连接;TCP则提供面向连接的服务; 2. 是否需要给出确认 对方的传输层在收到UDP报文后,不需要给出任何确认,而 TCP需要给出确认报文,要提供可靠的、面向连接的传输服务。 3.虽然UDP不提供可靠交...
简明易理解的@SpringBootApplication注解源码解析(包含面试提问)
欢迎关注文章系列 ,关注我 《提升能力,涨薪可待》 《面试知识,工作可待》 《实战演练,拒绝996》 欢迎关注我博客,原创技术文章第一时间推出 也欢迎关注公 众 号【Ccww笔记】,同时推出 如果此文对你有帮助、喜欢的话,那就点个赞呗,点个关注呗! 《提升能力,涨薪可待篇》- @SpringBootApplication注解源码解析 一、@SpringBootApplication 的作用是什
防劝退!数据结构和算法难理解?可视化动画带你轻松透彻理解!
大家好,我是 Rocky0429,一个连数据结构和算法都不会的蒟蒻… 学过数据结构和算法的都知道这玩意儿不好学,没学过的经常听到这样的说法还没学就觉得难,其实难吗?真难! 难在哪呢?当年我还是个小蒟蒻,初学数据结构和算法的时候,在忍着枯燥看完定义原理,之后想实现的时候,觉得它们的过程真的是七拐八绕,及其难受。 在简单的链表、栈和队列这些我还能靠着在草稿上写写画画理解过程,但是到了数论、图...
西游记团队中如果需要裁掉一个人,会先裁掉谁?
2019年互联网寒冬,大批企业开始裁员,下图是网上流传的一张截图: 裁员不可避免,那如何才能做到不管大环境如何变化,自身不受影响呢? 我们先来看一个有意思的故事,如果西游记取经团队需要裁员一名,会裁掉谁呢,为什么? 西游记团队组成: 1.唐僧 作为团队teamleader,有很坚韧的品性和极高的原则性,不达目的不罢休,遇到任何问题,都没有退缩过,又很得上司支持和赏识(直接得到唐太宗的任命,既给
开挂的人生!那些当选院士,又是ACM/IEEE 双料Fellow的华人学者们
昨日,2019年两院院士正式官宣,一时间抢占了各大媒体头条。 朋友圈也是一片沸腾,奔走相告,赶脚比自己中了大奖还嗨皮! 谁叫咱家导师就是这么厉害呢!!! 而就在最近,新一年度的IEEE/ACM Fellow也将正式公布。 作为学术届的顶级荣誉,不自然地就会将院士与Fellow作比较,到底哪个含金量更高呢? 学术君认为,同样是专业机构对学者的认可,考量标准不一,自然不能一概而论。 但...
聊聊C语言和指针的本质
坐着绿皮车上海到杭州,24块钱,很宽敞,在火车上非正式地聊几句。 很多编程语言都以 “没有指针” 作为自己的优势来宣传,然而,对于C语言,指针却是与生俱来的。 那么,什么是指针,为什么大家都想避开指针。 很简单, 指针就是地址,当一个地址作为一个变量存在时,它就被叫做指针,该变量的类型,自然就是指针类型。 指针的作用就是,给出一个指针,取出该指针指向地址处的值。为了理解本质,我们从计算机模型说起...
Python语言高频重点汇总
Python语言高频重点汇总 GitHub面试宝典仓库——点这里跳转 文章目录Python语言高频重点汇总**GitHub面试宝典仓库——点这里跳转**1. 函数-传参2. 元类3. @staticmethod和@classmethod两个装饰器4. 类属性和实例属性5. Python的自省6. 列表、集合、字典推导式7. Python中单下划线和双下划线8. 格式化字符串中的%和format9.
究竟你适不适合买Mac?
我清晰的记得,刚买的macbook pro回到家,开机后第一件事情,就是上了淘宝网,花了500元钱,找了一个上门维修电脑的师傅,上门给我装了一个windows系统。。。。。。 表砍我。。。 当时买mac的初衷,只是想要个固态硬盘的笔记本,用来运行一些复杂的扑克软件。而看了当时所有的SSD笔记本后,最终决定,还是买个好(xiong)看(da)的。 已经有好几个朋友问我mba怎么样了,所以今天尽量客观
代码详解:如何用Python快速制作美观、炫酷且有深度的图表
全文共12231字,预计学习时长35分钟生活阶梯(幸福指数)与人均GDP(金钱)正相关的正则图本文将探讨三种用Python可视化数据的不同方法。以可视化《2019年世界幸福报告》的数据为例,本文用Gapminder和Wikipedia的信息丰富了《世界幸福报告》数据,以探索新的数据关系和可视化方法。《世界幸福报告》试图回答世界范围内影响幸福的因素。报告根据对“坎特里尔阶梯问题”的回答来确定幸...
程序员一般通过什么途径接私活?
二哥,你好,我想知道一般程序猿都如何接私活,我也想接,能告诉我一些方法吗? 上面是一个读者“烦不烦”问我的一个问题。其实不止是“烦不烦”,还有很多读者问过我类似这样的问题。 我接的私活不算多,挣到的钱也没有多少,加起来不到 20W。说实话,这个数目说出来我是有点心虚的,毕竟太少了,大家轻喷。但我想,恰好配得上“一般程序员”这个称号啊。毕竟苍蝇再小也是肉,我也算是有经验的人了。 唾弃接私活、做外
(经验分享)作为一名普通本科计算机专业学生,我大学四年到底走了多少弯路
今年正式步入了大四,离毕业也只剩半年多的时间,回想一下大学四年,感觉自己走了不少弯路,今天就来分享一下自己大学的学习经历,也希望其他人能不要走我走错的路。 (一)初进校园 刚进入大学的时候自己完全就相信了高中老师的话:“进入大学你们就轻松了”。因此在大一的时候自己学习的激情早就被抛地一干二净,每天不是在寝室里玩游戏就是出门游玩,不过好在自己大学时买的第一台笔记本性能并不是很好,也没让我彻底沉...
如何写一篇技术博客,谈谈我的看法
前言 只有光头才能变强。 文本已收录至我的GitHub精选文章,欢迎Star:https://github.com/ZhongFuCheng3y/3y 我一直推崇学技术可以写技术博客去沉淀自己的知识,因为知识点实在是太多太多了,通过自己的博客可以帮助自己快速回顾自己学过的东西。 我最开始的时候也是只记笔记,认为自己能看得懂就好。但如果想验证自己是不是懂了,可以写成技术博客。在写技术博客的...
字节跳动面试官这样问消息队列:分布式事务、重复消费、顺序消费,我整理了一下
你知道的越多,你不知道的越多 点赞再看,养成习惯 GitHub上已经开源 https://github.com/JavaFamily 有一线大厂面试点脑图、个人联系方式和人才交流群,欢迎Star和完善 前言 消息队列在互联网技术存储方面使用如此广泛,几乎所有的后端技术面试官都要在消息队列的使用和原理方面对小伙伴们进行360°的刁难。 作为一个在互联网公司面一次拿一次Offer的面霸...
面试还搞不懂redis,快看看这40道面试题(含答案和思维导图)
Redis 面试题 1、什么是 Redis?. 2、Redis 的数据类型? 3、使用 Redis 有哪些好处? 4、Redis 相比 Memcached 有哪些优势? 5、Memcache 与 Redis 的区别都有哪些? 6、Redis 是单进程单线程的? 7、一个字符串类型的值能存储最大容量是多少? 8、Redis 的持久化机制是什么?各自的优缺点? 9、Redis 常见性...
大学四年自学走来,这些珍藏的「实用工具/学习网站」我全贡献出来了
知乎高赞:文中列举了互联网一线大厂程序员都在用的工具集合,涉及面非常广,小白和老手都可以进来看看,或许有新收获。
互联网公司的裁员,能玩出多少种花样?
裁员,也是一门学问,可谓博大精深!以下,是互联网公司的裁员的多种方法:-正文开始-135岁+不予续签的理由:千禧一代网感更强。95后不予通过试用期的理由:已婚已育员工更有责任心。2通知接下来要过苦日子,让一部分不肯同甘共苦的员工自己走人,以“兄弟”和“非兄弟”来区别员工。3强制996。员工如果平衡不了工作和家庭,可在离婚或离职里二选一。4不布置任何工作,但下班前必须提交千字工作日报。5不给活干+...
【设计模式】单例模式的八种写法分析
网上泛滥流传单例模式的写法种类,有说7种的,也有说6种的,当然也不排除说5种的,他们说的有错吗?其实没有对与错,刨根问底,写法终究是写法,其本质精髓大体一致!因此完全没必要去追究写法的多少,有这个时间还不如跟着宜春去网吧偷耳机、去田里抓青蛙得了,一天天的....
《面试宝典》:检验是否为合格的初中级程序员的面试知识点,你都知道了吗?查漏补缺
欢迎关注文章系列,一起学习 《提升能力,涨薪可待篇》 《面试知识,工作可待篇》 《实战演练,拒绝996篇》 也欢迎关注公 众 号【Ccww笔记】,原创技术文章第一时间推出 如果此文对你有帮助、喜欢的话,那就点个赞呗,点个关注呗! 《面试知识,工作可待篇》-Java笔试面试基础知识大全 前言 是不是感觉找工作面试是那么难呢? 在找工作面试应在学习的基础进行总结面试知识点,工作也指日可待,欢...
关于研发效能提升的思考
研发效能提升是最近比较热门的一个话题,本人根据这几年的工作心得,做了一些思考总结,由于个人深度有限,暂且抛转引入。 三要素 任何生产力的提升都离不开这三个因素:人、流程和工具,少了其中任何一个因素都无法实现。 人,即思想,也就是古人说的“道”,道不同不相为谋,是制高点,也是高层建筑的基石。 流程,即方法,也是古人说的“法”。研发效能的提升,也就是要提高投入产出比,既要增加产出,也要减...
微博推荐算法简述
在介绍微博推荐算法之前,我们先聊一聊推荐系统和推荐算法。有这样一些问题:推荐系统适用哪些场景?用来解决什么问题、具有怎样的价值?效果如何衡量? 推荐系统诞生很早,但真正被大家所重视,缘起于以”facebook”为代表的社会化网络的兴起和以“淘宝“为代表的电商的繁荣,”选择“的时代已经来临,信息和物品的极大丰富,让用户如浩瀚宇宙中的小点,无所适从。推荐系统迎来爆发的机会,变得离用户更近: 快...
相关热词 c#开发的dll注册 c#的反射 c# grid绑定数据源 c#多线程怎么循环 c# 鼠标左键 c# char占位符 c# 日期比较 c#16进制转换为int c#用递归求顺序表中最大 c#小型erp源代码
立即提问

相似问题