python时,遇到pip安装tesserocr报错问题

如上所描述,在https://github.com/simonflueckiger/tesserocr-windows____build/releases 下载了对应的
图片说明
tesserocr-2.2.2-cp36-cp36m-win_amd64.whl
_下载的时候虽然速度慢,但是能下载下来。但是等到安装的时候,一直报错,错误信息蛮多的,最后一条信息是file is not a zip file,
图片说明
图片说明
哪位大神有破解之道呀,网上很多教程都按着做了,还是不成功,本人系统win8.1,安装的 tesseract-ocr-setup-3.05.01.exe是这个。

1个回答

可能是版本问题,tesserorc安装一个低一点的版本试试

Csdn user default icon
上传中...
上传图片
插入图片
抄袭、复制答案,以达到刷声望分或其他目的的行为,在CSDN问答是严格禁止的,一经发现立刻封号。是时候展现真正的技术了!
其他相关推荐
python使用pip安装multiprocess报错
Windows8下使用pip -install multiprocessing 安装包时报了这个错误,我用的是python3.6,为什么会安装出python2中的包?
ubuntu18.04 python3.6 pip安装mysqlclient报错
ubuntu18.04 python3.6 pip安装mysqlclient报错 求大佬解答 ``` Building wheels for collected packages: mysqlclient Running setup.py bdist_wheel for mysqlclient ... error Complete output from command /usr/bin/python3 -u -c "import setuptools, tokenize;__file__='/tmp/pip-build-njxuuzpo/mysqlclient/setup.py';f=getattr(tokenize, 'open', open)(__file__);code=f.read().replace('\r\n', '\n');f.close();exec(compile(code, __file__, 'exec'))" bdist_wheel -d /tmp/tmpzs54ny_2pip-wheel- --python-tag cp36: running bdist_wheel running build running build_py creating build creating build/lib.linux-x86_64-3.6 creating build/lib.linux-x86_64-3.6/MySQLdb copying MySQLdb/__init__.py -> build/lib.linux-x86_64-3.6/MySQLdb copying MySQLdb/_exceptions.py -> build/lib.linux-x86_64-3.6/MySQLdb copying MySQLdb/compat.py -> build/lib.linux-x86_64-3.6/MySQLdb copying MySQLdb/connections.py -> build/lib.linux-x86_64-3.6/MySQLdb copying MySQLdb/converters.py -> build/lib.linux-x86_64-3.6/MySQLdb copying MySQLdb/cursors.py -> build/lib.linux-x86_64-3.6/MySQLdb copying MySQLdb/release.py -> build/lib.linux-x86_64-3.6/MySQLdb copying MySQLdb/times.py -> build/lib.linux-x86_64-3.6/MySQLdb creating build/lib.linux-x86_64-3.6/MySQLdb/constants copying MySQLdb/constants/__init__.py -> build/lib.linux-x86_64-3.6/MySQLdb/constants copying MySQLdb/constants/CLIENT.py -> build/lib.linux-x86_64-3.6/MySQLdb/constants copying MySQLdb/constants/CR.py -> build/lib.linux-x86_64-3.6/MySQLdb/constants copying MySQLdb/constants/ER.py -> build/lib.linux-x86_64-3.6/MySQLdb/constants copying MySQLdb/constants/FIELD_TYPE.py -> build/lib.linux-x86_64-3.6/MySQLdb/constants copying MySQLdb/constants/FLAG.py -> build/lib.linux-x86_64-3.6/MySQLdb/constants running build_ext building 'MySQLdb._mysql' extension creating build/temp.linux-x86_64-3.6 creating build/temp.linux-x86_64-3.6/MySQLdb x86_64-linux-gnu-gcc -pthread -DNDEBUG -g -fwrapv -O2 -Wall -g -fstack-protector-strong -Wformat -Werror=format-security -Wdate-time -D_FORTIFY_SOURCE=2 -fPIC -Dversion_info=(1,4,5,'final',0) -D__version__=1.4.5 -I/usr/include/mysql -I/usr/include/python3.6m -c MySQLdb/_mysql.c -o build/temp.linux-x86_64-3.6/MySQLdb/_mysql.o x86_64-linux-gnu-gcc -pthread -shared -Wl,-O1 -Wl,-Bsymbolic-functions -Wl,-Bsymbolic-functions -Wl,-z,relro -Wl,-Bsymbolic-functions -Wl,-z,relro -g -fstack-protector-strong -Wformat -Werror=format-security -Wdate-time -D_FORTIFY_SOURCE=2 build/temp.linux-x86_64-3.6/MySQLdb/_mysql.o -lmysqlclient -lpthread -lz -lm -lrt -latomic -lssl -lcrypto -ldl -o build/lib.linux-x86_64-3.6/MySQLdb/_mysql.cpython-36m-x86_64-linux-gnu.so /usr/bin/ld: cannot find -lssl /usr/bin/ld: cannot find -lcrypto collect2: error: ld returned 1 exit status error: command 'x86_64-linux-gnu-gcc' failed with exit status 1 ---------------------------------------- Failed building wheel for mysqlclient Running setup.py clean for mysqlclient Failed to build mysqlclient Installing collected packages: mysqlclient Running setup.py install for mysqlclient ... error Complete output from command /usr/bin/python3 -u -c "import setuptools, tokenize;__file__='/tmp/pip-build-njxuuzpo/mysqlclient/setup.py';f=getattr(tokenize, 'open', open)(__file__);code=f.read().replace('\r\n', '\n');f.close();exec(compile(code, __file__, 'exec'))" install --record /tmp/pip-ldoqhl56-record/install-record.txt --single-version-externally-managed --compile --user --prefix=: running install running build running build_py creating build creating build/lib.linux-x86_64-3.6 creating build/lib.linux-x86_64-3.6/MySQLdb copying MySQLdb/__init__.py -> build/lib.linux-x86_64-3.6/MySQLdb copying MySQLdb/_exceptions.py -> build/lib.linux-x86_64-3.6/MySQLdb copying MySQLdb/compat.py -> build/lib.linux-x86_64-3.6/MySQLdb copying MySQLdb/connections.py -> build/lib.linux-x86_64-3.6/MySQLdb copying MySQLdb/converters.py -> build/lib.linux-x86_64-3.6/MySQLdb copying MySQLdb/cursors.py -> build/lib.linux-x86_64-3.6/MySQLdb copying MySQLdb/release.py -> build/lib.linux-x86_64-3.6/MySQLdb copying MySQLdb/times.py -> build/lib.linux-x86_64-3.6/MySQLdb creating build/lib.linux-x86_64-3.6/MySQLdb/constants copying MySQLdb/constants/__init__.py -> build/lib.linux-x86_64-3.6/MySQLdb/constants copying MySQLdb/constants/CLIENT.py -> build/lib.linux-x86_64-3.6/MySQLdb/constants copying MySQLdb/constants/CR.py -> build/lib.linux-x86_64-3.6/MySQLdb/constants copying MySQLdb/constants/ER.py -> build/lib.linux-x86_64-3.6/MySQLdb/constants copying MySQLdb/constants/FIELD_TYPE.py -> build/lib.linux-x86_64-3.6/MySQLdb/constants copying MySQLdb/constants/FLAG.py -> build/lib.linux-x86_64-3.6/MySQLdb/constants running build_ext building 'MySQLdb._mysql' extension creating build/temp.linux-x86_64-3.6 creating build/temp.linux-x86_64-3.6/MySQLdb x86_64-linux-gnu-gcc -pthread -DNDEBUG -g -fwrapv -O2 -Wall -g -fstack-protector-strong -Wformat -Werror=format-security -Wdate-time -D_FORTIFY_SOURCE=2 -fPIC -Dversion_info=(1,4,5,'final',0) -D__version__=1.4.5 -I/usr/include/mysql -I/usr/include/python3.6m -c MySQLdb/_mysql.c -o build/temp.linux-x86_64-3.6/MySQLdb/_mysql.o x86_64-linux-gnu-gcc -pthread -shared -Wl,-O1 -Wl,-Bsymbolic-functions -Wl,-Bsymbolic-functions -Wl,-z,relro -Wl,-Bsymbolic-functions -Wl,-z,relro -g -fstack-protector-strong -Wformat -Werror=format-security -Wdate-time -D_FORTIFY_SOURCE=2 build/temp.linux-x86_64-3.6/MySQLdb/_mysql.o -lmysqlclient -lpthread -lz -lm -lrt -latomic -lssl -lcrypto -ldl -o build/lib.linux-x86_64-3.6/MySQLdb/_mysql.cpython-36m-x86_64-linux-gnu.so /usr/bin/ld: cannot find -lssl /usr/bin/ld: cannot find -lcrypto collect2: error: ld returned 1 exit status error: command 'x86_64-linux-gnu-gcc' failed with exit status 1 ---------------------------------------- Command "/usr/bin/python3 -u -c "import setuptools, tokenize;__file__='/tmp/pip-build-njxuuzpo/mysqlclient/setup.py';f=getattr(tokenize, 'open', open)(__file__);code=f.read().replace('\r\n', '\n');f.close();exec(compile(code, __file__, 'exec'))" install --record /tmp/pip-ldoqhl56-record/install-record.txt --single-version-externally-managed --compile --user --prefix=" failed with error code 1 in /tmp/pip-build-njxuuzpo/mysqlclient/ ```
关于Mac下python pip版本问题以及pycharm安装python第三方库失败问题
我的电脑是mac 10.15版本 目前有两个python: 1. 系统自带Python 2.7.16 2. 自己安装python Python 3.7.3 在终端查询pip版本,结果是2.7的那个: pip 19.3.1 from /Library/Python/2.7/site-packages/pip (python 2.7) 查询pip3,结果显示错误: xcrun: error: invalid active developer path (/Library/Developer/CommandLineTools), missing xcrun at: /Library/Developer/CommandLineTools/usr/bin/xcrun 好像问题就是在这里,我在终端用 pip install 安装python第三方库的时候总会有问题,提示pip版本过低,我想更新pip又会失败;或者根本无法安装。 然后我就选择从pycharm上搜索第三方库并安装,奇怪的是有的库可以成功安装,有的库安装失败并提示说pip版本过低,让我尝试从终端安装,可是从终端安装的话又会遇到之前的问题。 请问这个该怎么解决?
python3.7 安装requests报错,求大神支招?
python3.7 通过pip 安装requests 报错,百度上也查过很多方法 1、通过更改源 2、通过wheel安装 3、pip --timout=60000等方式都不能解决 公司每台电脑上都装了赛门铁克(Symantec),会不会与这个有影响。 求详细解决方式 报错如下: ![图片说明](https://img-ask.csdn.net/upload/201906/10/1560136696_190131.jpg) Retrying (Retry(total=4, connect=None, read=None, redirect=None, status=None)) after connection broken by 'ConnectTimeoutError(<pip._vendor.urllib3.connection.VerifiedHTTPSConnection object at 0x0000000003F7B588>, 'Connection to pypi.org timed out. (connect timeout=15)')': /simple/requests/
python 使用pip安装包时添加了镜像源还是出现了如图问题怎么办
![图片说明](https://img-ask.csdn.net/upload/201908/30/1567173527_633787.jpg) python 使用pip安装包时添加了镜像源还是出现了如图问题怎么办?
python 安装 pymssql 库时报错
安装第三方库 ``` pip install pymssql Traceback (most recent call last): File "c:\users\XXX\appdata\local\programs\python\python37\lib\site-packages\pip\_vendor\urllib3\response.py", line 425, in _error_catcher yield File "c:\users\XXX\appdata\local\programs\python\python37\lib\site-packages\pip\_vendor\urllib3\response.py", line 507, in read data = self._fp.read(amt) if not fp_closed else b"" File "c:\users\XXX\appdata\local\programs\python\python37\lib\site-packages\pip\_vendor\cachecontrol\filewrapper.py", line 62, in read data = self.__fp.read(amt) File "c:\users\XXX\appdata\local\programs\python\python37\lib\http\client.py", line 457, in read n = self.readinto(b) File "c:\users\XXX\appdata\local\programs\python\python37\lib\http\client.py", line 501, in readinto n = self.fp.readinto(b) File "c:\users\XXX\appdata\local\programs\python\python37\lib\socket.py", line 589, in readinto return self._sock.recv_into(b) File "c:\users\XXX\appdata\local\programs\python\python37\lib\ssl.py", line 1071, in recv_into return self.read(nbytes, buffer) File "c:\users\XXX\appdata\local\programs\python\python37\lib\ssl.py", line 929, in read return self._sslobj.read(len, buffer) socket.timeout: The read operation timed out During handling of the above exception, another exception occurred: Traceback (most recent call last): File "c:\users\XXX\appdata\local\programs\python\python37\lib\site-packages\pip\_internal\cli\base_command.py", line 153, in _main status = self.run(options, args) File "c:\users\XXX\appdata\local\programs\python\python37\lib\site-packages\pip\_internal\commands\install.py", line 382, in run resolver.resolve(requirement_set) File "c:\users\XXX\appdata\local\programs\python\python37\lib\site-packages\pip\_internal\legacy_resolve.py", line 201, in resolve self._resolve_one(requirement_set, req) File "c:\users\XXX\appdata\local\programs\python\python37\lib\site-packages\pip\_internal\legacy_resolve.py", line 365, in _resolve_one abstract_dist = self._get_abstract_dist_for(req_to_install) File "c:\users\XXX\appdata\local\programs\python\python37\lib\site-packages\pip\_internal\legacy_resolve.py", line 313, in _get_abstract_dist_for req, self.session, self.finder, self.require_hashes File "c:\users\XXX\appdata\local\programs\python\python37\lib\site-packages\pip\_internal\operations\prepare.py", line 194, in prepare_linked_requirement progress_bar=self.progress_bar File "c:\users\XXX\appdata\local\programs\python\python37\lib\site-packages\pip\_internal\download.py", line 465, in unpack_url progress_bar=progress_bar File "c:\users\XXX\appdata\local\programs\python\python37\lib\site-packages\pip\_internal\download.py", line 316, in unpack_http_url progress_bar) File "c:\users\XXX\appdata\local\programs\python\python37\lib\site-packages\pip\_internal\download.py", line 551, in _download_http_url _download_url(resp, link, content_file, hashes, progress_bar) File "c:\users\XXX\appdata\local\programs\python\python37\lib\site-packages\pip\_internal\download.py", line 253, in _download_url hashes.check_against_chunks(downloaded_chunks) File "c:\users\XXX\appdata\local\programs\python\python37\lib\site-packages\pip\_internal\utils\hashes.py", line 80, in check_against_chunks for chunk in chunks: File "c:\users\XXX\appdata\local\programs\python\python37\lib\site-packages\pip\_internal\download.py", line 223, in written_chunks for chunk in chunks: File "c:\users\XXX\appdata\local\programs\python\python37\lib\site-packages\pip\_internal\utils\ui.py", line 160, in iter for x in it: File "c:\users\XXX\appdata\local\programs\python\python37\lib\site-packages\pip\_internal\download.py", line 212, in resp_read decode_content=False): File "c:\users\XXX\appdata\local\programs\python\python37\lib\site-packages\pip\_vendor\urllib3\response.py", line 564, in stream data = self.read(amt=amt, decode_content=decode_content) File "c:\users\XXX\appdata\local\programs\python\python37\lib\site-packages\pip\_vendor\urllib3\response.py", line 529, in read raise IncompleteRead(self._fp_bytes_read, self.length_remaining) File "c:\users\XXX\appdata\local\programs\python\python37\lib\contextlib.py", line 130, in __exit__ self.gen.throw(type, value, traceback) File "c:\users\XXX\appdata\local\programs\python\python37\lib\site-packages\pip\_vendor\urllib3\response.py", line 430, in _error_catcher raise ReadTimeoutError(self._pool, None, "Read timed out.") pip._vendor.urllib3.exceptions.ReadTimeoutError: HTTPSConnectionPool(host='pypi.tuna.tsinghua.edu.cn', port=443): Read timed out. ``` 也下载了 wordcloud-1.6.0-cp37-cp37m-win_amd64.whl python版本是3.7 64位
pip安装scrapy报错,求解?
root@iZ253bbf6h1Z:/home/guoyufeng/CODE/pythonCode/SCrapyLeraning/tutorial/tutorial/spiders# sudo apt-get install python-pipReading package lists... DoneBuilding dependency tree Reading state information... Donepython-pip is already the newest version.The following packages were automatically installed and are no longer required: ipython libwebp5 libwebpmux1 python-boto python-crypto python-decorator python-django python-guppy python-guppy-lib python-imaging python-mysqldb python-openssl python-pam python-pexpect python-pil python-pyasn1 python-pygments python-serial python-simplegeneric python-support python-twisted-bin python-twisted-conch python-twisted-core python-twisted-mail python-twisted-names python-twisted-web python-w3lib python-zope.interfaceUse 'apt-get autoremove' to remove them.0 upgraded, 0 newly installed, 0 to remove and 107 not upgraded.root@iZ253bbf6h1Z:/home/guoyufeng/CODE/pythonCode/SCrapyLeraning/tutorial/tutorial/spiders# pip install ScrapyDownloading/unpacking Scrapy Downloading Scrapy-1.0.1-py2-none-any.whl (290kB): 290kB downloadedCleaning up...Exception:Traceback (most recent call last): File "/usr/lib/python2.7/dist-packages/pip/basecommand.py", line 122, in main status = self.run(options, args) File "/usr/lib/python2.7/dist-packages/pip/commands/install.py", line 278, in run requirement_set.prepare_files(finder, force_root_egg_info=self.bundle, bundle=self.bundle) File "/usr/lib/python2.7/dist-packages/pip/req.py", line 1260, in prepare_files )[0]IndexError: list index out of rangeStoring debug log for failure in /root/.pip/pip.log
python升级后,pip不好用了。然后打算用升级后的python重装pip 结果报错,求助!
[root@iZ5qb441i7rtx5Z pip-8.1.2]# /usr/local/python27/bin/python setup.py install Traceback (most recent call last): File "setup.py", line 6, in <module> from setuptools import setup, find_packages ImportError: No module named setuptools
pip install安装包后报错ERROR?
![报错信息](https://img-ask.csdn.net/upload/201908/21/1566383154_853878.jpg) 使用pip安装第三方包时一直报错 Could not install packages due to an EnvironmentError: [Errno 0] Error python的环境遍历正常配置
Python 运用pip install Flask-MySQLdb报错
如图所示,Python 运用pip install Flask-MySQLdb报错,本人已安装了Microsoft Visual C++ Compiler Package for Python 2.7![图片说明](https://img-ask.csdn.net/upload/201710/24/1508813254_220461.png)![图片说明](https://img-ask.csdn.net/upload/201710/24/1508813323_513292.png)
python下pip安装总是报 AssertionError
PS C:\WINDOWS\system32> pip install sys Collecting sys Using cached sys-0.9.tar.gz Complete output from command python setup.py egg_info: Traceback (most recent call last): File "<string>", line 1, in <module> File "c:\users\ynf19\appdata\local\temp\pip-build-9qorpr\sys\setup.py", line 1, in <module> raise AssertionError("This package must not be installed from pypi") AssertionError: This package must not be installed from pypi ![图片说明](https://img-ask.csdn.net/upload/201612/28/1482937136_286505.png)
python安装pyinstaller报错
``` ERROR: Command errored out with exit status 1: command: 'c:\users\巩子昆\appdata\local\programs\python\python37-32\python.exe' 'c:\users\巩子昆\appdata\local\programs\python\python37-32\lib\site-packages\pip\_vendor\pep517\_in_process.py' prepare_metadata_for_build_wheel 'C:\Users\巩子昆\AppData\Local\Temp\tmp5hj8yy69' cwd: C:\Users\巩子昆\AppData\Local\Temp\pip-install-_y8nunuv\pyinstaller Complete output (36 lines): running dist_info creating C:\Users\巩子昆\AppData\Local\Temp\pip-install-_y8nunuv\pyinstaller\pip-wheel-metadata\PyInstaller.egg-info writing C:\Users\巩子昆\AppData\Local\Temp\pip-install-_y8nunuv\pyinstaller\pip-wheel-metadata\PyInstaller.egg-info\PKG-INFO writing dependency_links to C:\Users\巩子昆\AppData\Local\Temp\pip-install-_y8nunuv\pyinstaller\pip-wheel-metadata\PyInstaller.egg-info\dependency_links.txt writing entry points to C:\Users\巩子昆\AppData\Local\Temp\pip-install-_y8nunuv\pyinstaller\pip-wheel-metadata\PyInstaller.egg-info\entry_points.txt writing requirements to C:\Users\巩子昆\AppData\Local\Temp\pip-install-_y8nunuv\pyinstaller\pip-wheel-metadata\PyInstaller.egg-info\requires.txt writing top-level names to C:\Users\巩子昆\AppData\Local\Temp\pip-install-_y8nunuv\pyinstaller\pip-wheel-metadata\PyInstaller.egg-info\top_level.txt writing manifest file 'C:\Users\巩子昆\AppData\Local\Temp\pip-install-_y8nunuv\pyinstaller\pip-wheel-metadata\PyInstaller.egg-info\SOURCES.txt' reading manifest file 'C:\Users\巩子昆\AppData\Local\Temp\pip-install-_y8nunuv\pyinstaller\pip-wheel-metadata\PyInstaller.egg-info\SOURCES.txt' reading manifest template 'MANIFEST.in' Error in sitecustomize; set PYTHONVERBOSE for traceback: SyntaxError: (unicode error) 'utf-8' codec can't decode byte 0xb9 in position 0: invalid start byte (sitecustomize.py, line 7) no previously-included directories found matching 'bootloader\build' no previously-included directories found matching 'bootloader\.waf-*' no previously-included directories found matching 'bootloader\.waf3-*' no previously-included directories found matching 'bootloader\waf-*' no previously-included directories found matching 'bootloader\waf3-*' no previously-included directories found matching 'bootloader\_sdks' no previously-included directories found matching 'bootloader\.vagrant' warning: no previously-included files found matching 'bootloader\.lock-waf*' no previously-included directories found matching 'doc\source' no previously-included directories found matching 'doc\_build' warning: no previously-included files matching '*.tmp' found under directory 'doc' warning: no files found matching 'news\_template.rst' no previously-included directories found matching 'news' no previously-included directories found matching 'old' no previously-included directories found matching 'scripts' no previously-included directories found matching 'tests\scripts' no previously-included directories found matching '.github' warning: no previously-included files found matching '.*' warning: no previously-included files found matching '*.yml' warning: no previously-included files found matching '*~' warning: no previously-included files found matching '.directory' writing manifest file 'C:\Users\巩子昆\AppData\Local\Temp\pip-install-_y8nunuv\pyinstaller\pip-wheel-metadata\PyInstaller.egg-info\SOURCES.txt' creating 'C:\Users\巩子昆\AppData\Local\Temp\pip-install-_y8nunuv\pyinstaller\pip-wheel-metadata\PyInstaller.dist-info' error: invalid command 'bdist_wheel' ---------------------------------------- ERROR: Command errored out with exit status 1: 'c:\users\巩子昆\appdata\local\programs\python\python37-32\python.exe' 'c:\users\巩子昆\appdata\local\programs\python\python37-32\lib\site-packages\pip\_vendor\pep517\_in_process.py' prepare_metadata_for_build_wheel 'C:\Users\巩子昆\AppData\Local\Temp\tmp5hj8yy69' Check the logs for full command output. ``` 饶了我吧 我就一小白
Linux下的python的pip问题
今天我安装了python3 然后pip安装tornado,测试发现导入不成功,通过find命令查到pip把tornado安装到python2.7里面去了 ![图片说明](https://img-ask.csdn.net/upload/201804/29/1525006422_521904.png) 通过搜索命令发现在python3.6里面有一个pip,于是我到usr/bin目录下面删除了pip的软连接 然后设置python3.6的pip软连接发现pip用不了 ![图片说明](https://img-ask.csdn.net/upload/201804/29/1525006713_105393.png)
Python pip安装scrapy 一直报错求解答,谢谢
![图片说明](https://img-ask.csdn.net/upload/201803/03/1520089046_806117.png) PYTHON版本是3.5.3 LXML已安装完毕
python pip安装出错 无法安装其他模块
![图片说明](https://img-ask.csdn.net/upload/201911/27/1574787956_59573.png) pip的命令都是这样怎么办???我想安装pyinstaller和opencv都安装不了..有大佬告诉我是哪出错了m
python3 pip怎么安装。
环境:centos7, 新机时候默认的是python2.7,但是需要用到python3,网上下载安装完python3.5后,需要用到pip,但是这时候pip是兼容2.7 于是网上又重新下载了pip8,在pip8的解压目录下执行 ``` python3 setup.py install importerror:no module named 'setuptools' ``` 我又从网上下了setuptools,进入解压目录执行 ``` python3 setup.py install runtimerror: compression requires the (missing) zlib ``` 然后我用yum安装zlib和zlib-dev,按照网上的方法安装完zlib后,还要到python安装目录下重新编译,那么问题是,我应该到python3的目录下还是python2.7的目录下编译, 其实饶了一大圈我只是想用python 和pip,但是好像在给自己挖坑。求解。。。
python3.6安装pypsa包时报错,无法安装。
在使用pip install pypsa,安装报错如下![图片说明](https://img-ask.csdn.net/upload/201910/15/1571110476_72432.png)![图片说明](https://img-ask.csdn.net/upload/201910/15/1571110486_931164.png) ERROR: Command errored out with exit status 1: command: 'd:\python3\python.exe' 'd:\python3\lib\site-packages\pip\_vendor\pep517\_in_process.py' get_requires_for_build_wheel 'C:\Users\xyrrrr\AppData\Local\Temp\tmpk8s4cp1x' cwd: C:\Users\xyrrrr\AppData\Local\Temp\pip-install-y9r5hyt9\cartopy Complete output (3 lines): setup.py:171: UserWarning: Unable to determine GEOS version. Ensure you have 3.3.3 or later installed, or installation may fail. '.'.join(str(v) for v in GEOS_MIN_VERSION), )) Proj 4.9.0 must be installed. ---------------------------------------- ERROR: Command errored out with exit status 1: 'd:\python3\python.exe' 'd:\python3\lib\site-packages\pip\_vendor\pep517\_in_process.py' get_requires_for_build_wheel 'C:\Users\xyrrrr\AppData\Local\Temp\tmpk8s4cp1x' Check the logs for full command output. 查了很多,真的不懂如何解决,小白求专业人士帮助!谢谢。 一天也没解决,我就是一个刚下载python的小白 饶了我吧
python使用pip install Django问题
python出现的pip install Django问题怎么解决?
pip安装模块总是报ssl module in Python is not available的错误
环境:centos 6.5 + python2.7.13 问题:使用pip安装模块,总是包pip is configured with locations that require TLS/SSL, however the ssl module in Python is not available的错误。已知系统已经安装openssl、openssl-devel、pyopenssl等模块。请大神帮忙解答。 [root@www ~]# pip install six pip is configured with locations that require TLS/SSL, however the ssl module in Python is not available. Collecting six Could not fetch URL https://pypi.python.org/simple/six/: There was a problem confirming the ssl certificate: Can't connect to HTTPS URL because the SSL module is not available. - skipping Could not find a version that satisfies the requirement six (from versions: ) No matching distribution found for six
相见恨晚的超实用网站
相见恨晚的超实用网站 持续更新中。。。
Java学习的正确打开方式
在博主认为,对于入门级学习java的最佳学习方法莫过于视频+博客+书籍+总结,前三者博主将淋漓尽致地挥毫于这篇博客文章中,至于总结在于个人,实际上越到后面你会发现学习的最好方式就是阅读参考官方文档其次就是国内的书籍,博客次之,这又是一个层次了,这里暂时不提后面再谈。博主将为各位入门java保驾护航,各位只管冲鸭!!!上天是公平的,只要不辜负时间,时间自然不会辜负你。 何谓学习?博主所理解的学习,它是一个过程,是一个不断累积、不断沉淀、不断总结、善于传达自己的个人见解以及乐于分享的过程。
程序员必须掌握的核心算法有哪些?
由于我之前一直强调数据结构以及算法学习的重要性,所以就有一些读者经常问我,数据结构与算法应该要学习到哪个程度呢?,说实话,这个问题我不知道要怎么回答你,主要取决于你想学习到哪些程度,不过针对这个问题,我稍微总结一下我学过的算法知识点,以及我觉得值得学习的算法。这些算法与数据结构的学习大多数是零散的,并没有一本把他们全部覆盖的书籍。下面是我觉得值得学习的一些算法以及数据结构,当然,我也会整理一些看过...
大学四年自学走来,这些私藏的实用工具/学习网站我贡献出来了
大学四年,看课本是不可能一直看课本的了,对于学习,特别是自学,善于搜索网上的一些资源来辅助,还是非常有必要的,下面我就把这几年私藏的各种资源,网站贡献出来给你们。主要有:电子书搜索、实用工具、在线视频学习网站、非视频学习网站、软件下载、面试/求职必备网站。 注意:文中提到的所有资源,文末我都给你整理好了,你们只管拿去,如果觉得不错,转发、分享就是最大的支持了。 一、电子书搜索 对于大部分程序员...
linux系列之常用运维命令整理笔录
本博客记录工作中需要的linux运维命令,大学时候开始接触linux,会一些基本操作,可是都没有整理起来,加上是做开发,不做运维,有些命令忘记了,所以现在整理成博客,当然vi,文件操作等就不介绍了,慢慢积累一些其它拓展的命令,博客不定时更新 free -m 其中:m表示兆,也可以用g,注意都要小写 Men:表示物理内存统计 total:表示物理内存总数(total=used+free) use...
比特币原理详解
一、什么是比特币 比特币是一种电子货币,是一种基于密码学的货币,在2008年11月1日由中本聪发表比特币白皮书,文中提出了一种去中心化的电子记账系统,我们平时的电子现金是银行来记账,因为银行的背后是国家信用。去中心化电子记账系统是参与者共同记账。比特币可以防止主权危机、信用风险。其好处不多做赘述,这一层面介绍的文章很多,本文主要从更深层的技术原理角度进行介绍。 二、问题引入 假设现有4个人...
python 简易微信实现(注册登录+数据库存储+聊天+GUI+文件传输)
socket+tkinter详解+简易微信实现 历经多天的努力,查阅了许多大佬的博客后终于实现了一个简易的微信O(∩_∩)O~~ 简易数据库的实现 使用pands+CSV实现数据库框架搭建 import socket import threading from pandas import * import pymysql import csv # 创建DataFrame对象 # 存储用户数据的表(...
程序员接私活怎样防止做完了不给钱?
首先跟大家说明一点,我们做 IT 类的外包开发,是非标品开发,所以很有可能在开发过程中会有这样那样的需求修改,而这种需求修改很容易造成扯皮,进而影响到费用支付,甚至出现做完了项目收不到钱的情况。 那么,怎么保证自己的薪酬安全呢? 我们在开工前,一定要做好一些证据方面的准备(也就是“讨薪”的理论依据),这其中最重要的就是需求文档和验收标准。一定要让需求方提供这两个文档资料作为开发的基础。之后开发...
网页实现一个简单的音乐播放器(大佬别看。(⊙﹏⊙))
今天闲着无事,就想写点东西。然后听了下歌,就打算写个播放器。 于是乎用h5 audio的加上js简单的播放器完工了。 演示地点演示 html代码如下` music 这个年纪 七月的风 音乐 ` 然后就是css`*{ margin: 0; padding: 0; text-decoration: none; list-...
Python十大装B语法
Python 是一种代表简单思想的语言,其语法相对简单,很容易上手。不过,如果就此小视 Python 语法的精妙和深邃,那就大错特错了。本文精心筛选了最能展现 Python 语法之精妙的十个知识点,并附上详细的实例代码。如能在实战中融会贯通、灵活使用,必将使代码更为精炼、高效,同时也会极大提升代码B格,使之看上去更老练,读起来更优雅。
数据库优化 - SQL优化
以实际SQL入手,带你一步一步走上SQL优化之路!
2019年11月中国大陆编程语言排行榜
2019年11月2日,我统计了某招聘网站,获得有效程序员招聘数据9万条。针对招聘信息,提取编程语言关键字,并统计如下: 编程语言比例 rank pl_ percentage 1 java 33.62% 2 cpp 16.42% 3 c_sharp 12.82% 4 javascript 12.31% 5 python 7.93% 6 go 7.25% 7 p...
通俗易懂地给女朋友讲:线程池的内部原理
餐盘在灯光的照耀下格外晶莹洁白,女朋友拿起红酒杯轻轻地抿了一小口,对我说:“经常听你说线程池,到底线程池到底是个什么原理?”
《奇巧淫技》系列-python!!每天早上八点自动发送天气预报邮件到QQ邮箱
将代码部署服务器,每日早上定时获取到天气数据,并发送到邮箱。 也可以说是一个小型人工智障。 知识可以运用在不同地方,不一定非是天气预报。
经典算法(5)杨辉三角
杨辉三角 是经典算法,这篇博客对它的算法思想进行了讲解,并有完整的代码实现。
腾讯算法面试题:64匹马8个跑道需要多少轮才能选出最快的四匹?
昨天,有网友私信我,说去阿里面试,彻底的被打击到了。问了为什么网上大量使用ThreadLocal的源码都会加上private static?他被难住了,因为他从来都没有考虑过这个问题。无独有偶,今天笔者又发现有网友吐槽了一道腾讯的面试题,我们一起来看看。 腾讯算法面试题:64匹马8个跑道需要多少轮才能选出最快的四匹? 在互联网职场论坛,一名程序员发帖求助到。二面腾讯,其中一个算法题:64匹...
面试官:你连RESTful都不知道我怎么敢要你?
干货,2019 RESTful最贱实践
刷了几千道算法题,这些我私藏的刷题网站都在这里了!
遥想当年,机缘巧合入了 ACM 的坑,周边巨擘林立,从此过上了"天天被虐似死狗"的生活… 然而我是谁,我可是死狗中的战斗鸡,智力不够那刷题来凑,开始了夜以继日哼哧哼哧刷题的日子,从此"读题与提交齐飞, AC 与 WA 一色 ",我惊喜的发现被题虐既刺激又有快感,那一刻我泪流满面。这么好的事儿作为一个正直的人绝不能自己独享,经过激烈的颅内斗争,我决定把我私藏的十几个 T 的,阿不,十几个刷题网...
JavaScript 为什么能活到现在?
作者 | 司徒正美 责编 |郭芮 出品 | CSDN(ID:CSDNnews) JavaScript能发展到现在的程度已经经历不少的坎坷,早产带来的某些缺陷是永久性的,因此浏览器才有禁用JavaScript的选项。甚至在jQuery时代有人问出这样的问题,jQuery与JavaScript哪个快?在Babel.js出来之前,发明一门全新的语言代码代替JavaScript...
项目中的if else太多了,该怎么重构?
介绍 最近跟着公司的大佬开发了一款IM系统,类似QQ和微信哈,就是聊天软件。我们有一部分业务逻辑是这样的 if (msgType = "文本") { // dosomething } else if(msgType = "图片") { // doshomething } else if(msgType = "视频") { // doshomething } else { // doshom...
Nginx 原理和架构
Nginx 是一个免费的,开源的,高性能的 HTTP 服务器和反向代理,以及 IMAP / POP3 代理服务器。Nginx 以其高性能,稳定性,丰富的功能,简单的配置和低资源消耗而闻名。 Nginx 的整体架构 Nginx 里有一个 master 进程和多个 worker 进程。master 进程并不处理网络请求,主要负责调度工作进程:加载配置、启动工作进程及非停升级。worker 进程负责处...
致 Python 初学者
欢迎来到“Python进阶”专栏!来到这里的每一位同学,应该大致上学习了很多 Python 的基础知识,正在努力成长的过程中。在此期间,一定遇到了很多的困惑,对未来的学习方向感到迷茫。我非常理解你们所面临的处境。我从2007年开始接触 python 这门编程语言,从2009年开始单一使用 python 应对所有的开发工作,直至今天。回顾自己的学习过程,也曾经遇到过无数的困难,也曾经迷茫过、困惑过。开办这个专栏,正是为了帮助像我当年一样困惑的 Python 初学者走出困境、快速成长。希望我的经验能真正帮到你
Python 编程开发 实用经验和技巧
Python是一门很灵活的语言,也有很多实用的方法,有时候实现一个功能可以用多种方法实现,我这里总结了一些常用的方法和技巧,包括小数保留指定位小数、判断变量的数据类型、类方法@classmethod、制表符中文对齐、遍历字典、datetime.timedelta的使用等,会持续更新......
吐血推荐珍藏的Visual Studio Code插件
作为一名Java工程师,由于工作需要,最近一个月一直在写NodeJS,这种经历可以说是一部辛酸史了。好在有神器Visual Studio Code陪伴,让我的这段经历没有更加困难。眼看这段经历要告一段落了,今天就来给大家分享一下我常用的一些VSC的插件。 VSC的插件安装方法很简单,只需要点击左侧最下方的插件栏选项,然后就可以搜索你想要的插件了。 下面我们进入正题 Material Theme ...
“狗屁不通文章生成器”登顶GitHub热榜,分分钟写出万字形式主义大作
一、垃圾文字生成器介绍 最近在浏览GitHub的时候,发现了这样一个骨骼清奇的雷人项目,而且热度还特别高。 项目中文名:狗屁不通文章生成器 项目英文名:BullshitGenerator 根据作者的介绍,他是偶尔需要一些中文文字用于GUI开发时测试文本渲染,因此开发了这个废话生成器。但由于生成的废话实在是太过富于哲理,所以最近已经被小伙伴们给玩坏了。 他的文风可能是这样的: 你发现,...
程序员:我终于知道post和get的区别
是一个老生常谈的话题,然而随着不断的学习,对于以前的认识有很多误区,所以还是需要不断地总结的,学而时习之,不亦说乎
《程序人生》系列-这个程序员只用了20行代码就拿了冠军
你知道的越多,你不知道的越多 点赞再看,养成习惯GitHub上已经开源https://github.com/JavaFamily,有一线大厂面试点脑图,欢迎Star和完善 前言 这一期不算《吊打面试官》系列的,所有没前言我直接开始。 絮叨 本来应该是没有这期的,看过我上期的小伙伴应该是知道的嘛,双十一比较忙嘛,要值班又要去帮忙拍摄年会的视频素材,还得搞个程序员一天的Vlog,还要写BU...
开源并不是你认为的那些事
点击上方蓝字 关注我们开源之道导读所以 ————想要理清开源是什么?先要厘清开源不是什么,名正言顺是句中国的古代成语,概念本身的理解非常之重要。大部分生物多样性的起源,...
加快推动区块链技术和产业创新发展,2019可信区块链峰会在京召开
11月8日,由中国信息通信研究院、中国通信标准化协会、中国互联网协会、可信区块链推进计划联合主办,科技行者协办的2019可信区块链峰会将在北京悠唐皇冠假日酒店开幕。   区块链技术被认为是继蒸汽机、电力、互联网之后,下一代颠覆性的核心技术。如果说蒸汽机释放了人类的生产力,电力解决了人类基本的生活需求,互联网彻底改变了信息传递的方式,区块链作为构造信任的技术有重要的价值。   1...
Python 植物大战僵尸代码实现(2):植物卡片选择和种植
这篇文章要介绍的是: - 上方植物卡片栏的实现。 - 点击植物卡片,鼠标切换为植物图片。 - 鼠标移动时,判断当前在哪个方格中,并显示半透明的植物作为提示。
相关热词 c#委托 逆变与协变 c#新建一个项目 c#获取dll文件路径 c#子窗体调用主窗体事件 c# 拷贝目录 c# 调用cef 网页填表c#源代码 c#部署端口监听项目、 c#接口中的属性使用方法 c# 昨天
立即提问