theano 运行报错 安装了MingGW依然不行

想用theano运行regularization
安装了MingGW c++complier依然报错

from sklearn.datasets import load_boston 
import theano.tensor as T 
import numpy as np 
import matplotlib.pyplot as plt 
import theano

class Layer(object):
    def __init__(self,inputs,in_size,out_size,activation_function=None):
        self.W = theano.shared(np.random.normal(0,1,(in_size,out_size)))
        self.b = theano.shared(np.zeros((out_size,)) + 0.1)
        self.Wx_plus_b = T.dot(inputs, self.W) + self.b
        self.activation_function = activation_function
        if activation_function is None:
            self.outputs = self.Wx_plus_b
        else:
            self.outputs = self.activation_function(self.Wx_plus_b)

def minmax_normalization(data):
    xs_max = np.max(data, axis=0)
    xs_min = np.min(data, axis=0)
    xs = (1-0)*(data - xs_min)/(xs_max - xs_min) + 0
    return xs

np.random.seed(100)
x_dataset = load_boston()
x_data = x_dataset.data
# minmax normalization, rescale the inputs
x_data = minmax_normalization(x_data)
y_data = x_dataset.target[:,np.newaxis]

#cross validation, train test data split
x_train, y_train = x_data[:400], y_data[:400]
x_test, y_test = x_data[400:], y_data[400:]

x = T.dmatrix('x')
y = T.dmatrix('y')

l1 = Layer(x, 13, 50, T.tanh)
l2 = Layer(l1.outputs, 50, 1, None)

#compute cost
cost = T.mean(T.square(l2.outputs - y))
#cost = T.mean(T.square(l2.outputs - y)) + 0.1*((l1.W**2).sum() + (l2.W**2).sum()) #l2 regulization
#cost = T.mean(T.square(l2.outputs - y)) + 0.1*(abs(l1.W).sum() + abs(l2.W).sum()) #l1 regulization
gW1, gb1, gW2, gb2 = T.grad(cost, [l1.W,l1.b,l2.W,l2.b]) #gradient descend

learning_rate = 0.01
train = theano.function(inputs=[x,y], updates=[(l1.W,l1.W-learning_rate*gW1),
(l1.b,l1.b-learning_rate*gb1), (l2.W,l2.W-learning_rate*gW2), (l2.b,l2.b-learning_rate*gb2)])

compute_cost = theano.function(inputs=[x,y], outputs=cost)

#record cost
train_err_list = []
test_err_list = []
learning_time = []
for i in range(1000):
    if 1%10 == 0:
        #record cost
        train_err_list.append(compute_cost(x_train,y_train))
        test_err_list.append(compute_cost(x_test,y_test))
        learning_time.append(i)

#plot cost history
plt.plot(learning_time, train_err_list, 'r-')
plt.plot(learning_time, test_err_list,'b--')
plt.show()

#作者:morvan 莫凡
https://morvanzhou.github.io

报错如下:
You can find the C code in this temporary file: C:\Users\Elena\AppData\Local\Temp\theano_compilation_error_cns9ecbh
Traceback (most recent call last):
File "c:\Users\Elena\PycharmProjects\theano\regularization.py", line 2, in
import theano.tensor as T
File "C:\Users\Elena\Anaconda3\lib\site-packages\theano__init__.py", line 110, in
from theano.compile import (
File "C:\Users\Elena\Anaconda3\lib\site-packages\theano\compile__init__.py", line 12, in
from theano.compile.mode import *
File "C:\Users\Elena\Anaconda3\lib\site-packages\theano\compile\mode.py", line 11, in
import theano.gof.vm
File "C:\Users\Elena\Anaconda3\lib\site-packages\theano\gof\vm.py", line 674, in
from . import lazylinker_c
File "C:\Users\Elena\Anaconda3\lib\site-packages\theano\gof\lazylinker_c.py", line 140, in
preargs=args)
File "C:\Users\Elena\Anaconda3\lib\site-packages\theano\gof\cmodule.py", line 2396, in compile_str
(status, compile_stderr.replace('\n', '. ')))
Exception: Compilation failed (return status=1): C:\Users\Elena\AppData\Local\Theano\compiledir_Windows-10-10.0.17134-SP0-Intel64_Family_6_Model_142_Stepping_9_GenuineIntel-3.6.5-64\lazylinker_ext\mod.cpp:1:0: sorry, unimplemented: 64-bit mode not compiled in
. #include

终端显示gcc有安装
图片说明

1个回答

版本不匹配,你安装的编译器是32bit的

Csdn user default icon
上传中...
上传图片
插入图片
抄袭、复制答案,以达到刷声望分或其他目的的行为,在CSDN问答是严格禁止的,一经发现立刻封号。是时候展现真正的技术了!
其他相关推荐
theano在test的时候报错
已经安装了theano,但是test的时候总是会出现如图报错,不知道为什么。后来下了anaconda之后,依然是这个状态。![图片说明](https://img-ask.csdn.net/upload/201603/15/1458050586_113888.png)
theano 报错 module 'configparser' has no attribute 'ConfigParser' 用的是Anaconda3 python3.6
>theano 报错 module 'configparser' has no attribute 'ConfigParser' 用的是Win10 Anaconda3 python3.6 ``` from sklearn.datasets import load_boston import theano.tensor as T import numpy as np import matplotlib.pyplot as plt import theano class Layer(object): def __init__(self,inputs,in_size,out_size,activation_function=None): self.W = theano.shared(np.random.normal(0,1,(in_size,out_size))) self.b = theano.shared(np.zeros((out_size,)) + 0.1) self.Wx_plus_b = T.dot(inputs, self.W) + self.b self.activation_function = activation_function if activation_function is None: self.outputs = self.Wx_plus_b else: self.outputs = self.activation_function(self.Wx_plus_b) def minmax_normalization(data): xs_max = np.max(data, axis=0) xs_min = np.min(data, axis=0) xs = (1-0)*(data - xs_min)/(xs_max - xs_min) + 0 return xs np.random.seed(100) x_dataset = load_boston() x_data = x_dataset.data # minmax normalization, rescale the inputs x_data = minmax_normalization(x_data) y_data = x_dataset.target[:,np.newaxis] #cross validation, train test data split x_train, y_train = x_data[:400], y_data[:400] x_test, y_test = x_data[400:], y_data[400:] x = T.dmatrix('x') y = T.dmatrix('y') l1 = Layer(x, 13, 50, T.tanh) l2 = Layer(l1.outputs, 50, 1, None) #compute cost cost = T.mean(T.square(l2.outputs - y)) #cost = T.mean(T.square(l2.outputs - y)) + 0.1*((l1.W**2).sum() + (l2.W**2).sum()) #l2 regulization #cost = T.mean(T.square(l2.outputs - y)) + 0.1*(abs(l1.W).sum() + abs(l2.W).sum()) #l1 regulization gW1, gb1, gW2, gb2 = T.grad(cost, [l1.W,l1.b,l2.W,l2.b]) #gradient descend learning_rate = 0.01 train = theano.function(inputs=[x,y], updates=[(l1.W,l1.W-learning_rate*gW1), (l1.b,l1.b-learning_rate*gb1), (l2.W,l2.W-learning_rate*gW2), (l2.b,l2.b-learning_rate*gb2)]) compute_cost = theano.function(inputs=[x,y], outputs=cost) #record cost train_err_list = [] test_err_list = [] learning_time = [] for i in range(1000): if 1%10 == 0: #record cost train_err_list.append(compute_cost(x_train,y_train)) test_err_list.append(compute_cost(x_test,y_test)) learning_time.append(i) #plot cost history plt.plot(learning_time, train_err_list, 'r-') plt.plot(learning_time, test_err_list,'b--') plt.show() #作者 morvan莫凡 https://morvanzhou.github.io ``` 报错了: Traceback (most recent call last): File "C:/Users/Elena/PycharmProjects/theano/regularization.py", line 1, in <module> from sklearn.datasets import load_boston File "C:\Users\Elena\Anaconda3\lib\site-packages\sklearn\datasets\__init__.py", line 22, in <module> from .twenty_newsgroups import fetch_20newsgroups File "C:\Users\Elena\Anaconda3\lib\site-packages\sklearn\datasets\twenty_newsgroups.py", line 44, in <module> from ..feature_extraction.text import CountVectorizer File "C:\Users\Elena\Anaconda3\lib\site-packages\sklearn\feature_extraction\__init__.py", line 10, in <module> from . import text File "C:\Users\Elena\Anaconda3\lib\site-packages\sklearn\feature_extraction\text.py", line 28, in <module> from ..preprocessing import normalize File "C:\Users\Elena\Anaconda3\lib\site-packages\sklearn\preprocessing\__init__.py", line 6, in <module> from ._function_transformer import FunctionTransformer File "C:\Users\Elena\Anaconda3\lib\site-packages\sklearn\preprocessing\_function_transformer.py", line 5, in <module> from ..utils.testing import assert_allclose_dense_sparse File "C:\Users\Elena\Anaconda3\lib\site-packages\sklearn\utils\testing.py", line 61, in <module> from nose.tools import raises as _nose_raises File "C:\Users\Elena\Anaconda3\lib\site-packages\nose\__init__.py", line 1, in <module> from nose.core import collector, main, run, run_exit, runmodule File "C:\Users\Elena\Anaconda3\lib\site-packages\nose\core.py", line 11, in <module> from nose.config import Config, all_config_files File "C:\Users\Elena\Anaconda3\lib\site-packages\nose\config.py", line 6, in <module> import configparser File "C:\Users\Elena\Anaconda3\Lib\site-packages\theano\configparser.py", line 15, in <module> import theano File "C:\Users\Elena\Anaconda3\lib\site-packages\theano\__init__.py", line 88, in <module> from theano.configdefaults import config File "C:\Users\Elena\Anaconda3\lib\site-packages\theano\configdefaults.py", line 17, in <module> from theano.configparser import (AddConfigVar, BoolParam, ConfigParam, EnumStr, File "C:\Users\Elena\Anaconda3\lib\site-packages\theano\configparser.py", line 77, in <module> theano_cfg = (configparser.ConfigParser if PY3 **AttributeError: module 'configparser' has no attribute 'ConfigParser**' 把theano里的configparser.py文件里的ConfigParser改成了configparser还是不行 换了模块import configparsor也不行。。。![图片说明](https://img-ask.csdn.net/upload/201909/30/1569832318_223436.png)
import theano报错No such file or directory
import theano 的时候出来一长串最后这样↓ 改了path也没用 Exception: Compilation failed (return status=1): g++.exe: error: Files\Anaconda2\MinGW: No such file or directory ===================================== 详细错误代码: Problem occurred during compilation with the command line below: "C:\Program Files\Anaconda2\Scripts\g++.bat" -shared -g -IC:\Program Files\Anaconda2\MinGW -DNPY_NO_DEPRECATED_API=NPY_1_7_API_VERSION -m32 -I"C:\Program Files\Anaconda2\lib\site-packages\numpy\core\include" -I"C:\Program Files\Anaconda2\include" -I"C:\Program Files\Anaconda2\lib\site-packages\theano\gof" -L"C:\Program Files\Anaconda2\libs" -L"C:\Program Files\Anaconda2" -o C:\Users\Administrator\AppData\Local\Theano\compiledir_Windows-7-6.1.7601-SP1-x86_Family_16_Model_6_Stepping_3_AuthenticAMD-2.7.12-32\lazylinker_ext\lazylinker_ext.pyd C:\Users\Administrator\AppData\Local\Theano\compiledir_Windows-7-6.1.7601-SP1-x86_Family_16_Model_6_Stepping_3_AuthenticAMD-2.7.12-32\lazylinker_ext\mod.cpp -lpython27 ExceptionTraceback (most recent call last) <ipython-input-3-3397704bd624> in <module>() ----> 1 import theano C:\Program Files\Anaconda2\lib\site-packages\theano\__init__.pyc in <module>() 64 object2, utils) 65 ---> 66 from theano.compile import ( 67 SymbolicInput, In, 68 SymbolicOutput, Out, C:\Program Files\Anaconda2\lib\site-packages\theano\compile\__init__.py in <module>() 8 SpecifyShape, specify_shape, register_specify_shape_c_code) 9 ---> 10 from theano.compile.function_module import * 11 12 from theano.compile.mode import * C:\Program Files\Anaconda2\lib\site-packages\theano\compile\function_module.py in <module>() 19 from theano.compat import izip 20 from theano.gof import graph ---> 21 import theano.compile.mode 22 from theano.compile.io import ( 23 In, SymbolicInput, SymbolicOutput) C:\Program Files\Anaconda2\lib\site-packages\theano\compile\mode.py in <module>() 8 import theano 9 from theano import gof ---> 10 import theano.gof.vm 11 from theano.configparser import config 12 from theano.compile.ops import _output_guard C:\Program Files\Anaconda2\lib\site-packages\theano\gof\vm.py in <module>() 657 658 try: --> 659 from . import lazylinker_c 660 661 class CVM(lazylinker_c.CLazyLinker, VM): C:\Program Files\Anaconda2\lib\site-packages\theano\gof\lazylinker_c.py in <module>() 125 args = cmodule.GCC_compiler.compile_args() 126 cmodule.GCC_compiler.compile_str(dirname, code, location=loc, --> 127 preargs=args) 128 # Save version into the __init__.py file. 129 init_py = os.path.join(loc, '__init__.py') C:\Program Files\Anaconda2\lib\site-packages\theano\gof\cmodule.pyc in compile_str(module_name, src_code, location, include_dirs, lib_dirs, libs, preargs, py_module, hide_symbols) 2307 # difficult to read. 2308 raise Exception('Compilation failed (return status=%s): %s' % -> 2309 (status, compile_stderr.replace('\n', '. '))) 2310 elif config.cmodule.compilation_warning and compile_stderr: 2311 # Print errors just below the command line. . ception: Compilation failed (return status=1): g++.exe: error: Files\Anaconda2\MinGW: No such file or directory
win8下安装theano报错
![图片说明](https://img-ask.csdn.net/upload/201510/19/1445246449_777504.png)
Theano 报错:Wrong number of dimensions...
错误出现在:...(l2.b, l2.b - learning__rate * gb2)]) TypeError: ('Bad input argument to theano function with name "C:/Users/Administrator/Desktop/...python/theano/Regularization....py:66" at index 1(0-based)', 'Wrong number of dimensions: expected 2, got 1 with shape (200,).') ```__ import theano from sklearn.datasets import load_boston import theano.tensor as T import numpy as np import matplotlib.pyplot as plt class Layer(object):#定义神经层 def __init__(self, inputs, in_size, out_size, activation_function=None): self.W = theano.shared(np.random.normal(0, 1, (in_size, out_size))) self.b = theano.shared(np.zeros((out_size, )) + 0.1) self.Wx_plus_b = T.dot(inputs, self.W) + self.b self.activation_function = activation_function if activation_function is None: self.outputs = self.Wx_plus_b else: self.outputs = self.activation_function(self.Wx_plus_b) def minmax_normalization(data):#正则化数据 xs_max = np.max(data, axis=0) xs_min = np.min(data, axis=0) xs = (1 - 0) * (data - xs_min) / (xs_max - xs_min) + 0 return xs N=400 feats=28 lamda=0.1 np.random.seed(100) x_data = rng.randn(N, feats) x_data = minmax_normalization(x_data) y_data = rng.randint(size=N, low=0, high=2) x_train, y_train = x_data[:200], y_data[:200] x_test, y_test = x_data[200:], y_data[200:] x = T.dmatrix("x") y = T.dmatrix("y") l1 = Layer(x, 13, 50, T.tanh) l2 = Layer(l1.outputs, 50, 1, None) cost = T.mean(T.square(l2.outputs - y)) + lamda * ((l1.W ** 2).sum() + (l2.W ** 2).sum()) gW1, gb1, gW2, gb2 = T.grad(cost, [l1.W, l1.b, l2.W, l2.b]) learning_rate = 0.01 train = theano.function( inputs=[x, y], updates=[(l1.W, l1.W - learning_rate * gW1), (l1.b, l1.b - learning_rate * gb1), (l2.W, l2.W - learning_rate * gW2), (l2.b, l2.b - learning_rate * gb2)]) compute_cost = theano.function(inputs=[x, y], outputs=cost) train_err_list = [] test_err_list = [] learning_time = [] for i in range(1000): train(x_train, y_train) if i % 10 == 0: # record cost train_err_list.append(compute_cost(x_train, y_train)) test_err_list.append(compute_cost(x_test, y_test)) learning_time.append(i) plt.plot(learning_time, train_err_list, 'r-') plt.plot(learning_time, test_err_list, 'b--') plt.show() ``` __
执行import theano报错
![图片说明](https://img-ask.csdn.net/upload/201712/15/1513340547_127328.png)
keras 运行cnn时报内存错误
如题,我早先自学的是tf,昨天入了一下keras的坑,没用服务器,用我这个丐版的联想本装了一个基于theano的keras,一开始跑了一个全连接的神经网络,没啥问题。然后又做了一个很小的cnn,(代码如下),能够用 model.summary()输出网络的结构,但是运行起来就会弹出信息框报错: 代码: ``` import keras import numpy as np from keras.models import load_model input1=keras.layers.Input(shape=(25,)) x=keras.layers.Reshape([5,5,1])(input1) x1=keras.layers.Conv2D(filters=2,kernel_size=(2,2),strides=(1,1),padding='valid',activation='elu')(x) x2=keras.layers.MaxPooling2D(pool_size=(2,2),strides=(1,1),padding='valid')(x1) x3=keras.layers.Conv2D(filters=4,kernel_size=(2,2),strides=(1,1),padding='valid',activation='elu')(x2) x4=keras.layers.AveragePooling2D(pool_size=(2,2),strides=(1,1),padding='valid')(x3) x5=keras.layers.Reshape([4*4*2,])(x1) xx=keras.layers.Dense(1,activation='elu')(x5) model=keras.models.Model(inputs=input1,outputs=xx) model.summary() model.compile(loss='mse', optimizer='sgd') def data(): data=np.random.randint(0,2,[1,25]) return(data) def num(data): data=np.reshape(data,[25]) sum_=0 for i in data: sum_=sum_+i if sum_>10: result=[[1]] else: result=[[0]] return(result) while True: for i in range(100): x=data() y=num(x) cost = model.train_on_batch([x], [y]) print(i) x=data() y=num(x) cost = model.evaluate(x, y) print('loss=',cost) x=data() y=num(x) print('x=',x) print('y=',y) Y_pred = model.predict(x) print(Y_pred) words=input('continue??\::') if words=='n': break ``` 可以输出模型的结构![图片说明](https://img-ask.csdn.net/upload/202001/07/1578376564_807468.png) 但是再往下运行,就会弹出信息框报错: ![图片说明](https://img-ask.csdn.net/upload/202001/07/1578376772_416127.png) 请问各位高手有何高见 我的电脑是xp系统,32位,内存不到1G(老掉牙的耍着玩),装的是python 2.7.15,numpy(1.16.6),scipy(1.2.2),theano(1.0.4),keras(2.3.1) 勿喷,一般都是在服务器上写tf,这台电脑纯属娱乐。。 求教求教。。。
theano 安装好之后import theano出错,求大神帮助!
我在win7(64bit)下安装了Anaconda和theano,在import theano时出错: import theano Traceback (most recent call last): File "<stdin>", line 1, in <module> File "E:\jing\Anaconda\lib\site-packages\theano\__init__.py", line 55, in <module> from theano.compile import \ File "E:\jing\Anaconda\lib\site-packages\theano\compile\__init__.py", line 9, in <module> from theano.compile.function_module import * File "E:\jing\Anaconda\lib\site-packages\theano\compile\function_module.py", line 16, in <module> from theano import gof ImportError: cannot import name gof 在\Anaconda\lib\site-packages\theano\是有gof的 是什么原因呢?很着急,求帮助!
Theano深度学习库安装出错
安装环境:Win7 32bit anconda2-4.3.0.1 在Anaconda命令窗口中,输入mingw的安装命令:conda install mingw libpython mingw运行显示 ![图片说明](https://img-ask.csdn.net/upload/201702/21/1487638033_636146.png) 过了一个晚上后,还是显示的上面的图,在C:\Anconda2文件下没有出现:名为MinGW的文件夹。 请问这是怎么回事,继续等着吗?求助大神们
thanno编译过程中遇到在错误
![图片说明](https://img-ask.csdn.net/upload/201912/30/1577706160_132423.jpg) 用theano框架时,遇到了IndexError: Index out of bounds Apply node that caused the error: GpuAdvancedSubtensor(<GpuArrayType<None>(float32, matrix)>, ARange{dtype='int64'}.0, HostFromGpu(gpuarray).0) 的问题,实在不知道该怎么解决,求助各位大佬!
Theano安装keras出错,不知道怎么回事
我安装的Anaconda2 ,也安装了mingw libpython,但是用 pip install keras 时出现以下错误。 ![图片说明](https://img-ask.csdn.net/upload/201703/15/1489581323_114135.png) 然后我再c盘下建了一个文件夹 .keras ,又在文件夹里建了一个keras.json文本,内容为: { "image_dim_ordering": "th", "epsilon": 1e-07, "floatx": "float32", "backend": "theano" } 结果还是出图中错误,不知道怎么弄了,求大神帮助!
在spyder中运行theano代码时报Attribute
![图片说明](https://img-ask.csdn.net/upload/201907/27/1564209211_342980.png)
theano中pydot不能使用
版本:python2.7,pydot1.0.2,graphviz2.38 import pydot正常,但是使用theano.printing.dotpring报错:RuntimeError: Failed to import pydot. You must install pydot for `pydotprint` to work. 查找问题根源,发现graphviz没有找到,于是使用pydot.find_graphviz()测试,报错如下: --------------------------------------------------------------------------- error Traceback (most recent call last) <ipython-input-17-97d9c276b23b> in <module>() ----> 1 pydot.find_graphviz() C:\Anaconda\lib\site-packages\pydot.pyc in find_graphviz() 407 # 408 hkey = win32api.RegOpenKeyEx( win32con.HKEY_LOCAL_MACHINE, --> 409 "SOFTWARE\ATT\Graphviz", 0, win32con.KEY_QUERY_VALUE ) 410 411 path = win32api.RegQueryValueEx( hkey, "InstallPath" )[0] error: (2, 'RegOpenKeyEx', '\xcf\xb5\xcd\xb3\xd5\xd2\xb2\xbb\xb5\xbd\xd6\xb8\xb6\xa8\xb5\xc4\xce\xc4\xbc\xfe\xa1\xa3')
anconda下import theano出错
我在window下安装了anconda,mingw,libpython和theano用conda list都可以看到,可是在ipython下import theano出现如下错误 Exception Traceback (most recent call last) <ipython-input-1-3397704bd624> in <module>() ----> 1 import theano D:\Program Files\Anaconda2\lib\site-packages\theano\__init__.pyc in <module>() 61 object2, utils) 62 ---> 63 from theano.compile import ( 64 SymbolicInput, In, 65 SymbolicOutput, Out, D:\Program Files\Anaconda2\lib\site-packages\theano\compile\__init__.py in <module>() 7 SpecifyShape, specify_shape, register_specify_shape_c_code) 8 ----> 9 from theano.compile.function_module import * 10 11 from theano.compile.mode import * D:\Program Files\Anaconda2\lib\site-packages\theano\compile\function_module.py in <module>() 20 from theano.compat import izip 21 from theano.gof import graph ---> 22 import theano.compile.mode 23 from theano.compile.io import ( 24 In, SymbolicInput, SymbolicInputKit, SymbolicOutput) D:\Program Files\Anaconda2\lib\site-packages\theano\compile\mode.py in <module>() 10 import theano 11 from theano import gof ---> 12 import theano.gof.vm 13 from theano.configparser import config 14 from theano.compile.ops import _output_guard D:\Program Files\Anaconda2\lib\site-packages\theano\gof\vm.py in <module>() 636 637 try: --> 638 from . import lazylinker_c 639 640 class CVM(lazylinker_c.CLazyLinker, VM): D:\Program Files\Anaconda2\lib\site-packages\theano\gof\lazylinker_c.py in <module>() 124 args = cmodule.GCC_compiler.compile_args() 125 cmodule.GCC_compiler.compile_str(dirname, code, location=loc, --> 126 preargs=args) 127 # Save version into the __init__.py file. 128 init_py = os.path.join(loc, '__init__.py') D:\Program Files\Anaconda2\lib\site-packages\theano\gof\cmodule.pyc in compile_str(module_name, src_code, location, include_dirs, lib_dirs, libs, preargs, py_module, hide_symbols) 2194 # difficult to read. 2195 raise Exception('Compilation failed (return status=%s): %s' % -> 2196 (status, compile_stderr.replace('\n', '. '))) 2197 elif config.cmodule.compilation_warning and compile_stderr: 2198 # Print errors just below the command line. . ception: Compilation failed (return status=1): g++.exe: error: Files\Anaconda2\MinGW: No such file or directory 哪位大侠能帮我看下什么问题?谢谢
ubuntu下Theano使用GPU的问题
配置情况: 在ubuntu14.04下配置theano,在调用官方文档里GPU测试得函数是总是返回 Used CPU CUDA应该安装的没问题,安装完可以运行测试用例 显卡也是没问题得,支持CUDA妥妥儿得 用的IDE是spyder 使用另一个测试用例 from theano import function, config, shared, sandbox import theano.sandbox.cuda.basic_ops import theano.tensor as T import numpy import time vlen = 10 * 30 * 768 # 10 x #cores x # threads per core iters = 1000 rng = numpy.random.RandomState(22) x = shared(numpy.asarray(rng.rand(vlen), 'float32')) f = function([], sandbox.cuda.basic_ops.gpu_from_host(T.exp(x))) print(f.maker.fgraph.toposort()) t0 = time.time() for i in xrange(iters): r = f() t1 = time.time() print("Looping %d times took %f seconds" % (iters, t1 - t0)) print("Result is %s" % (r,)) print("Numpy result is %s" % (numpy.asarray(r),)) if numpy.any([isinstance(x.op, T.Elemwise) for x in f.maker.fgraph.toposort()]): print('Used the cpu') else: print('Used the gpu') 的时候偶尔会返回 找不到nvcc的错误,提示我应该将nvcc加入路径中,但有时候重启一下就不提示这问题了。。虽然仍然显示调用得是cpu 出现这个问题时候我试着查看 nvcc -V -i 提示nvcc未安装,可使用apt-get安装 然后我用apt-get时又会这样: Reading package lists... Done Building dependency tree Reading state information... Done Note, selecting 'cuda-core-7-5' instead of 'nvcc' cuda-core-7-5 is already the newest version. 0 upgraded, 0 newly installed, 0 to remove and 320 not upgraded. 刚才说了我CUDA都安装好了nvcc肯定妥妥儿的啊,尝试按照CUDA手册上把运行库再添加到路径中一次: gpu2@gpu2-All-Series:~$ export PATH=/usr/local/cuda-7.5/bin:$PATH gpu2@gpu2-All-Series:~$ export LD_LIBRARY_PATH=/usr/local/cuda-7.5/lib64:$LD_LIBRARY_PATH 并没有任何卵用 求各位大神协助!感激不尽!
theano或Python环境的问题,运行train.py出现一些问题,求大神指导
wangj@liutl:~/Work/NSC-master/NSC/src$ THEANO_FLAGS="floatX=float32,device=gpu" python train.py IMDB 10 Using gpu device 0: GeForce GTX TITAN Black (CNMeM is disabled, cuDNN Version is too old. Update to v5, was 4004.) data loaded. Traceback (most recent call last): File "train.py", line 15, in <module> model = LSTMModel(voc.size,trainset, devset, dataname, classes, None) File "/home/wangj/Work/NSC-master/NSC/src/LSTMModel.py", line 61, in __init__ updates=updates, File "/usr/local/lib/python2.7/dist-packages/theano/compile/function.py", line 320, in function output_keys=output_keys) File "/usr/local/lib/python2.7/dist-packages/theano/compile/pfunc.py", line 479, in pfunc output_keys=output_keys) File "/usr/local/lib/python2.7/dist-packages/theano/compile/function_module.py", line 1777, in orig_function defaults) File "/usr/local/lib/python2.7/dist-packages/theano/compile/function_module.py", line 1641, in create input_storage=input_storage_lists, storage_map=storage_map) File "/usr/local/lib/python2.7/dist-packages/theano/gof/link.py", line 690, in make_thunk storage_map=storage_map)[:3] File "/usr/local/lib/python2.7/dist-packages/theano/gof/vm.py", line 1003, in make_all no_recycling)) File "/usr/local/lib/python2.7/dist-packages/theano/scan_module/scan_op.py", line 913, in make_thunk from . import scan_perform_ext File "/usr/local/lib/python2.7/dist-packages/theano/scan_module/scan_perform_ext.py", line 141, in <module> from scan_perform.scan_perform import * File "__init__.pxd", line 155, in init theano.scan_module.scan_perform (/home/wangj/.theano/compiledir_Linux-3.13--generic-x86_64-with-Ubuntu-14.04-trusty-x86_64-2.7.6-64/scan_perform/mod.cpp:9984) ValueError: ('The following error happened while compiling the node', forall_inplace,gpu,scan_fn}(Elemwise{minimum,no_inplace}.0, GpuDimShuffle{0,1,x}.0, GpuSubtensor{int64:int64:int8}.0, GpuIncSubtensor{InplaceSet;:int64:}.0, GpuIncSubtensor{InplaceSet;:int64:}.0, Wf1, Wf2, Wc1, Wc2, Wi1, Wi2, Wo1, Wo2, GpuDimShuffle{x,0}.0, GpuDimShuffle{x,0}.0, GpuDimShuffle{x,0}.0, GpuDimShuffle{x,0}.0), '\n', 'numpy.dtype has the wrong size, try recompiling')
theano gpu配置问题
系统win10 64位 python2.7 64位 cuda7.5 vs2013 安装theano gpu加速时 import theano时 ![图片说明](https://img-ask.csdn.net/upload/201704/10/1491795243_99092.png) ![图片说明](https://img-ask.csdn.net/upload/201704/10/1491795257_662660.png) ![.theanorc.txt](https://img-ask.csdn.net/upload/201704/10/1491795329_26110.png)
anconda在import theano失败,求大神帮助!!
=============================== Problem occurred during compilation with the command line below: C:\MinGW\bin\g++.exe -shared -g -march=core-avx2 -mcx16 -msahf -mmovbe -maes -mpclmul -mpopcnt -mabm -mno-lwp -mno-fma -mno-fma4 -mn o-xop -mbmi -mbmi2 -mno-tbm -mno-avx -mno-avx2 -msse4.2 -msse4.1 -mlzcnt -mno-rtm -mno-hle -mrdrnd -mf16c -mfsgsbase -mno-rdseed -mn o-prfchw -mno-adx -mfxsr -mno-xsave -mno-xsaveopt --param l1-cache-size=32 --param l1-cache-line-size=64 --param l2-cache-size=3072 -mtune=core-avx2 -D NPY_NO_DEPRECATED_API=NPY_1_7_API_VERSION -m64 -DMS_WIN64 -IC:\Anaconda\lib\site-packages\numpy\core\include -IC :\Anaconda\include -o C:\Users\Jim\AppData\Local\Theano\compiledir_Windows-7-6.1.7600-Intel64_Family_6_Model_60_Stepping_3_GenuineIn tel-2.7.9-64\lazylinker_ext\lazylinker_ext.pyd C:\Users\Jim\AppData\Local\Theano\compiledir_Windows-7-6.1.7600-Intel64_Family_6_Mode l_60_Stepping_3_GenuineIntel-2.7.9-64\lazylinker_ext\mod.cpp -LC:\Anaconda\libs -LC:\Anaconda -lpython27 C:\Users\Jim\AppData\Local\Temp\cc4OSOrg.o: In function `unpack_list_of_ssize_t': C:/Users/Jim/AppData/Local/Theano/compiledir_Windows-7-6.1.7600-Intel64_Family_6_Model_60_Stepping_3_GenuineIntel-2.7.9-64/lazylinke r_ext/mod.cpp:58: undefined reference to `__imp_PyExc_TypeError' C:/Users/Jim/AppData/Local/Theano/compiledir_Windows-7-6.1.7600-Intel64_Family_6_Model_60_Stepping_3_GenuineIntel-2.7.9-64/lazylinke r_ext/mod.cpp:68: undefined reference to `__imp_PyExc_IndexError' C:\Users\Jim\AppData\Local\Temp\cc4OSOrg.o: In function `CLazyLinker_init':
keras无法切换到Theano,怎么解决?
配置:Ubuntu16.04,纯CPU Theano已经测试过安装成功了,如下图,Keras已经成功安装。 ![图片说明](https://img-ask.csdn.net/upload/201706/19/1497831610_313292.jpg) 我的keras文件夹里没有keras.json文件,我是新建了一个文档,并在文档内写入 ``` { "image_dim_ordering": "th", "epsilon": 1e-07, "floatx": "float32", "backend": "theano" } ``` 可是进入python 环境后,测试仍然让我使用tensorflow,重启电脑后也是同样的效果。 ![图片说明](https://img-ask.csdn.net/upload/201706/19/1497831960_1641.jpg)
Java学习的正确打开方式
在博主认为,对于入门级学习java的最佳学习方法莫过于视频+博客+书籍+总结,前三者博主将淋漓尽致地挥毫于这篇博客文章中,至于总结在于个人,实际上越到后面你会发现学习的最好方式就是阅读参考官方文档其次就是国内的书籍,博客次之,这又是一个层次了,这里暂时不提后面再谈。博主将为各位入门java保驾护航,各位只管冲鸭!!!上天是公平的,只要不辜负时间,时间自然不会辜负你。 何谓学习?博主所理解的学习,它是一个过程,是一个不断累积、不断沉淀、不断总结、善于传达自己的个人见解以及乐于分享的过程。
程序员必须掌握的核心算法有哪些?
由于我之前一直强调数据结构以及算法学习的重要性,所以就有一些读者经常问我,数据结构与算法应该要学习到哪个程度呢?,说实话,这个问题我不知道要怎么回答你,主要取决于你想学习到哪些程度,不过针对这个问题,我稍微总结一下我学过的算法知识点,以及我觉得值得学习的算法。这些算法与数据结构的学习大多数是零散的,并没有一本把他们全部覆盖的书籍。下面是我觉得值得学习的一些算法以及数据结构,当然,我也会整理一些看过...
前端 | 2. 正则
转载请注明以下: 本文转自清自以敬的博客:https://blog.csdn.net/qq_45791147 文章目录1.转义2.正则表达式初步2.1.匹配字符2.1.1.组成元素2.1.2.基础正则的设计 1.转义 转义的作用: 当某个字符在表达式中具有特殊含义,例如字符串引号中出现了引号,为了可以使用这些字符本身,而不是使用其在表达式中的特殊含义,则需要通过转义符“\”来构建该字符转义...
有哪些让程序员受益终生的建议
从业五年多,辗转两个大厂,出过书,创过业,从技术小白成长为基层管理,联合几个业内大牛回答下这个问题,希望能帮到大家,记得帮我点赞哦。 敲黑板!!!读了这篇文章,你将知道如何才能进大厂,如何实现财务自由,如何在工作中游刃有余,这篇文章很长,但绝对是精品,记得帮我点赞哦!!!! 一腔肺腑之言,能看进去多少,就看你自己了!!! 目录: 在校生篇: 为什么要尽量进大厂? 如何选择语言及方...
大学四年自学走来,这些私藏的实用工具/学习网站我贡献出来了
大学四年,看课本是不可能一直看课本的了,对于学习,特别是自学,善于搜索网上的一些资源来辅助,还是非常有必要的,下面我就把这几年私藏的各种资源,网站贡献出来给你们。主要有:电子书搜索、实用工具、在线视频学习网站、非视频学习网站、软件下载、面试/求职必备网站。 注意:文中提到的所有资源,文末我都给你整理好了,你们只管拿去,如果觉得不错,转发、分享就是最大的支持了。 一、电子书搜索 对于大部分程序员...
linux系列之常用运维命令整理笔录
本博客记录工作中需要的linux运维命令,大学时候开始接触linux,会一些基本操作,可是都没有整理起来,加上是做开发,不做运维,有些命令忘记了,所以现在整理成博客,当然vi,文件操作等就不介绍了,慢慢积累一些其它拓展的命令,博客不定时更新 free -m 其中:m表示兆,也可以用g,注意都要小写 Men:表示物理内存统计 total:表示物理内存总数(total=used+free) use...
比特币原理详解
一、什么是比特币 比特币是一种电子货币,是一种基于密码学的货币,在2008年11月1日由中本聪发表比特币白皮书,文中提出了一种去中心化的电子记账系统,我们平时的电子现金是银行来记账,因为银行的背后是国家信用。去中心化电子记账系统是参与者共同记账。比特币可以防止主权危机、信用风险。其好处不多做赘述,这一层面介绍的文章很多,本文主要从更深层的技术原理角度进行介绍。 二、问题引入 假设现有4个人...
程序员接私活怎样防止做完了不给钱?
首先跟大家说明一点,我们做 IT 类的外包开发,是非标品开发,所以很有可能在开发过程中会有这样那样的需求修改,而这种需求修改很容易造成扯皮,进而影响到费用支付,甚至出现做完了项目收不到钱的情况。 那么,怎么保证自己的薪酬安全呢? 我们在开工前,一定要做好一些证据方面的准备(也就是“讨薪”的理论依据),这其中最重要的就是需求文档和验收标准。一定要让需求方提供这两个文档资料作为开发的基础。之后开发...
网页实现一个简单的音乐播放器(大佬别看。(⊙﹏⊙))
今天闲着无事,就想写点东西。然后听了下歌,就打算写个播放器。 于是乎用h5 audio的加上js简单的播放器完工了。 演示地点演示 html代码如下` music 这个年纪 七月的风 音乐 ` 然后就是css`*{ margin: 0; padding: 0; text-decoration: none; list-...
Python十大装B语法
Python 是一种代表简单思想的语言,其语法相对简单,很容易上手。不过,如果就此小视 Python 语法的精妙和深邃,那就大错特错了。本文精心筛选了最能展现 Python 语法之精妙的十个知识点,并附上详细的实例代码。如能在实战中融会贯通、灵活使用,必将使代码更为精炼、高效,同时也会极大提升代码B格,使之看上去更老练,读起来更优雅。
数据库优化 - SQL优化
以实际SQL入手,带你一步一步走上SQL优化之路!
2019年11月中国大陆编程语言排行榜
2019年11月2日,我统计了某招聘网站,获得有效程序员招聘数据9万条。针对招聘信息,提取编程语言关键字,并统计如下: 编程语言比例 rank pl_ percentage 1 java 33.62% 2 cpp 16.42% 3 c_sharp 12.82% 4 javascript 12.31% 5 python 7.93% 6 go 7.25% 7 p...
通俗易懂地给女朋友讲:线程池的内部原理
餐盘在灯光的照耀下格外晶莹洁白,女朋友拿起红酒杯轻轻地抿了一小口,对我说:“经常听你说线程池,到底线程池到底是个什么原理?”
《奇巧淫技》系列-python!!每天早上八点自动发送天气预报邮件到QQ邮箱
将代码部署服务器,每日早上定时获取到天气数据,并发送到邮箱。 也可以说是一个小型人工智障。 知识可以运用在不同地方,不一定非是天气预报。
经典算法(5)杨辉三角
杨辉三角 是经典算法,这篇博客对它的算法思想进行了讲解,并有完整的代码实现。
腾讯算法面试题:64匹马8个跑道需要多少轮才能选出最快的四匹?
昨天,有网友私信我,说去阿里面试,彻底的被打击到了。问了为什么网上大量使用ThreadLocal的源码都会加上private static?他被难住了,因为他从来都没有考虑过这个问题。无独有偶,今天笔者又发现有网友吐槽了一道腾讯的面试题,我们一起来看看。 腾讯算法面试题:64匹马8个跑道需要多少轮才能选出最快的四匹? 在互联网职场论坛,一名程序员发帖求助到。二面腾讯,其中一个算法题:64匹...
面试官:你连RESTful都不知道我怎么敢要你?
干货,2019 RESTful最贱实践
Docker 从入门到掉坑
Docker 介绍 简单的对docker进行介绍,可以把它理解为一个应用程序执行的容器。但是docker本身和虚拟机还是有较为明显的出入的。我大致归纳了一下,可以总结为以下几点: docker自身也有着很多的优点,关于它的优点,可以总结为以下几项: 安装docker 从 2017 年 3 月开始 docker 在原来的基础上分为两个分支版本: Docker CE 和 Doc...
为啥国人偏爱Mybatis,而老外喜欢Hibernate/JPA呢?
关于SQL和ORM的争论,永远都不会终止,我也一直在思考这个问题。昨天又跟群里的小伙伴进行了一番讨论,感触还是有一些,于是就有了今天这篇文。 声明:本文不会下关于Mybatis和JPA两个持久层框架哪个更好这样的结论。只是摆事实,讲道理,所以,请各位看官勿喷。 一、事件起因 关于Mybatis和JPA孰优孰劣的问题,争论已经很多年了。一直也没有结论,毕竟每个人的喜好和习惯是大不相同的。我也看...
白话阿里巴巴Java开发手册高级篇
不久前,阿里巴巴发布了《阿里巴巴Java开发手册》,总结了阿里巴巴内部实际项目开发过程中开发人员应该遵守的研发流程规范,这些流程规范在一定程度上能够保证最终的项目交付质量,通过在时间中总结模式,并推广给广大开发人员,来避免研发人员在实践中容易犯的错误,确保最终在大规模协作的项目中达成既定目标。 无独有偶,笔者去年在公司里负责升级和制定研发流程、设计模板、设计标准、代码标准等规范,并在实际工作中进行...
SQL-小白最佳入门sql查询一
不要偷偷的查询我的个人资料,即使你再喜欢我,也不要这样,真的不好;
项目中的if else太多了,该怎么重构?
介绍 最近跟着公司的大佬开发了一款IM系统,类似QQ和微信哈,就是聊天软件。我们有一部分业务逻辑是这样的 if (msgType = "文本") { // dosomething } else if(msgType = "图片") { // doshomething } else if(msgType = "视频") { // doshomething } else { // doshom...
Nginx 原理和架构
Nginx 是一个免费的,开源的,高性能的 HTTP 服务器和反向代理,以及 IMAP / POP3 代理服务器。Nginx 以其高性能,稳定性,丰富的功能,简单的配置和低资源消耗而闻名。 Nginx 的整体架构 Nginx 里有一个 master 进程和多个 worker 进程。master 进程并不处理网络请求,主要负责调度工作进程:加载配置、启动工作进程及非停升级。worker 进程负责处...
Python 编程开发 实用经验和技巧
Python是一门很灵活的语言,也有很多实用的方法,有时候实现一个功能可以用多种方法实现,我这里总结了一些常用的方法和技巧,包括小数保留指定位小数、判断变量的数据类型、类方法@classmethod、制表符中文对齐、遍历字典、datetime.timedelta的使用等,会持续更新......
YouTube排名第一的励志英文演讲《Dream(梦想)》
Idon’t know what that dream is that you have, I don't care how disappointing it might have been as you've been working toward that dream,but that dream that you’re holding in your mind, that it’s po...
“狗屁不通文章生成器”登顶GitHub热榜,分分钟写出万字形式主义大作
一、垃圾文字生成器介绍 最近在浏览GitHub的时候,发现了这样一个骨骼清奇的雷人项目,而且热度还特别高。 项目中文名:狗屁不通文章生成器 项目英文名:BullshitGenerator 根据作者的介绍,他是偶尔需要一些中文文字用于GUI开发时测试文本渲染,因此开发了这个废话生成器。但由于生成的废话实在是太过富于哲理,所以最近已经被小伙伴们给玩坏了。 他的文风可能是这样的: 你发现,...
程序员:我终于知道post和get的区别
是一个老生常谈的话题,然而随着不断的学习,对于以前的认识有很多误区,所以还是需要不断地总结的,学而时习之,不亦说乎
《程序人生》系列-这个程序员只用了20行代码就拿了冠军
你知道的越多,你不知道的越多 点赞再看,养成习惯GitHub上已经开源https://github.com/JavaFamily,有一线大厂面试点脑图,欢迎Star和完善 前言 这一期不算《吊打面试官》系列的,所有没前言我直接开始。 絮叨 本来应该是没有这期的,看过我上期的小伙伴应该是知道的嘛,双十一比较忙嘛,要值班又要去帮忙拍摄年会的视频素材,还得搞个程序员一天的Vlog,还要写BU...
程序员把地府后台管理系统做出来了,还有3.0版本!12月7号最新消息:已在开发中有github地址
第一幕:缘起 听说阎王爷要做个生死簿后台管理系统,我们派去了一个程序员…… 996程序员做的梦: 第一场:团队招募 为了应对地府管理危机,阎王打算找“人”开发一套地府后台管理系统,于是就在地府总经办群中发了项目需求。 话说还是中国电信的信号好,地府都是满格,哈哈!!! 经常会有外行朋友问:看某网站做的不错,功能也简单,你帮忙做一下? 而这次,面对这样的需求,这个程序员...
网易云6亿用户音乐推荐算法
网易云音乐是音乐爱好者的集聚地,云音乐推荐系统致力于通过 AI 算法的落地,实现用户千人千面的个性化推荐,为用户带来不一样的听歌体验。 本次分享重点介绍 AI 算法在音乐推荐中的应用实践,以及在算法落地过程中遇到的挑战和解决方案。 将从如下两个部分展开: AI算法在音乐推荐中的应用 音乐场景下的 AI 思考 从 2013 年 4 月正式上线至今,网易云音乐平台持续提供着:乐屏社区、UGC...
相关热词 c#选择结构应用基本算法 c# 收到udp包后回包 c#oracle 头文件 c# 序列化对象 自定义 c# tcp 心跳 c# ice连接服务端 c# md5 解密 c# 文字导航控件 c#注册dll文件 c#安装.net
立即提问