Failed to launch Appium Settings app: Condition unmet after 5506 ms

Appium启动模拟器里的app的时候,用雷电模拟器会报错提示“An unknown server-side error occurred while processing the command. Original error: Failed to launch Appium Settings app: Condition unmet after 5506 ms. Timing out.”但是用夜神模拟器就可以启动,这是为什么

1个回答

Csdn user default icon
上传中...
上传图片
插入图片
抄袭、复制答案,以达到刷声望分或其他目的的行为,在CSDN问答是严格禁止的,一经发现立刻封号。是时候展现真正的技术了!
其他相关推荐
appium报错:Failed to launch Appium Settings app
我的步骤 1.使用adb devices中查看到我的设备(这里我使用的是雷电模拟器) 2.配置完desired caps后运行代码报错 ``` from appium import webdriver import time desired_caps ={ 'platformName':'Android', 'deviceName':'emulator-5554', 'platformVersion':'5.1', 'appPackage':'com.android.contacts', 'appActivity':'.activities.PeopleActivity', } driver = webdriver.Remote('http://localhost:4723/wd/hub',desired_caps) driver.quit() ``` 报错如下: ``` selenium.common.exceptions.WebDriverException: Message: An unknown server-side error occurred while processing the command. Original error: Failed to launch Appium Settings app: Condition unmet after 5384 ms. Timing out. ```
appium:求 Failed to launch Appium Settings app的解决办法
我使用的是雷电模拟器 代码如下![图片说明](https://img-ask.csdn.net/upload/201910/21/1571663543_70364.png) ``` from appium import webdriver import time desired_caps ={ 'platformName':'Android', 'udid':'emulator-5554', 'deviceName':'deviceName', 'platformVersion':'5.1.1', 'appPackage':'com.android.contacts', 'appActivity':'.activities.PeopleActivity', 'unicodeKeyboard':True } driver = webdriver.Remote('http://localhost:4723/wd/hub',desired_caps) driver.quit() ``` 请问如何解决 我搜了很久都没有解决, adb devices中有我模拟器的设备
appuim启动魅族手机app报错
报错信息:An unknown server-side error occurred while processing the command. Original error: Failed to launch Appium Settings app: Condition unmet after 5399 ms. Timing out.
使用cmd启动appium报错,使用appium-desktop启动却不报错
环境: * 电脑:win 7 64位 * python 3.5 * PyCharm Community Edition 2017.1.1 x64 * 模拟器:逍遥模拟器 android 5.1.1 * appium -v 1.14.2 * appium-desktop-Setup-1.5.0-ia32.exe * jdk version "1.8.0_05" * nodejs : 10.16.3 以下是代码: ``` from appium import webdriver desired_caps={} desired_caps['platformName']='Android' desired_caps['platformVersion']='5.1.1' desired_caps['deviceName']='127.0.0.1:21503' desired_caps['app']=r'C:\Users\Administrator\Desktop\kaoyan3.1.0.apk' desired_caps['appActivity']='com.tal.kaoyan.ui.activity.SplashActivity' desired_caps['appPackage']='com.tal.kaoyan' desired_caps['noReset']='False' driver=webdriver.Remote('http://localhost:4723/wd/hub',desired_caps) ``` 以cmd启动 appium -a 127.0.0.1 -p 4723,运行pycharm,启动模拟器上APP,报错的信息: selenium.common.exceptions.WebDriverException: Message: An unknown server-side error occurred while processing the command. Original error: Failed to launch Appium Settings app: Condition unmet after 5191 ms. Timing out * 奇怪的是使用appium-desktop-Setup-1.5.0-ia32.exe启动appium,运行pycharm,启动模拟器上APP,却不报错,找不到原因,求大神分析一下!
编写的.launch文件,执行的时候说Found the following, but they're either not files
编写的.launch文件,执行的时候说 ``` Found the following, but they're either not files ``` 然后我设置了权限 chmod 777 talker_listener.launch,不管里面写了什么都是报错: ``` /home/xmy/catkin_ws/src/basic/launch/talker_listener.launch: 行 1: 未预期的符号 `newline' 附近有语法错误 /home/xmy/catkin_ws/src/basic/launch/talker_listener.launch: 行 1: `<launch>' ``` launch问价如下: ``` <launch> <node name="talker" pkg="rospy_tutorials" type="talker.py" output="screen" /> <node name="listener" pkg="rospy_tutorials" type="listener.py" output="screen" /> </launch> ```
appium 测试无法打开 app,请各位大神帮忙
初学appium,使用python写测试脚本,现在可以安装上app,之后无法自动启动app。 这是我的脚本: #coding=utf-8 from appium import webdriver from lib2to3.pgen2.driver import Driver from lib2to3.tests.support import driver import os import time PATH=lambda p:os.path.abspath(os.path.join(os.path.dirname(file),p)) global driver desired_caps = {} desired_caps['platformName'] = 'Android' desired_caps['platformVersion'] = '4.4.2' desired_caps['deviceName'] = 'b91b9b66' #desired_caps['appPackage'] = 'com.zhengyuan.watch' #desired_caps['appActivity'] = 'com.zhengyuan.watch.logic.launch.AppStart' desired_caps['app'] = PATH('D:\android\app\rtring_c_zhengyuan.apk') driver = webdriver.Remote('http://localhost:4723/wd/hub', desired_caps) time.sleep(5) driver.swipe(600,660,10,660,1000) time.sleep(1) driver.swipe(600,660,10,660,1000) time.sleep(1) log: info: --> POST /wd/hub/session {"desiredCapabilities":{"platformVersion":"4.4.2","deviceName":"b91b9b66","app":"D:\android\app\rtring_c_zhengyuan.apk","platformName":"Android"}} info: Client User-Agent string: Python-urllib/2.7 info: [debug] No appActivity desired capability or server param. Parsing from apk. info: [debug] No appPackage desired capability or server param. Parsing from apk. info: [debug] Using local app from desired caps: D:\android\app\rtring_c_zhengyuan.apk info: [debug] Creating new appium session 7ab051a1-8c95-4b9a-a998-f1748ed52d47 info: Starting android appium info: [debug] Getting Java version info: Java version is: 1.7.0_79 info: [debug] Checking whether adb is present info: [debug] Using adb from D:\android\sdk\platform-tools\adb.exe info: [debug] Parsing package and activity from app manifest info: [debug] Checking whether aapt is present info: [debug] Using aapt from D:\android\sdk\build-tools\android-4.4W\aapt.exe info: [debug] Extracting package and launch activity from manifest. info: [debug] executing cmd: D:\android\sdk\build-tools\android-4.4W\aapt.exe dump badging D:\android\app\rtring_c_zhengyuan.apk info: [debug] badging package: com.zhengyuan.watch info: [debug] badging act: com.zhengyuan.watch.logic.launch.AppStart info: [debug] Parsed package and activity are: com.zhengyuan.watch/com.zhengyuan.watch.logic.launch.AppStart info: [debug] Using fast reset? true info: [debug] Preparing device for session info: [debug] Checking whether app is actually present info: Retrieving device info: [debug] Trying to find a connected android device info: [debug] Getting connected devices... info: [debug] executing cmd: D:\android\sdk\platform-tools\adb.exe devices info: [debug] 1 device(s) connected info: Found device b91b9b66 info: [debug] Setting device id to b91b9b66 info: [debug] Waiting for device to be ready and to respond to shell commands (timeout = 5) info: [debug] executing cmd: D:\android\sdk\platform-tools\adb.exe -s b91b9b66 wait-for-device info: [debug] executing cmd: D:\android\sdk\platform-tools\adb.exe -s b91b9b66 shell "echo 'ready'" info: [debug] Starting logcat capture info: [debug] Getting device API level info: [debug] executing cmd: D:\android\sdk\platform-tools\adb.exe -s b91b9b66 shell "getprop ro.build.version.sdk" info: [debug] Device is at API Level 19 info: Device API level is: 19 info: [debug] Extracting strings for language: default info: [debug] executing cmd: D:\android\sdk\platform-tools\adb.exe -s b91b9b66 shell "getprop persist.sys.language" info: [debug] Current device persist.sys.language: zh info: [debug] java -jar "C:\Program Files (x86)\Appium\node_modules\appium\node_modules\appium-adb\jars\appium_apk_tools.jar" "stringsFromApk" "D:\android\app\rtring_c_zhengyuan.apk" "C:\Users\admin\AppData\Local\Temp\com.zhengyuan.watch" zh info: [debug] Reading strings from converted strings.json info: [debug] Setting language to default info: [debug] executing cmd: D:\android\sdk\platform-tools\adb.exe -s b91b9b66 push "C:\Users\admin\AppData\Local\Temp\com.zhengyuan.watch\strings.json" /data/local/tmp info: [debug] Checking whether aapt is present info: [debug] Using aapt from D:\android\sdk\build-tools\android-4.4W\aapt.exe info: [debug] Retrieving process from manifest. info: [debug] executing cmd: D:\android\sdk\build-tools\android-4.4W\aapt.exe dump xmltree D:\android\app\rtring_c_zhengyuan.apk AndroidManifest.xml info: [debug] Set app process to: com.zhengyuan.watch info: [debug] Not uninstalling app since server not started with --full-reset info: [debug] Checking app cert for D:\android\app\rtring_c_zhengyuan.apk. info: [debug] executing cmd: java -jar "C:\Program Files (x86)\Appium\node_modules\appium\node_modules\appium-adb\jars\verify.jar" D:\android\app\rtring_c_zhengyuan.apk info: [debug] App already signed. info: [debug] Zip-aligning D:\android\app\rtring_c_zhengyuan.apk info: [debug] Checking whether zipalign is present info: [debug] Using zipalign from D:\android\sdk\build-tools\android-4.4W\zipalign.exe info: [debug] Zip-aligning apk. info: [debug] executing cmd: D:\android\sdk\build-tools\android-4.4W\zipalign.exe -f 4 D:\android\app\rtring_c_zhengyuan.apk C:\Users\admin\AppData\Local\Temp\116210-428-1fgurq6\appium.tmp info: [debug] MD5 for app is 310a577ec209ceac8a6dee5086a1bf5d info: [debug] executing cmd: D:\android\sdk\platform-tools\adb.exe -s b91b9b66 shell "ls /data/local/tmp/310a577ec209ceac8a6dee5086a1bf5d.apk" info: [debug] Getting install status for com.zhengyuan.watch info: [debug] Getting device API level info: [debug] executing cmd: D:\android\sdk\platform-tools\adb.exe -s b91b9b66 shell "getprop ro.build.version.sdk" info: [debug] Device is at API Level 19 info: [debug] executing cmd: D:\android\sdk\platform-tools\adb.exe -s b91b9b66 shell "pm list packages -3 com.zhengyuan.watch" info: [debug] App is installed info: Installing App info: [debug] executing cmd: D:\android\sdk\platform-tools\adb.exe -s b91b9b66 shell "mkdir -p /data/local/tmp/" info: [debug] Removing any old apks info: [debug] executing cmd: D:\android\sdk\platform-tools\adb.exe -s b91b9b66 shell "ls /data/local/tmp/*.apk" info: [debug] executing cmd: D:\android\sdk\platform-tools\adb.exe -s b91b9b66 shell rm "/data/local/tmp/8f29ab35c86ad03708a23dfe9aaeeaa0.apk" info: [debug] executing cmd: D:\android\sdk\platform-tools\adb.exe -s b91b9b66 push "D:\android\app\rtring_c_zhengyuan.apk" /data/local/tmp/310a577ec209ceac8a6dee5086a1bf5d.apk info: [debug] Uninstalling com.zhengyuan.watch info: [debug] executing cmd: D:\android\sdk\platform-tools\adb.exe -s b91b9b66 shell "am force-stop com.zhengyuan.watch" info: [debug] executing cmd: D:\android\sdk\platform-tools\adb.exe -s b91b9b66 uninstall com.zhengyuan.watch info: [debug] App was uninstalled info: [debug] executing cmd: D:\android\sdk\platform-tools\adb.exe -s b91b9b66 shell "pm install -r /data/local/tmp/310a577ec209ceac8a6dee5086a1bf5d.apk" info: [debug] Forwarding system:4724 to device:4724 info: [debug] executing cmd: D:\android\sdk\platform-tools\adb.exe -s b91b9b66 forward tcp:4724 tcp:4724 info: [debug] Pushing appium bootstrap to device... info: [debug] executing cmd: D:\android\sdk\platform-tools\adb.exe -s b91b9b66 push "C:\Program Files (x86)\Appium\node_modules\appium\build\android_bootstrap\AppiumBootstrap.jar" /data/local/tmp/ info: [debug] Pushing settings apk to device... info: [debug] executing cmd: D:\android\sdk\platform-tools\adb.exe -s b91b9b66 install "C:\Program Files (x86)\Appium\node_modules\appium\build\settings_apk\settings_apk-debug.apk" info: [debug] Pushing unlock helper app to device... info: [debug] executing cmd: D:\android\sdk\platform-tools\adb.exe -s b91b9b66 install "C:\Program Files (x86)\Appium\node_modules\appium\build\unlock_apk\unlock_apk-debug.apk" info: Starting App info: [debug] Attempting to kill all 'uiautomator' processes info: [debug] Getting all processes with 'uiautomator' info: [debug] executing cmd: D:\android\sdk\platform-tools\adb.exe -s b91b9b66 shell "ps 'uiautomator'" info: [debug] Attempting to kill process 31936 info: [debug] executing cmd: D:\android\sdk\platform-tools\adb.exe -s b91b9b66 shell "kill 31936" info: [debug] Running bootstrap info: [debug] spawning: D:\android\sdk\platform-tools\adb.exe -s b91b9b66 shell uiautomator runtest AppiumBootstrap.jar -c io.appium.android.bootstrap.Bootstrap -e pkg com.zhengyuan.watch -e disableAndroidWatchers false info: [debug] [UIAUTOMATOR STDOUT] INSTRUMENTATION_STATUS: numtests=1 info: [debug] [UIAUTOMATOR STDOUT] INSTRUMENTATION_STATUS: stream= info: [debug] [UIAUTOMATOR STDOUT] io.appium.android.bootstrap.Bootstrap: info: [debug] [UIAUTOMATOR STDOUT] INSTRUMENTATION_STATUS: id=UiAutomatorTestRunner info: [debug] [UIAUTOMATOR STDOUT] INSTRUMENTATION_STATUS: test=testRunServer info: [debug] [UIAUTOMATOR STDOUT] INSTRUMENTATION_STATUS: class=io.appium.android.bootstrap.Bootstrap info: [debug] [UIAUTOMATOR STDOUT] INSTRUMENTATION_STATUS: current=1 info: [debug] [UIAUTOMATOR STDOUT] INSTRUMENTATION_STATUS_CODE: 1 info: [debug] [BOOTSTRAP] [debug] Socket opened on port 4724 info: [debug] [BOOTSTRAP] [debug] Appium Socket Server Ready info: [debug] [BOOTSTRAP] [debug] Loading json... error: Unhandled error: Error: getaddrinfo ENOENT at Object.exports.errnoException (util.js:746:11) at errnoException (dns.js:49:15) at GetAddrInfoReqWrap.onlookup as oncomplete context: [POST /wd/hub/session {"desiredCapabilities":{"platformVersion":"4.4.2","deviceName":"b91b9b66","app":"D:\android\app\rtringc_zhengyuan.apk","platformName":"Android"}}] info: [debug] [BOOTSTRAP] [debug] json loading complete. info: [debug] [BOOTSTRAP] [debug] Registered crash watchers. info: <-- POST /wd/hub/session - - ms - - undefined 之后就停住了,请大家帮我看看是什么问题,纠结了好几天了,谢谢大家!
hadoop单词统计报错Job job_1581768459583_0001 failed
3个节点hadoop01、hadoop02、hadoop03 hadoop01是主节点 hadoop01、hadoop02、hadoop03是从节点,目前集群已搭建好,jps查看三个节点运行都很正常,而且UI也能正常显示,但是使用hadoop自带的hadoop-mapreduce-examples-2.7.4.jar的wordcount进行单词统计时报错如下,请高人指点,看不懂呀: ```[root@hadoop01 mapreduce]# hadoop jar hadoop-mapreduce-examples-2.7.4.jar wordcount /wordcount/input /wordcount/output 20/02/15 20:14:25 INFO client.RMProxy: Connecting to ResourceManager at hadoop01/192.168.233.132:8032 20/02/15 20:14:27 INFO input.FileInputFormat: Total input paths to process : 1 20/02/15 20:14:27 INFO mapreduce.JobSubmitter: number of splits:1 20/02/15 20:14:28 INFO mapreduce.JobSubmitter: Submitting tokens for job: job_1581768459583_0001 20/02/15 20:14:28 INFO impl.YarnClientImpl: Submitted application application_1581768459583_0001 20/02/15 20:14:28 INFO mapreduce.Job: The url to track the job: http://hadoop01:8088/proxy/application_1581768459583_0001/ 20/02/15 20:14:28 INFO mapreduce.Job: Running job: job_1581768459583_0001 20/02/15 20:15:38 INFO mapreduce.Job: Job job_1581768459583_0001 running in uber mode : false 20/02/15 20:15:38 INFO mapreduce.Job: map 0% reduce 0% 20/02/15 20:15:38 INFO mapreduce.Job: Job job_1581768459583_0001 failed with state FAILED due to: Application application_1581768459583_0001 failed 2 times due to Error launching appattempt_1581768459583_0001_000002. Got exception: java.io.IOException: Failed on local exception: java.io.IOException: java.io.IOException: Connection reset by peer; Host Details : local host is: "hadoop01.com/79.124.78.101"; destination host is: "79.124.78.101":43276; at org.apache.hadoop.net.NetUtils.wrapException(NetUtils.java:776) at org.apache.hadoop.ipc.Client.call(Client.java:1480) at org.apache.hadoop.ipc.Client.call(Client.java:1413) at org.apache.hadoop.ipc.ProtobufRpcEngine$Invoker.invoke(ProtobufRpcEngine.java:229) at com.sun.proxy.$Proxy83.startContainers(Unknown Source) at org.apache.hadoop.yarn.api.impl.pb.client.ContainerManagementProtocolPBClientImpl.startContainers(ContainerManagementProtocolPBClientImpl.java:96) at sun.reflect.NativeMethodAccessorImpl.invoke0(Native Method) at sun.reflect.NativeMethodAccessorImpl.invoke(NativeMethodAccessorImpl.java:62) at sun.reflect.DelegatingMethodAccessorImpl.invoke(DelegatingMethodAccessorImpl.java:43) at java.lang.reflect.Method.invoke(Method.java:498) at org.apache.hadoop.io.retry.RetryInvocationHandler.invokeMethod(RetryInvocationHandler.java:191) at org.apache.hadoop.io.retry.RetryInvocationHandler.invoke(RetryInvocationHandler.java:102) at com.sun.proxy.$Proxy84.startContainers(Unknown Source) at org.apache.hadoop.yarn.server.resourcemanager.amlauncher.AMLauncher.launch(AMLauncher.java:119) at org.apache.hadoop.yarn.server.resourcemanager.amlauncher.AMLauncher.run(AMLauncher.java:250) at java.util.concurrent.ThreadPoolExecutor.runWorker(ThreadPoolExecutor.java:1149) at java.util.concurrent.ThreadPoolExecutor$Worker.run(ThreadPoolExecutor.java:624) at java.lang.Thread.run(Thread.java:748) Caused by: java.io.IOException: java.io.IOException: Connection reset by peer at org.apache.hadoop.ipc.Client$Connection$1.run(Client.java:688) at java.security.AccessController.doPrivileged(Native Method) at javax.security.auth.Subject.doAs(Subject.java:422) at org.apache.hadoop.security.UserGroupInformation.doAs(UserGroupInformation.java:1746) at org.apache.hadoop.ipc.Client$Connection.handleSaslConnectionFailure(Client.java:651) at org.apache.hadoop.ipc.Client$Connection.setupIOstreams(Client.java:738) at org.apache.hadoop.ipc.Client$Connection.access$2900(Client.java:376) at org.apache.hadoop.ipc.Client.getConnection(Client.java:1529) at org.apache.hadoop.ipc.Client.call(Client.java:1452) ... 16 more Caused by: java.io.IOException: Connection reset by peer at sun.nio.ch.FileDispatcherImpl.read0(Native Method) at sun.nio.ch.SocketDispatcher.read(SocketDispatcher.java:39) at sun.nio.ch.IOUtil.readIntoNativeBuffer(IOUtil.java:223) at sun.nio.ch.IOUtil.read(IOUtil.java:197) at sun.nio.ch.SocketChannelImpl.read(SocketChannelImpl.java:380) at org.apache.hadoop.net.SocketInputStream$Reader.performIO(SocketInputStream.java:57) at org.apache.hadoop.net.SocketIOWithTimeout.doIO(SocketIOWithTimeout.java:142) at org.apache.hadoop.net.SocketInputStream.read(SocketInputStream.java:161) at org.apache.hadoop.net.SocketInputStream.read(SocketInputStream.java:131) at java.io.FilterInputStream.read(FilterInputStream.java:133) at java.io.BufferedInputStream.fill(BufferedInputStream.java:246) at java.io.BufferedInputStream.read(BufferedInputStream.java:265) at java.io.DataInputStream.readInt(DataInputStream.java:387) at org.apache.hadoop.security.SaslRpcClient.saslConnect(SaslRpcClient.java:367) at org.apache.hadoop.ipc.Client$Connection.setupSaslConnection(Client.java:561) at org.apache.hadoop.ipc.Client$Connection.access$1900(Client.java:376) at org.apache.hadoop.ipc.Client$Connection$2.run(Client.java:730) at org.apache.hadoop.ipc.Client$Connection$2.run(Client.java:726) at java.security.AccessController.doPrivileged(Native Method) at javax.security.auth.Subject.doAs(Subject.java:422) at org.apache.hadoop.security.UserGroupInformation.doAs(UserGroupInformation.java:1746) at org.apache.hadoop.ipc.Client$Connection.setupIOstreams(Client.java:726) ... 19 more . Failing the application. 20/02/15 20:15:38 INFO mapreduce.Job: Counters: 0 ```
maven配置私服打包报错Failed to execute goal org.apache.maven.plugins:maven-compiler-plugin:3.5:compile
直接使用阿里云镜像仓库打包没问题,替换为私服镜像仓库后报错: 就是pom.xml中的plugin报错 ``` <plugin> <groupId>org.apache.maven.plugins</groupId> <artifactId>maven-compiler-plugin</artifactId> <version>3.5</version> <configuration> <source>1.8</source> <target>1.8</target> <encoding>UTF-8</encoding> </configuration> </plugin> ``` 网上找了半天说这个指定的jdk版本的问题,查了一下版本没问题都是1.8 报错内容: [ERROR] Failed to execute goal org.apache.maven.plugins:maven-compiler-plugin:3.5:compile (default-compile) on project mytest-web: Execution default-compile of goal org.apache.maven.plugins:maven-compiler-plugin:3.5:compile failed: Plugin org.apache.maven.plugins:maven-compiler-plugin:3.5 or one of its dependencies could not be resolved: Failed to collect dependencies at org.apache.maven.plugins:maven-compiler-plugin:jar:3.5 -> org.apache.maven:maven-toolchain:jar:2.2.1 -> org.apache.maven:maven-core:jar:2.2.1 -> commons-cli:commons-cli:jar:1.2: Failed to read artifact descriptor for commons-cli:commons-cli:jar:1.2: Failure to find org.apache:apache:pom:4 in http://localhost:8081/nexus/content/groups/public/ was cached in the local repository, resolution will not be reattempted until the update interval of public has elapsed or updates are forced -> [Help 1] org.apache.maven.lifecycle.LifecycleExecutionException: Failed to execute goal org.apache.maven.plugins:maven-compiler-plugin:3.5:compile (default-compile) on project mytest-web: Execution default-compile of goal org.apache.maven.plugins:maven-compiler-plugin:3.5:compile failed: Plugin org.apache.maven.plugins:maven-compiler-plugin:3.5 or one of its dependencies could not be resolved: Failed to collect dependencies at org.apache.maven.plugins:maven-compiler-plugin:jar:3.5 -> org.apache.maven:maven-toolchain:jar:2.2.1 -> org.apache.maven:maven-core:jar:2.2.1 -> commons-cli:commons-cli:jar:1.2 at org.apache.maven.lifecycle.internal.MojoExecutor.execute(MojoExecutor.java:213) at org.apache.maven.lifecycle.internal.MojoExecutor.execute(MojoExecutor.java:154) at org.apache.maven.lifecycle.internal.MojoExecutor.execute(MojoExecutor.java:146) at org.apache.maven.lifecycle.internal.LifecycleModuleBuilder.buildProject(LifecycleModuleBuilder.java:117) at org.apache.maven.lifecycle.internal.LifecycleModuleBuilder.buildProject(LifecycleModuleBuilder.java:81) at org.apache.maven.lifecycle.internal.builder.singlethreaded.SingleThreadedBuilder.build(SingleThreadedBuilder.java:51) at org.apache.maven.lifecycle.internal.LifecycleStarter.execute(LifecycleStarter.java:128) at org.apache.maven.DefaultMaven.doExecute(DefaultMaven.java:309) at org.apache.maven.DefaultMaven.doExecute(DefaultMaven.java:194) at org.apache.maven.DefaultMaven.execute(DefaultMaven.java:107) at org.apache.maven.cli.MavenCli.execute(MavenCli.java:993) at org.apache.maven.cli.MavenCli.doMain(MavenCli.java:345) at org.apache.maven.cli.MavenCli.main(MavenCli.java:191) at sun.reflect.NativeMethodAccessorImpl.invoke0(Native Method) at sun.reflect.NativeMethodAccessorImpl.invoke(NativeMethodAccessorImpl.java:62) at sun.reflect.DelegatingMethodAccessorImpl.invoke(DelegatingMethodAccessorImpl.java:43) at java.lang.reflect.Method.invoke(Method.java:498) at org.codehaus.plexus.classworlds.launcher.Launcher.launchEnhanced(Launcher.java:289) at org.codehaus.plexus.classworlds.launcher.Launcher.launch(Launcher.java:229) at org.codehaus.plexus.classworlds.launcher.Launcher.mainWithExitCode(Launcher.java:415) at org.codehaus.plexus.classworlds.launcher.Launcher.main(Launcher.java:356) Caused by: org.apache.maven.plugin.PluginExecutionException: Execution default-compile of goal org.apache.maven.plugins:maven-compiler-plugin:3.5:compile failed: Plugin org.apache.maven.plugins:maven-compiler-plugin:3.5 or one of its dependencies could not be resolved: Failed to collect dependencies at org.apache.maven.plugins:maven-compiler-plugin:jar:3.5 -> org.apache.maven:maven-toolchain:jar:2.2.1 -> org.apache.maven:maven-core:jar:2.2.1 -> commons-cli:commons-cli:jar:1.2 at org.apache.maven.plugin.DefaultBuildPluginManager.executeMojo(DefaultBuildPluginManager.java:106) at org.apache.maven.lifecycle.internal.MojoExecutor.execute(MojoExecutor.java:208) ... 20 more Caused by: org.apache.maven.plugin.PluginResolutionException: Plugin org.apache.maven.plugins:maven-compiler-plugin:3.5 or one of its dependencies could not be resolved: Failed to collect dependencies at org.apache.maven.plugins:maven-compiler-plugin:jar:3.5 -> org.apache.maven:maven-toolchain:jar:2.2.1 -> org.apache.maven:maven-core:jar:2.2.1 -> commons-cli:commons-cli:jar:1.2 at org.apache.maven.plugin.internal.DefaultPluginDependenciesResolver.resolveInternal(DefaultPluginDependenciesResolver.java:214) at org.apache.maven.plugin.internal.DefaultPluginDependenciesResolver.resolve(DefaultPluginDependenciesResolver.java:149) at org.apache.maven.plugin.internal.DefaultMavenPluginManager.createPluginRealm(DefaultMavenPluginManager.java:402) at org.apache.maven.plugin.internal.DefaultMavenPluginManager.setupPluginRealm(DefaultMavenPluginManager.java:374) at org.apache.maven.plugin.DefaultBuildPluginManager.getPluginRealm(DefaultBuildPluginManager.java:231) at org.apache.maven.plugin.DefaultBuildPluginManager.executeMojo(DefaultBuildPluginManager.java:102) ... 21 more Caused by: org.eclipse.aether.collection.DependencyCollectionException: Failed to collect dependencies at org.apache.maven.plugins:maven-compiler-plugin:jar:3.5 -> org.apache.maven:maven-toolchain:jar:2.2.1 -> org.apache.maven:maven-core:jar:2.2.1 -> commons-cli:commons-cli:jar:1.2 at org.eclipse.aether.internal.impl.DefaultDependencyCollector.collectDependencies(DefaultDependencyCollector.java:300) at org.eclipse.aether.internal.impl.DefaultRepositorySystem.collectDependencies(DefaultRepositorySystem.java:325) at org.apache.maven.plugin.internal.DefaultPluginDependenciesResolver.resolveInternal(DefaultPluginDependenciesResolver.java:202) ... 26 more Caused by: org.eclipse.aether.resolution.ArtifactDescriptorException: Failed to read artifact descriptor for commons-cli:commons-cli:jar:1.2 at org.apache.maven.repository.internal.DefaultArtifactDescriptorReader.loadPom(DefaultArtifactDescriptorReader.java:330) at org.apache.maven.repository.internal.DefaultArtifactDescriptorReader.readArtifactDescriptor(DefaultArtifactDescriptorReader.java:199) at org.eclipse.aether.internal.impl.DefaultDependencyCollector.resolveCachedArtifactDescriptor(DefaultDependencyCollector.java:544) at org.eclipse.aether.internal.impl.DefaultDependencyCollector.getArtifactDescriptorResult(DefaultDependencyCollector.java:528) at org.eclipse.aether.internal.impl.DefaultDependencyCollector.processDependency(DefaultDependencyCollector.java:418) at org.eclipse.aether.internal.impl.DefaultDependencyCollector.processDependency(DefaultDependencyCollector.java:372) at org.eclipse.aether.internal.impl.DefaultDependencyCollector.process(DefaultDependencyCollector.java:360) at org.eclipse.aether.internal.impl.DefaultDependencyCollector.doRecurse(DefaultDependencyCollector.java:513) at org.eclipse.aether.internal.impl.DefaultDependencyCollector.processDependency(DefaultDependencyCollector.java:467) at org.eclipse.aether.internal.impl.DefaultDependencyCollector.processDependency(DefaultDependencyCollector.java:372) at org.eclipse.aether.internal.impl.DefaultDependencyCollector.process(DefaultDependencyCollector.java:360) at org.eclipse.aether.internal.impl.DefaultDependencyCollector.doRecurse(DefaultDependencyCollector.java:513) at org.eclipse.aether.internal.impl.DefaultDependencyCollector.processDependency(DefaultDependencyCollector.java:467) at org.eclipse.aether.internal.impl.DefaultDependencyCollector.processDependency(DefaultDependencyCollector.java:372) at org.eclipse.aether.internal.impl.DefaultDependencyCollector.process(DefaultDependencyCollector.java:360) at org.eclipse.aether.internal.impl.DefaultDependencyCollector.collectDependencies(DefaultDependencyCollector.java:263) ... 28 more Caused by: org.apache.maven.model.resolution.UnresolvableModelException: Failure to find org.apache:apache:pom:4 in http://localhost:8081/nexus/content/groups/public/ was cached in the local repository, resolution will not be reattempted until the update interval of public has elapsed or updates are forced at org.apache.maven.repository.internal.DefaultModelResolver.resolveModel(DefaultModelResolver.java:178) at org.apache.maven.repository.internal.DefaultModelResolver.resolveModel(DefaultModelResolver.java:224) at org.apache.maven.model.building.DefaultModelBuilder.readParentExternally(DefaultModelBuilder.java:1051) at org.apache.maven.model.building.DefaultModelBuilder.readParent(DefaultModelBuilder.java:829) at org.apache.maven.model.building.DefaultModelBuilder.build(DefaultModelBuilder.java:331) at org.apache.maven.repository.internal.DefaultArtifactDescriptorReader.loadPom(DefaultArtifactDescriptorReader.java:321) ... 43 more Caused by: org.eclipse.aether.resolution.ArtifactResolutionException: Failure to find org.apache:apache:pom:4 in http://localhost:8081/nexus/content/groups/public/ was cached in the local repository, resolution will not be reattempted until the update interval of public has elapsed or updates are forced at org.eclipse.aether.internal.impl.DefaultArtifactResolver.resolve(DefaultArtifactResolver.java:453) at org.eclipse.aether.internal.impl.DefaultArtifactResolver.resolveArtifacts(DefaultArtifactResolver.java:255) at org.eclipse.aether.internal.impl.DefaultArtifactResolver.resolveArtifact(DefaultArtifactResolver.java:232) at org.apache.maven.repository.internal.DefaultModelResolver.resolveModel(DefaultModelResolver.java:174) ... 48 more Caused by: org.eclipse.aether.transfer.ArtifactNotFoundException: Failure to find org.apache:apache:pom:4 in http://localhost:8081/nexus/content/groups/public/ was cached in the local repository, resolution will not be reattempted until the update interval of public has elapsed or updates are forced at org.eclipse.aether.internal.impl.DefaultUpdateCheckManager.newException(DefaultUpdateCheckManager.java:240) at org.eclipse.aether.internal.impl.DefaultUpdateCheckManager.checkArtifact(DefaultUpdateCheckManager.java:215) at org.eclipse.aether.internal.impl.DefaultArtifactResolver.gatherDownloads(DefaultArtifactResolver.java:594) at org.eclipse.aether.internal.impl.DefaultArtifactResolver.performDownloads(DefaultArtifactResolver.java:512) at org.eclipse.aether.internal.impl.DefaultArtifactResolver.resolve(DefaultArtifactResolver.java:430) ... 51 more [ERROR] [ERROR] Re-run Maven using the -X switch to enable full debug logging. [ERROR] [ERROR] For more information about the errors and possible solutions, please read the following articles: [ERROR] [Help 1] http://cwiki.apache.org/confluence/display/MAVEN/PluginResolutionException
warning: GDB: Failed to set controlling terminal
Codeblocks 13.12出现 warning: GDB: Failed to set controlling terminal: Operation not permitted". gdb调试程序出现,上述提醒,不能进行调试,断点设置也没用 ,已将terminal to launch console programs 设置为gnome-terminal-t $TITLE-x 请哪位大神帮忙解决??????????
gstreamer,gst-launch使用过程中的一些问题
平台:DIGI 的imx6ulsbc 摄像头:ov5642 想通过gstreamer编码抓到的图片,执行如下命令 ``` gst-launch-1.0 imxv4l2src device=/dev/video1 num-buffers=1 ! video/x-raw,width=1920,height=1080,framerate=15/1 ! jpegenc ! filesink location=frame.jpg ``` 问题如下 1.无法正常获取图片 ![图片说明](https://img-ask.csdn.net/upload/202002/12/1581467430_891226.jpg) 2.framerate是什么作用,如果还想进行灰度之类的处理该怎么做 3.图片尺寸只有特定几个可以使用,否则直接报 can't handle caps
kotlin 协程结合ViewModel使用的一个问题
就是这段代码,我想问下这里面是不是用了block语法,,可是定义CoroutineScope.()是什么意思??? 求大佬告知,非常感谢啊 fun launchUI(block: suspend CoroutineScope.() -> Unit) = viewModelScope.launch { block() }
openstack启动实例报错No valid host was found
计算节点的nova错误日志: ``` 2020-02-11 17:05:07.817 1295 ERROR nova.virt.libvirt.guest [req-740339df-c3c4-450b-9787-9c7336c461a3 a7756266208f439bbb8324fb22853932 e7af6fe8f68647ab8010beaa7cb440ed - - -] Error launching a defined domain with XML: <domain type='kvm'> 2020-02-11 17:05:07.818 1295 ERROR nova.compute.manager [req-740339df-c3c4-450b-9787-9c7336c461a3 a7756266208f439bbb8324fb22853932 e7af6fe8f68647ab8010beaa7cb440ed - - -] [instance: 8020d30b-33ec-4836-8f61-f23516aa2508] Instance failed to spawn 2020-02-11 17:05:07.818 1295 ERROR nova.compute.manager [instance: 8020d30b-33ec-4836-8f61-f23516aa2508] Traceback (most recent call last): 2020-02-11 17:05:07.818 1295 ERROR nova.compute.manager [instance: 8020d30b-33ec-4836-8f61-f23516aa2508] File "/usr/lib/python2.7/site-packages/nova/compute/manager.py", line 2229, in _build_resources 2020-02-11 17:05:07.818 1295 ERROR nova.compute.manager [instance: 8020d30b-33ec-4836-8f61-f23516aa2508] yield resources 2020-02-11 17:05:07.818 1295 ERROR nova.compute.manager [instance: 8020d30b-33ec-4836-8f61-f23516aa2508] File "/usr/lib/python2.7/site-packages/nova/compute/manager.py", line 2075, in _build_and_run_instance 2020-02-11 17:05:07.818 1295 ERROR nova.compute.manager [instance: 8020d30b-33ec-4836-8f61-f23516aa2508] block_device_info=block_device_info) 2020-02-11 17:05:07.818 1295 ERROR nova.compute.manager [instance: 8020d30b-33ec-4836-8f61-f23516aa2508] File "/usr/lib/python2.7/site-packages/nova/virt/libvirt/driver.py", line 2779, in spawn 2020-02-11 17:05:07.818 1295 ERROR nova.compute.manager [instance: 8020d30b-33ec-4836-8f61-f23516aa2508] block_device_info=block_device_info) 2020-02-11 17:05:07.818 1295 ERROR nova.compute.manager [instance: 8020d30b-33ec-4836-8f61-f23516aa2508] File "/usr/lib/python2.7/site-packages/nova/virt/libvirt/driver.py", line 4923, in _create_domain_and_network 2020-02-11 17:05:07.818 1295 ERROR nova.compute.manager [instance: 8020d30b-33ec-4836-8f61-f23516aa2508] xml, pause=pause, power_on=power_on) 2020-02-11 17:05:07.818 1295 ERROR nova.compute.manager [instance: 8020d30b-33ec-4836-8f61-f23516aa2508] File "/usr/lib/python2.7/site-packages/nova/virt/libvirt/driver.py", line 4854, in _create_domain 2020-02-11 17:05:07.818 1295 ERROR nova.compute.manager [instance: 8020d30b-33ec-4836-8f61-f23516aa2508] guest.launch(pause=pause) 2020-02-11 17:05:07.818 1295 ERROR nova.compute.manager [instance: 8020d30b-33ec-4836-8f61-f23516aa2508] File "/usr/lib/python2.7/site-packages/nova/virt/libvirt/guest.py", line 142, in launch 2020-02-11 17:05:07.818 1295 ERROR nova.compute.manager [instance: 8020d30b-33ec-4836-8f61-f23516aa2508] self._encoded_xml, errors='ignore') 2020-02-11 17:05:07.818 1295 ERROR nova.compute.manager [instance: 8020d30b-33ec-4836-8f61-f23516aa2508] File "/usr/lib/python2.7/site-packages/oslo_utils/excutils.py", line 220, in __exit__ 2020-02-11 17:05:07.818 1295 ERROR nova.compute.manager [instance: 8020d30b-33ec-4836-8f61-f23516aa2508] self.force_reraise() 2020-02-11 17:05:07.818 1295 ERROR nova.compute.manager [instance: 8020d30b-33ec-4836-8f61-f23516aa2508] File "/usr/lib/python2.7/site-packages/oslo_utils/excutils.py", line 196, in force_reraise 2020-02-11 17:05:07.818 1295 ERROR nova.compute.manager [instance: 8020d30b-33ec-4836-8f61-f23516aa2508] six.reraise(self.type_, self.value, self.tb) 2020-02-11 17:05:07.818 1295 ERROR nova.compute.manager [instance: 8020d30b-33ec-4836-8f61-f23516aa2508] File "/usr/lib/python2.7/site-packages/nova/virt/libvirt/guest.py", line 137, in launch 2020-02-11 17:05:07.818 1295 ERROR nova.compute.manager [instance: 8020d30b-33ec-4836-8f61-f23516aa2508] return self._domain.createWithFlags(flags) 2020-02-11 17:05:07.818 1295 ERROR nova.compute.manager [instance: 8020d30b-33ec-4836-8f61-f23516aa2508] File "/usr/lib/python2.7/site-packages/eventlet/tpool.py", line 186, in doit 2020-02-11 17:05:07.818 1295 ERROR nova.compute.manager [instance: 8020d30b-33ec-4836-8f61-f23516aa2508] result = proxy_call(self._autowrap, f, *args, **kwargs) 2020-02-11 17:05:07.818 1295 ERROR nova.compute.manager [instance: 8020d30b-33ec-4836-8f61-f23516aa2508] File "/usr/lib/python2.7/site-packages/eventlet/tpool.py", line 144, in proxy_call 2020-02-11 17:05:07.818 1295 ERROR nova.compute.manager [instance: 8020d30b-33ec-4836-8f61-f23516aa2508] rv = execute(f, *args, **kwargs) 2020-02-11 17:05:07.818 1295 ERROR nova.compute.manager [instance: 8020d30b-33ec-4836-8f61-f23516aa2508] File "/usr/lib/python2.7/site-packages/eventlet/tpool.py", line 125, in execute 2020-02-11 17:05:07.818 1295 ERROR nova.compute.manager [instance: 8020d30b-33ec-4836-8f61-f23516aa2508] six.reraise(c, e, tb) 2020-02-11 17:05:07.818 1295 ERROR nova.compute.manager [instance: 8020d30b-33ec-4836-8f61-f23516aa2508] File "/usr/lib/python2.7/site-packages/eventlet/tpool.py", line 83, in tworker 2020-02-11 17:05:07.818 1295 ERROR nova.compute.manager [instance: 8020d30b-33ec-4836-8f61-f23516aa2508] rv = meth(*args, **kwargs) 2020-02-11 17:05:07.818 1295 ERROR nova.compute.manager [instance: 8020d30b-33ec-4836-8f61-f23516aa2508] File "/usr/lib64/python2.7/site-packages/libvirt.py", line 1110, in createWithFlags 2020-02-11 17:05:07.818 1295 ERROR nova.compute.manager [instance: 8020d30b-33ec-4836-8f61-f23516aa2508] if ret == -1: raise libvirtError ('virDomainCreateWithFlags() failed', dom=self) 2020-02-11 17:05:07.818 1295 ERROR nova.compute.manager [instance: 8020d30b-33ec-4836-8f61-f23516aa2508] libvirtError: internal error: process exited while connecting to monitor: 2020-02-11T09:05:07.623239Z qemu-kvm: -drive file=/var/lib/nova/instances/8020d30b-33ec-4836-8f61-f23516aa2508/disk,format=qcow2,if=none,id=drive-virtio-disk0,cache=none: Could not open '/var/lib/nova/instances/8020d30b-33ec-4836-8f61-f23516aa2508/disk': Permission denied 2020-02-11 17:05:07.818 1295 ERROR nova.compute.manager [instance: 8020d30b-33ec-4836-8f61-f23516aa2508] ``` 控制节点的nova-conductor.log ``` 2020-02-11 17:05:08.365 958 ERROR nova.scheduler.utils [req-740339df-c3c4-450b-9787-9c7336c461a3 a7756266208f439bbb8324fb22853932 e7af6fe8f68647ab8010beaa7cb440ed - - -] [instance: 8020d30b-33ec-4836-8f61-f23516aa2508] Error from last host: compute (node compute): [u'Traceback (most recent call last):\n', u' File "/usr/lib/python2.7/site-packages/nova/compute/manager.py", line 1937, in _do_build_and_run_instance\n filter_properties)\n', u' File "/usr/lib/python2.7/site-packages/nova/compute/manager.py", line 2127, in _build_and_run_instance\n instance_uuid=instance.uuid, reason=six.text_type(e))\n', u"RescheduledException: Build of instance 8020d30b-33ec-4836-8f61-f23516aa2508 was re-scheduled: internal error: process exited while connecting to monitor: 2020-02-11T09:05:07.623239Z qemu-kvm: -drive file=/var/lib/nova/instances/8020d30b-33ec-4836-8f61-f23516aa2508/disk,format=qcow2,if=none,id=drive-virtio-disk0,cache=none: Could not open '/var/lib/nova/instances/8020d30b-33ec-4836-8f61-f23516aa2508/disk': Permission denied\n"] 2020-02-11 17:05:08.450 958 WARNING nova.scheduler.utils [req-740339df-c3c4-450b-9787-9c7336c461a3 a7756266208f439bbb8324fb22853932 e7af6fe8f68647ab8010beaa7cb440ed - - -] [instance: 8020d30b-33ec-4836-8f61-f23516aa2508] Setting instance to ERROR state. ``` dashboard上报错 ![图片说明](https://img-ask.csdn.net/upload/202002/11/1581412785_788625.png) ![图片说明](https://img-ask.csdn.net/upload/202002/11/1581413291_261638.png) 我的网络配置是 ![图片说明](https://img-ask.csdn.net/upload/202002/11/1581412842_430142.png) ![图片说明](https://img-ask.csdn.net/upload/202002/11/1581412854_59896.png) 不知道有没有路过的大师指导这是什么原因啊,在网上找了好多方法没有解决。万分感谢!
turtlebot2导航输入roslaunch kinect2_nav.launch报错unable to set parameters(last param was[move_base/recovery_behavior_enabled=false])请问应该怎么办
使用turtlebot2和kinect2相机做机器人导航的时候输入roslaunch kinect2_nav.launch之后报了下面这个错误,应该怎么解决呢? ![图片说明](https://img-ask.csdn.net/upload/202001/31/1580464373_781057.jpg)
openstack创建实例成功但是启动实例报错
以下是nova报错详情: ``` /var/log/nova/nova-compute.log:2020-02-11 08:43:18.893 1327 ERROR nova.virt.libvirt.guest [req-ecfa9ec9-82fd-42dd-838f-ff5938af32e7 a7756266208f439bbb8324fb22853932 e7af6fe8f68647ab8010beaa7cb440ed - - -] Error launching a defined domain with XML: <domain type='kvm'> /var/log/nova/nova-compute.log:2020-02-11 08:43:18.895 1327 ERROR nova.compute.manager [req-ecfa9ec9-82fd-42dd-838f-ff5938af32e7 a7756266208f439bbb8324fb22853932 e7af6fe8f68647ab8010beaa7cb440ed - - -] [instance: a26fb462-a721-45eb-8eaa-776ec5da3b23] Instance failed to spawn /var/log/nova/nova-compute.log:2020-02-11 08:43:18.895 1327 ERROR nova.compute.manager [instance: a26fb462-a721-45eb-8eaa-776ec5da3b23] Traceback (most recent call last): /var/log/nova/nova-compute.log:2020-02-11 08:43:18.895 1327 ERROR nova.compute.manager [instance: a26fb462-a721-45eb-8eaa-776ec5da3b23] File "/usr/lib/python2.7/site-packages/nova/compute/manager.py", line 2218, in _build_resources /var/log/nova/nova-compute.log:2020-02-11 08:43:18.895 1327 ERROR nova.compute.manager [instance: a26fb462-a721-45eb-8eaa-776ec5da3b23] except Exception: /var/log/nova/nova-compute.log:2020-02-11 08:43:18.895 1327 ERROR nova.compute.manager [instance: a26fb462-a721-45eb-8eaa-776ec5da3b23] File "/usr/lib/python2.7/site-packages/nova/compute/manager.py", line 2064, in _build_and_run_instance /var/log/nova/nova-compute.log:2020-02-11 08:43:18.895 1327 ERROR nova.compute.manager [instance: a26fb462-a721-45eb-8eaa-776ec5da3b23] # saved in that function to prevent races. /var/log/nova/nova-compute.log:2020-02-11 08:43:18.895 1327 ERROR nova.compute.manager [instance: a26fb462-a721-45eb-8eaa-776ec5da3b23] File "/usr/lib/python2.7/site-packages/nova/virt/libvirt/driver.py", line 2779, in spawn /var/log/nova/nova-compute.log:2020-02-11 08:43:18.895 1327 ERROR nova.compute.manager [instance: a26fb462-a721-45eb-8eaa-776ec5da3b23] block_device_info=block_device_info) /var/log/nova/nova-compute.log:2020-02-11 08:43:18.895 1327 ERROR nova.compute.manager [instance: a26fb462-a721-45eb-8eaa-776ec5da3b23] File "/usr/lib/python2.7/site-packages/nova/virt/libvirt/driver.py", line 4923, in _create_domain_and_network /var/log/nova/nova-compute.log:2020-02-11 08:43:18.895 1327 ERROR nova.compute.manager [instance: a26fb462-a721-45eb-8eaa-776ec5da3b23] xml, pause=pause, power_on=power_on) /var/log/nova/nova-compute.log:2020-02-11 08:43:18.895 1327 ERROR nova.compute.manager [instance: a26fb462-a721-45eb-8eaa-776ec5da3b23] File "/usr/lib/python2.7/site-packages/nova/virt/libvirt/driver.py", line 4854, in _create_domain /var/log/nova/nova-compute.log:2020-02-11 08:43:18.895 1327 ERROR nova.compute.manager [instance: a26fb462-a721-45eb-8eaa-776ec5da3b23] guest.launch(pause=pause) /var/log/nova/nova-compute.log:2020-02-11 08:43:18.895 1327 ERROR nova.compute.manager [instance: a26fb462-a721-45eb-8eaa-776ec5da3b23] File "/usr/lib/python2.7/site-packages/nova/virt/libvirt/guest.py", line 142, in launch /var/log/nova/nova-compute.log:2020-02-11 08:43:18.895 1327 ERROR nova.compute.manager [instance: a26fb462-a721-45eb-8eaa-776ec5da3b23] self._encoded_xml, errors='ignore') /var/log/nova/nova-compute.log:2020-02-11 08:43:18.895 1327 ERROR nova.compute.manager [instance: a26fb462-a721-45eb-8eaa-776ec5da3b23] File "/usr/lib/python2.7/site-packages/oslo_utils/excutils.py", line 220, in __exit__ /var/log/nova/nova-compute.log:2020-02-11 08:43:18.895 1327 ERROR nova.compute.manager [instance: a26fb462-a721-45eb-8eaa-776ec5da3b23] self.force_reraise() /var/log/nova/nova-compute.log:2020-02-11 08:43:18.895 1327 ERROR nova.compute.manager [instance: a26fb462-a721-45eb-8eaa-776ec5da3b23] File "/usr/lib/python2.7/site-packages/oslo_utils/excutils.py", line 196, in force_reraise /var/log/nova/nova-compute.log:2020-02-11 08:43:18.895 1327 ERROR nova.compute.manager [instance: a26fb462-a721-45eb-8eaa-776ec5da3b23] six.reraise(self.type_, self.value, self.tb) /var/log/nova/nova-compute.log:2020-02-11 08:43:18.895 1327 ERROR nova.compute.manager [instance: a26fb462-a721-45eb-8eaa-776ec5da3b23] File "/usr/lib/python2.7/site-packages/nova/virt/libvirt/guest.py", line 137, in launch /var/log/nova/nova-compute.log:2020-02-11 08:43:18.895 1327 ERROR nova.compute.manager [instance: a26fb462-a721-45eb-8eaa-776ec5da3b23] return self._domain.createWithFlags(flags) /var/log/nova/nova-compute.log:2020-02-11 08:43:18.895 1327 ERROR nova.compute.manager [instance: a26fb462-a721-45eb-8eaa-776ec5da3b23] File "/usr/lib/python2.7/site-packages/eventlet/tpool.py", line 186, in doit /var/log/nova/nova-compute.log:2020-02-11 08:43:18.895 1327 ERROR nova.compute.manager [instance: a26fb462-a721-45eb-8eaa-776ec5da3b23] result = proxy_call(self._autowrap, f, *args, **kwargs) /var/log/nova/nova-compute.log:2020-02-11 08:43:18.895 1327 ERROR nova.compute.manager [instance: a26fb462-a721-45eb-8eaa-776ec5da3b23] File "/usr/lib/python2.7/site-packages/eventlet/tpool.py", line 144, in proxy_call /var/log/nova/nova-compute.log:2020-02-11 08:43:18.895 1327 ERROR nova.compute.manager [instance: a26fb462-a721-45eb-8eaa-776ec5da3b23] rv = execute(f, *args, **kwargs) /var/log/nova/nova-compute.log:2020-02-11 08:43:18.895 1327 ERROR nova.compute.manager [instance: a26fb462-a721-45eb-8eaa-776ec5da3b23] File "/usr/lib/python2.7/site-packages/eventlet/tpool.py", line 125, in execute /var/log/nova/nova-compute.log:2020-02-11 08:43:18.895 1327 ERROR nova.compute.manager [instance: a26fb462-a721-45eb-8eaa-776ec5da3b23] six.reraise(c, e, tb) /var/log/nova/nova-compute.log:2020-02-11 08:43:18.895 1327 ERROR nova.compute.manager [instance: a26fb462-a721-45eb-8eaa-776ec5da3b23] File "/usr/lib/python2.7/site-packages/eventlet/tpool.py", line 83, in tworker /var/log/nova/nova-compute.log:2020-02-11 08:43:18.895 1327 ERROR nova.compute.manager [instance: a26fb462-a721-45eb-8eaa-776ec5da3b23] rv = meth(*args, **kwargs) /var/log/nova/nova-compute.log:2020-02-11 08:43:18.895 1327 ERROR nova.compute.manager [instance: a26fb462-a721-45eb-8eaa-776ec5da3b23] File "/usr/lib64/python2.7/site-packages/libvirt.py", line 1110, in createWithFlags /var/log/nova/nova-compute.log:2020-02-11 08:43:18.895 1327 ERROR nova.compute.manager [instance: a26fb462-a721-45eb-8eaa-776ec5da3b23] if ret == -1: raise libvirtError ('virDomainCreateWithFlags() failed', dom=self) /var/log/nova/nova-compute.log:2020-02-11 08:43:18.895 1327 ERROR nova.compute.manager [instance: a26fb462-a721-45eb-8eaa-776ec5da3b23] libvirtError: 内部错误:qemu unexpectedly closed the monitor: 2020-02-11T00:43:18.668387Z qemu-kvm: -drive file=/var/lib/nova/instances/a26fb462-a721-45eb-8eaa-776ec5da3b23/disk,format=qcow2,if=none,id=drive-virtio-disk0,cache=none: Could not open '/var/lib/nova/instances/a26fb462-a721-45eb-8eaa-776ec5da3b23/disk': Permission denied /var/log/nova/nova-compute.log:2020-02-11 08:43:18.895 1327 ERROR nova.compute.manager [instance: a26fb462-a721-45eb-8eaa-776ec5da3b23] /var/log/nova/nova-compute.log:2020-02-11 08:43:19.145 1327 ERROR nova.compute.manager [req-ecfa9ec9-82fd-42dd-838f-ff5938af32e7 a7756266208f439bbb8324fb22853932 e7af6fe8f68647ab8010beaa7cb440ed - - -] [instance: a26fb462-a721-45eb-8eaa-776ec5da3b23] Unexpected build failure, not rescheduling build. /var/log/nova/nova-compute.log:2020-02-11 08:43:19.145 1327 ERROR nova.compute.manager [instance: a26fb462-a721-45eb-8eaa-776ec5da3b23] Traceback (most recent call last): /var/log/nova/nova-compute.log:2020-02-11 08:43:19.145 1327 ERROR nova.compute.manager [instance: a26fb462-a721-45eb-8eaa-776ec5da3b23] File "/usr/lib/python2.7/site-packages/nova/compute/manager.py", line 1926, in _do_build_and_run_instance /var/log/nova/nova-compute.log:2020-02-11 08:43:19.145 1327 ERROR nova.compute.manager [instance: a26fb462-a721-45eb-8eaa-776ec5da3b23] /var/log/nova/nova-compute.log:2020-02-11 08:43:19.145 1327 ERROR nova.compute.manager [instance: a26fb462-a721-45eb-8eaa-776ec5da3b23] File "/usr/lib/python2.7/site-packages/nova/compute/manager.py", line 2116, in _build_and_run_instance /var/log/nova/nova-compute.log:2020-02-11 08:43:19.145 1327 ERROR nova.compute.manager [instance: a26fb462-a721-45eb-8eaa-776ec5da3b23] exception.ImageNotActive, /var/log/nova/nova-compute.log:2020-02-11 08:43:19.145 1327 ERROR nova.compute.manager [instance: a26fb462-a721-45eb-8eaa-776ec5da3b23] UnicodeDecodeError: 'ascii' codec can't decode byte 0xe5 in position 0: ordinal not in range(128) /var/log/nova/nova-compute.log:2020-02-11 08:43:19.145 1327 ERROR nova.compute.manager [instance: a26fb462-a721-45eb-8eaa-776ec5da3b23] ``` dashboard报错: ![图片说明](https://img-ask.csdn.net/upload/202002/11/1581385833_715215.png) ![图片说明](https://img-ask.csdn.net/upload/202002/11/1581385890_574951.png) 网上说了很多办法都没有用,个人初学小白,有没有路过的大神指点一二。万分感谢!
运行tensorflow时出现tensorflow.python.framework.errors_impl.InternalError: Blas GEMM launch failed这个错误
运行tensorflow时出现tensorflow.python.framework.errors_impl.InternalError: Blas GEMM launch failed这个错误,查了一下说是gpu被占用了,从下面这里开始出问题的: ``` 2019-10-17 09:28:49.495166: I tensorflow/core/common_runtime/gpu/gpu_device.cc:1304] Created TensorFlow device (/job:localhost/replica:0/task:0/device:GPU:0 with 6382 MB memory) -> physical GPU (device: 0, name: GeForce GTX 1070, pci bus id: 0000:01:00.0, compute capability: 6.1) (60000, 28, 28) (60000, 10) 2019-10-17 09:28:51.275415: W tensorflow/stream_executor/platform/default/dso_loader.cc:55] Could not load dynamic library 'cublas64_100.dll'; dlerror: cublas64_100.dll not found ``` ![图片说明](https://img-ask.csdn.net/upload/201910/17/1571277238_292620.png) 最后显示的问题: ![图片说明](https://img-ask.csdn.net/upload/201910/17/1571277311_655722.png) 试了一下网上的方法,比如加代码: ``` gpu_options = tf.GPUOptions(per_process_gpu_memory_fraction=0.333) sess = tf.Session(config=tf.ConfigProto(gpu_options=gpu_options)) ``` 但最后提示: ![图片说明](https://img-ask.csdn.net/upload/201910/17/1571277460_72752.png) 现在不知道要怎么解决了。新手想试下简单的数字识别,步骤也是按教程一步步来的,可能用的版本和教程不一样,我用的是刚下的:2.0tensorflow和以下: ![图片说明](https://img-ask.csdn.net/upload/201910/17/1571277627_439100.png) 不知道会不会有版本问题,现在紧急求助各位大佬,还有没有其它可以尝试的方法。测试程序加法运算可以执行,数字识别图片运行的时候我看了下,GPU最大占有率才0.2%,下面是完整数字图片识别代码: ``` import os import tensorflow as tf from tensorflow import keras from tensorflow.keras import layers, optimizers, datasets os.environ['TF_CPP_MIN_LOG_LEVEL'] = '2' #gpu_options = tf.GPUOptions(per_process_gpu_memory_fraction=0.2) #sess = tf.Session(config=tf.ConfigProto(gpu_options=gpu_options)) gpu_options = tf.GPUOptions(per_process_gpu_memory_fraction=0.333) sess = tf.Session(config=tf.ConfigProto(gpu_options=gpu_options)) (x, y), (x_val, y_val) = datasets.mnist.load_data() x = tf.convert_to_tensor(x, dtype=tf.float32) / 255. y = tf.convert_to_tensor(y, dtype=tf.int32) y = tf.one_hot(y, depth=10) print(x.shape, y.shape) train_dataset = tf.data.Dataset.from_tensor_slices((x, y)) train_dataset = train_dataset.batch(200) model = keras.Sequential([ layers.Dense(512, activation='relu'), layers.Dense(256, activation='relu'), layers.Dense(10)]) optimizer = optimizers.SGD(learning_rate=0.001) def train_epoch(epoch): # Step4.loop for step, (x, y) in enumerate(train_dataset): with tf.GradientTape() as tape: # [b, 28, 28] => [b, 784] x = tf.reshape(x, (-1, 28 * 28)) # Step1. compute output # [b, 784] => [b, 10] out = model(x) # Step2. compute loss loss = tf.reduce_sum(tf.square(out - y)) / x.shape[0] # Step3. optimize and update w1, w2, w3, b1, b2, b3 grads = tape.gradient(loss, model.trainable_variables) # w' = w - lr * grad optimizer.apply_gradients(zip(grads, model.trainable_variables)) if step % 100 == 0: print(epoch, step, 'loss:', loss.numpy()) def train(): for epoch in range(30): train_epoch(epoch) if __name__ == '__main__': train() ``` 希望能有人给下建议或解决方法,拜谢!
WIn10系统无法启动Synergy 求教!!
Synergy 版本是1.10.2 日志显示 [2019-07-24T16:14:17] INFO: connecting to service... [2019-07-24T16:14:19] INFO: connection established [2019-07-24T16:14:19] INFO: service status: idle [2019-07-24T16:14:24] INFO: starting server [2019-07-24T16:14:24] INFO: config file: C:/Users/周博文/AppData/Local/Temp/Synergy.lN8300 [2019-07-24T16:14:24] INFO: log level: INFO [2019-07-24T16:14:24] INFO: service command updated [2019-07-24T16:14:24] INFO: service command updated [2019-07-24T16:14:25] INFO: starting new process [2019-07-24T16:14:25] INFO: activeDesktop:Default [2019-07-24T16:14:25] ERROR: could not get session id for process id 26824 [2019-07-24T16:14:25] INFO: starting new process [2019-07-24T16:14:25] INFO: drag and drop enabled synergys.exe: no configuration available [2019-07-24T16:14:26] ERROR: failed to launch, error: process immediately stopped [2019-07-24T16:14:26] INFO: backing off, wait=2s, failures=1 [2019-07-24T16:14:28] INFO: starting new process [2019-07-24T16:14:28] INFO: activeDesktop:Default [2019-07-24T16:14:28] ERROR: could not get session id for process id 51964 [2019-07-24T16:14:28] INFO: starting new process [2019-07-24T16:14:28] INFO: drag and drop enabled synergys.exe: no configuration available [2019-07-24T16:14:29] ERROR: failed to launch, error: process immediately stopped [2019-07-24T16:14:29] INFO: backing off, wait=4s, failures=2 [2019-07-24T16:14:33] INFO: starting new process [2019-07-24T16:14:33] INFO: activeDesktop:Default [2019-07-24T16:14:33] ERROR: could not get session id for process id 29076 [2019-07-24T16:14:33] INFO: starting new process [2019-07-24T16:14:33] INFO: drag and drop enabled synergys.exe: no configuration available [2019-07-24T16:14:34] ERROR: failed to launch, error: process immediately stopped [2019-07-24T16:14:34] INFO: backing off, wait=6s, failures=3 [2019-07-24T16:14:39] INFO: service command updated
Crazy Tank 坦克的算法
Problem Description Crazy Tank was a famous game about ten years ago. Every child liked it. Time flies, children grow up, but the memory of happy childhood will never go. Now you’re controlling the tank Laotu on a platform which is H meters above the ground. Laotu is so old that you can only choose a shoot angle(all the angle is available) before game start and then any adjusting is not allowed. You need to launch N cannonballs and you know that the i-th cannonball’s initial speed is Vi. On the right side of Laotu There is an enemy tank on the ground with coordination(L1, R1) and a friendly tank with coordination(L2, R2). A cannonball is considered hitting enemy tank if it lands on the ground between [L1,R1] (two ends are included). As the same reason, it will be considered hitting friendly tank if it lands between [L2, R2]. Laotu's horizontal coordination is 0. The goal of the game is to maximize the number of cannonballs which hit the enemy tank under the condition that no cannonball hits friendly tank. The g equals to 9.8. Input There are multiple test case. Each test case contains 3 lines. The first line contains an integer N(0≤N≤200), indicating the number of cannonballs to be launched. The second line contains 5 float number H(1≤H≤100000), L1, R1(0<L1<R1<100000) and L2, R2(0<L2<R2<100000). Indicating the height of the platform, the enemy tank coordinate and the friendly tank coordinate. Two tanks may overlap. The third line contains N float number. The i-th number indicates the initial speed of i-th cannonball. The input ends with N=0. Output For each test case, you should output an integer in a single line which indicates the max number of cannonballs hit the enemy tank under the condition that no cannonball hits friendly tank. Sample Input 2 10 10 15 30 35 10.0 20.0 2 10 35 40 2 30 10.0 20.0 0 Sample Output 1 0
android单元测试遇到的问题,求解~
Failed to launch test 提示框是: No tests found with test runner 'JUnit 3'
跪求各位大神 MAC10.13 Xcode9.0 Opencv3.4
运行 opencv报错: 报错信息:/Users/wanglan/Desktop/learn_oc/learn_oc/new0826/new0826/Launch Screen.storyboard: Internal error. Please file a bug at bugreport.apple.com and attach "/var/folders/z5/dhdsybq550l_skg8zs85xz600000gn/T/IB-agent-diagnostics_2018-08-28_22-40-06_961000". Recovery Suggestion: Please check Console.app for crash reports for "Interface Builder Cocoa Touch Tool" for further information. Underlying Errors: Description: Encountered an error communicating with Interface Builder Cocoa Touch Tool. Failure Reason: Interface Builder Cocoa Touch Tool (-1) failed to launch Recovery Suggestion: Please check Console.app for crash reports for "Interface Builder Cocoa Touch Tool" for further information. Underlying Errors: Description: Failed to launch Interface Builder Cocoa Touch Tool via CoreSimulator spawn Failure Reason: Failed to spawn Interface Builder Cocoa Touch Tool on IBSimDeviceTypeiPad2x (A4AFDF4B-D631-4C55-8E64-C72FF6D30D92, iOS 11.0, Shutdown) Recovery Suggestion: To view or change permissions, select the item in the Finder and choose File > Get Info. Underlying Errors: Description: You don’t have permission to save the file “A4AFDF4B-D631-4C55-8E64-C72FF6D30D92” in the folder “CoreSimulator”. Failure Reason: You don’t have permission. Recovery Suggestion: To view or change permissions, select the item in the Finder and choose File > Get Info. Underlying Errors: Description: The operation couldn’t be completed. Permission denied Failure Reason: Permission denied
终于明白阿里百度这样的大公司,为什么面试经常拿ThreadLocal考验求职者了
点击上面↑「爱开发」关注我们每晚10点,捕获技术思考和创业资源洞察什么是ThreadLocalThreadLocal是一个本地线程副本变量工具类,各个线程都拥有一份线程私...
《奇巧淫技》系列-python!!每天早上八点自动发送天气预报邮件到QQ邮箱
将代码部署服务器,每日早上定时获取到天气数据,并发送到邮箱。 也可以说是一个小人工智障。 思路可以运用在不同地方,主要介绍的是思路。
加快推动区块链技术和产业创新发展,2019可信区块链峰会在京召开
11月8日,由中国信息通信研究院、中国通信标准化协会、中国互联网协会、可信区块链推进计划联合主办,科技行者协办的2019可信区块链峰会将在北京悠唐皇冠假日酒店开幕。   区块链技术被认为是继蒸汽机、电力、互联网之后,下一代颠覆性的核心技术。如果说蒸汽机释放了人类的生产力,电力解决了人类基本的生活需求,互联网彻底改变了信息传递的方式,区块链作为构造信任的技术有重要的价值。   1...
阿里面试官问我:如何设计秒杀系统?我的回答让他比起大拇指
你知道的越多,你不知道的越多 点赞再看,养成习惯 GitHub上已经开源 https://github.com/JavaFamily 有一线大厂面试点脑图和个人联系方式,欢迎Star和指教 前言 Redis在互联网技术存储方面使用如此广泛,几乎所有的后端技术面试官都要在Redis的使用和原理方面对小伙伴们进行360°的刁难。 作为一个在互联网公司面一次拿一次Offer的面霸,打败了...
C语言魔塔游戏
很早就很想写这个,今天终于写完了。 游戏截图: 编译环境: VS2017 游戏需要一些图片,如果有想要的或者对游戏有什么看法的可以加我的QQ 2985486630 讨论,如果暂时没有回应,可以在博客下方留言,到时候我会看到。 下面我来介绍一下游戏的主要功能和实现方式 首先是玩家的定义,使用结构体,这个名字是可以自己改变的 struct gamerole { char n...
面试官问我:什么是消息队列?什么场景需要他?用了会出现什么问题?
你知道的越多,你不知道的越多 点赞再看,养成习惯 GitHub上已经开源 https://github.com/JavaFamily 有一线大厂面试点脑图、个人联系方式和人才交流群,欢迎Star和完善 前言 消息队列在互联网技术存储方面使用如此广泛,几乎所有的后端技术面试官都要在消息队列的使用和原理方面对小伙伴们进行360°的刁难。 作为一个在互联网公司面一次拿一次Offer的面霸...
Android性能优化(4):UI渲染机制以及优化
文章目录1. 渲染机制分析1.1 渲染机制1.2 卡顿现象1.3 内存抖动2. 渲染优化方式2.1 过度绘制优化2.1.1 Show GPU overdraw2.1.2 Profile GPU Rendering2.2 卡顿优化2.2.1 SysTrace2.2.2 TraceView 在从Android 6.0源码的角度剖析View的绘制原理一文中,我们了解到View的绘制流程有三个步骤,即m...
微服务中的Kafka与Micronaut
今天,我们将通过Apache Kafka主题构建一些彼此异步通信的微服务。我们使用Micronaut框架,它为与Kafka集成提供专门的库。让我们简要介绍一下示例系统的体系结构。我们有四个微型服务:订单服务,行程服务,司机服务和乘客服务。这些应用程序的实现非常简单。它们都有内存存储,并连接到同一个Kafka实例。 我们系统的主要目标是为客户安排行程。订单服务应用程序还充当网关。它接收来自客户的请求...
致 Python 初学者们!
作者| 许向武 责编 | 屠敏 出品 | CSDN 博客 前言 在 Python 进阶的过程中,相信很多同学应该大致上学习了很多 Python 的基础知识,也正在努力成长。在此期间,一定遇到了很多的困惑,对未来的学习方向感到迷茫。我非常理解你们所面临的处境。我从2007年开始接触 Python 这门编程语言,从2009年开始单一使用 Python 应对所有的开发工作,直至今...
究竟你适不适合买Mac?
我清晰的记得,刚买的macbook pro回到家,开机后第一件事情,就是上了淘宝网,花了500元钱,找了一个上门维修电脑的师傅,上门给我装了一个windows系统。。。。。。 表砍我。。。 当时买mac的初衷,只是想要个固态硬盘的笔记本,用来运行一些复杂的扑克软件。而看了当时所有的SSD笔记本后,最终决定,还是买个好(xiong)看(da)的。 已经有好几个朋友问我mba怎么样了,所以今天尽量客观...
程序员一般通过什么途径接私活?
二哥,你好,我想知道一般程序猿都如何接私活,我也想接,能告诉我一些方法吗? 上面是一个读者“烦不烦”问我的一个问题。其实不止是“烦不烦”,还有很多读者问过我类似这样的问题。 我接的私活不算多,挣到的钱也没有多少,加起来不到 20W。说实话,这个数目说出来我是有点心虚的,毕竟太少了,大家轻喷。但我想,恰好配得上“一般程序员”这个称号啊。毕竟苍蝇再小也是肉,我也算是有经验的人了。 唾弃接私活、做外...
字节跳动面试官这样问消息队列:分布式事务、重复消费、顺序消费,我整理了一下
你知道的越多,你不知道的越多 点赞再看,养成习惯 GitHub上已经开源 https://github.com/JavaFamily 有一线大厂面试点脑图、个人联系方式和人才交流群,欢迎Star和完善 前言 消息队列在互联网技术存储方面使用如此广泛,几乎所有的后端技术面试官都要在消息队列的使用和原理方面对小伙伴们进行360°的刁难。 作为一个在互联网公司面一次拿一次Offer的面霸...
Python爬虫爬取淘宝,京东商品信息
小编是一个理科生,不善长说一些废话。简单介绍下原理然后直接上代码。 使用的工具(Python+pycharm2019.3+selenium+xpath+chromedriver)其中要使用pycharm也可以私聊我selenium是一个框架可以通过pip下载 pip installselenium -ihttps://pypi.tuna.tsinghua.edu.cn/simple/ ...
阿里程序员写了一个新手都写不出的低级bug,被骂惨了。
这种新手都不会范的错,居然被一个工作好几年的小伙子写出来,差点被当场开除了。
Java工作4年来应聘要16K最后没要,细节如下。。。
前奏: 今天2B哥和大家分享一位前几天面试的一位应聘者,工作4年26岁,统招本科。 以下就是他的简历和面试情况。 基本情况: 专业技能: 1、&nbsp;熟悉Sping了解SpringMVC、SpringBoot、Mybatis等框架、了解SpringCloud微服务 2、&nbsp;熟悉常用项目管理工具:SVN、GIT、MAVEN、Jenkins 3、&nbsp;熟悉Nginx、tomca...
SpringBoot2.x系列教程(三十六)SpringBoot之Tomcat配置
Spring Boot默认内嵌的Tomcat为Servlet容器,关于Tomcat的所有属性都在ServerProperties配置类中。同时,也可以实现一些接口来自定义内嵌Servlet容器和内嵌Tomcat等的配置。 关于此配置,网络上有大量的资料,但都是基于SpringBoot1.5.x版本,并不适合当前最新版本。本文将带大家了解一下最新版本的使用。 ServerProperties的部分源...
Python绘图,圣诞树,花,爱心 | Turtle篇
每周每日,分享Python实战代码,入门资料,进阶资料,基础语法,爬虫,数据分析,web网站,机器学习,深度学习等等。 公众号回复【进群】沟通交流吧,QQ扫码进群学习吧 微信群 QQ群 1.画圣诞树 import turtle screen = turtle.Screen() screen.setup(800,600) circle = turtle.Turtle()...
作为一个程序员,CPU的这些硬核知识你必须会!
CPU对每个程序员来说,是个既熟悉又陌生的东西? 如果你只知道CPU是中央处理器的话,那可能对你并没有什么用,那么作为程序员的我们,必须要搞懂的就是CPU这家伙是如何运行的,尤其要搞懂它里面的寄存器是怎么一回事,因为这将让你从底层明白程序的运行机制。 随我一起,来好好认识下CPU这货吧 把CPU掰开来看 对于CPU来说,我们首先就要搞明白它是怎么回事,也就是它的内部构造,当然,CPU那么牛的一个东...
破14亿,Python分析我国存在哪些人口危机!
一、背景 二、爬取数据 三、数据分析 1、总人口 2、男女人口比例 3、人口城镇化 4、人口增长率 5、人口老化(抚养比) 6、各省人口 7、世界人口 四、遇到的问题 遇到的问题 1、数据分页,需要获取从1949-2018年数据,观察到有近20年参数:LAST20,由此推测获取近70年的参数可设置为:LAST70 2、2019年数据没有放上去,可以手动添加上去 3、将数据进行 行列转换 4、列名...
听说想当黑客的都玩过这个Monyer游戏(1~14攻略)
第零关 进入传送门开始第0关(游戏链接) 请点击链接进入第1关: 连接在左边→ ←连接在右边 看不到啊。。。。(只能看到一堆大佬做完的留名,也能看到菜鸡的我,在后面~~) 直接fn+f12吧 &lt;span&gt;连接在左边→&lt;/span&gt; &lt;a href="first.php"&gt;&lt;/a&gt; &lt;span&gt;←连接在右边&lt;/span&gt; o...
在家远程办公效率低?那你一定要收好这个「在家办公」神器!
相信大家都已经收到国务院延长春节假期的消息,接下来,在家远程办公可能将会持续一段时间。 但是问题来了。远程办公不是人在电脑前就当坐班了,相反,对于沟通效率,文件协作,以及信息安全都有着极高的要求。有着非常多的挑战,比如: 1在异地互相不见面的会议上,如何提高沟通效率? 2文件之间的来往反馈如何做到及时性?如何保证信息安全? 3如何规划安排每天工作,以及如何进行成果验收? ...... ...
作为一个程序员,内存和磁盘的这些事情,你不得不知道啊!!!
截止目前,我已经分享了如下几篇文章: 一个程序在计算机中是如何运行的?超级干货!!! 作为一个程序员,CPU的这些硬核知识你必须会! 作为一个程序员,内存的这些硬核知识你必须懂! 这些知识可以说是我们之前都不太重视的基础知识,可能大家在上大学的时候都学习过了,但是嘞,当时由于老师讲解的没那么有趣,又加上这些知识本身就比较枯燥,所以嘞,大家当初几乎等于没学。 再说啦,学习这些,也看不出来有什么用啊!...
这个世界上人真的分三六九等,你信吗?
偶然间,在知乎上看到一个问题 一时间,勾起了我深深的回忆。 以前在厂里打过两次工,做过家教,干过辅导班,做过中介。零下几度的晚上,贴过广告,满脸、满手地长冻疮。 再回首那段岁月,虽然苦,但让我学会了坚持和忍耐。让我明白了,在这个世界上,无论环境多么的恶劣,只要心存希望,星星之火,亦可燎原。 下文是原回答,希望能对你能有所启发。 如果我说,这个世界上人真的分三六九等,...
2020年全新Java学习路线图,含配套视频,学完即为中级Java程序员!!
新的一年来临,突如其来的疫情打破了平静的生活! 在家的你是否很无聊,如果无聊就来学习吧! 世上只有一种投资只赚不赔,那就是学习!!! 传智播客于2020年升级了Java学习线路图,硬核升级,免费放送! 学完你就是中级程序员,能更快一步找到工作! 一、Java基础 JavaSE基础是Java中级程序员的起点,是帮助你从小白到懂得编程的必经之路。 在Java基础板块中有6个子模块的学...
B 站上有哪些很好的学习资源?
哇说起B站,在小九眼里就是宝藏般的存在,放年假宅在家时一天刷6、7个小时不在话下,更别提今年的跨年晚会,我简直是跪着看完的!! 最早大家聚在在B站是为了追番,再后来我在上面刷欧美新歌和漂亮小姐姐的舞蹈视频,最近两年我和周围的朋友们已经把B站当作学习教室了,而且学习成本还免费,真是个励志的好平台ヽ(.◕ฺˇд ˇ◕ฺ;)ノ 下面我们就来盘点一下B站上优质的学习资源: 综合类 Oeasy: 综合...
爬取薅羊毛网站百度云资源
这是疫情期间无聊做的爬虫, 去获取暂时用不上的教程 import threading import time import pandas as pd import requests import re from threading import Thread, Lock # import urllib.request as request # req=urllib.request.Requ...
如何优雅地打印一个Java对象?
你好呀,我是沉默王二,一个和黄家驹一样身高,和刘德华一样颜值的程序员。虽然已经写了十多年的 Java 代码,但仍然觉得自己是个菜鸟(请允许我惭愧一下)。 在一个月黑风高的夜晚,我思前想后,觉得再也不能这么蹉跎下去了。于是痛下决心,准备通过输出的方式倒逼输入,以此来修炼自己的内功,从而进阶成为一名真正意义上的大神。与此同时,希望这些文章能够帮助到更多的读者,让大家在学习的路上不再寂寞、空虚和冷。 ...
雷火神山直播超两亿,Web播放器事件监听是怎么实现的?
Web播放器解决了在手机浏览器和PC浏览器上播放音视频数据的问题,让视音频内容可以不依赖用户安装App,就能进行播放以及在社交平台进行传播。在视频业务大数据平台中,播放数据的统计分析非常重要,所以Web播放器在使用过程中,需要对其内部的数据进行收集并上报至服务端,此时,就需要对发生在其内部的一些播放行为进行事件监听。 那么Web播放器事件监听是怎么实现的呢? 01 监听事件明细表 名...
3万字总结,Mysql优化之精髓
本文知识点较多,篇幅较长,请耐心学习 MySQL已经成为时下关系型数据库产品的中坚力量,备受互联网大厂的青睐,出门面试想进BAT,想拿高工资,不会点MySQL优化知识,拿offer的成功率会大大下降。 为什么要优化 系统的吞吐量瓶颈往往出现在数据库的访问速度上 随着应用程序的运行,数据库的中的数据会越来越多,处理时间会相应变慢 数据是存放在磁盘上的,读写速度无法和内存相比 如何优化 设计...
HTML5适合的情人节礼物有纪念日期功能
前言 利用HTML5,css,js实现爱心树 以及 纪念日期的功能 网页有播放音乐功能 以及打字倾诉感情的画面,非常适合情人节送给女朋友 具体的HTML代码 具体只要修改代码里面的男某某和女某某 文字段也可自行修改,还有代码下半部分的JS代码需要修改一下起始日期 注意月份为0~11月 也就是月份需要减一。 当然只有一部分HTML和JS代码不够运行的,文章最下面还附加了完整代码的下载地址 &lt;!...
相关热词 c# 识别回车 c#生成条形码ean13 c#子控制器调用父控制器 c# 写大文件 c# 浏览pdf c#获取桌面图标的句柄 c# list反射 c# 句柄 进程 c# 倒计时 线程 c# 窗体背景色
立即提问