通过MakeFile文件了解项目目录结构,编写CMake的CMakelist.txt文件方法。

主项目:
CC = gcc
CFLAGS += -O3
BIN_DIR = ./bin
SRC_DIR = ./src
DOC_DIR = ./docs
INC_DIR = ./include
LIB_DIR = ./lib
BIN = siftfeat match dspfeat

all: $(BIN) libopensift.a docs

docs:
doxygen Doxyfile

libopensift.a:
make -C $(SRC_DIR) $@

$(BIN):
make -C $(SRC_DIR) $@

clean:
make -C $(SRC_DIR) $@; \
make -C $(INC_DIR) $@; \

distclean: clean
rm -f $(LIB_DIR)/*
rm -f $(BIN_DIR)/*

docsclean:
rm -rf $(DOC_DIR)/html/

.PHONY: docs clean docsclean libopensift.a

scr文件:
CC = gcc
CFLAGS +=
BIN_DIR = ../bin
INC_DIR = ../include
LIB_DIR = ../lib
INCL = -I$(INC_DIR) pkg-config --cflags opencv gtk+-2.0
LIBS = -L$(LIB_DIR) -lopensift -lm pkg-config --libs opencv gtk+-2.0
OBJ = imgfeatures.o utils.o sift.o kdtree.o minpq.o xform.o
BIN = siftfeat match dspfeat

all: $(BIN) libopensift.a

libopensift.a: $(OBJ)
ar rc $(LIB_DIR)/$@ $(OBJ)
ranlib $(LIB_DIR)/$@

siftfeat: libopensift.a siftfeat.c
$(CC) $(CFLAGS) $(INCL) siftfeat.c -o $(BIN_DIR)/$@ $(LIBS)

match: libopensift.a match.c
$(CC) $(CFLAGS) $(INCL) match.c -o $(BIN_DIR)/$@ $(LIBS)

dspfeat: libopensift.a dspfeat.c
$(CC) $(CFLAGS) $(INCL) dspfeat.c -o $(BIN_DIR)/$@ $(LIBS)

imgfeatures.o: imgfeatures.c $(INC_DIR)/imgfeatures.h
$(CC) $(CFLAGS) $(INCL) -c imgfeatures.c -o $@

utils.o: utils.c $(INC_DIR)/utils.h
$(CC) $(CFLAGS) $(INCL) -c utils.c -o $@

sift.o: sift.c $(INC_DIR)/sift.h
$(CC) $(CFLAGS) $(INCL) -c sift.c -o $@

kdtree.o: kdtree.c $(INC_DIR)/kdtree.h
$(CC) $(CFLAGS) $(INCL) -c kdtree.c -o $@

minpq.o: minpq.c $(INC_DIR)/minpq.h
$(CC) $(CFLAGS) $(INCL) -c minpq.c -o $@

xform.o: xform.c $(INC_DIR)/xform.h
$(CC) $(CFLAGS) $(INCL) -c xform.c -o $@

clean:
rm -f *~ *.o core

.PHONY: clean

include文件:
clean:
rm -f *~

.PHONY: clean

Csdn user default icon
上传中...
上传图片
插入图片
抄袭、复制答案,以达到刷声望分或其他目的的行为,在CSDN问答是严格禁止的,一经发现立刻封号。是时候展现真正的技术了!
其他相关推荐
生成的makefile文件在Windows下该怎么执行

用cmake通过mingw生成的makefile文件,该怎么用才能生成可执行程序?

cmake后make找不到.so文件

cmake后make找不到.so文件。就是在Linux中CMake成功生成Makefile文件后make编译时找不到.so文件,什么在/etc/ld.so.conf文件中添加路径都用过了。很奇怪的,用arm-Linux-g++编译时用-L指定路径却能够编译成功找到,为什么make就找不到了。 还要哪里指定.so路径?

使用make指令执行makefile文件失败,提示系统找不到指定的文件

在一个算法的官网下载了代码包,但使用make指令执行给的makefile 文件却失败了,报错如下 ![图片说明](https://img-ask.csdn.net/upload/201804/03/1522730039_748554.png) 下为makefile文件内容 CFLAGS=-O3 -mcpu=cortex-a8 -mfpu=neon -std=gnu99 -Wall -pedantic -Wno-long-long all: check bench debug: @$(CC) $(CFLAGS) -DNORX_DEBUG -I. -o debug ../../utils/debug.c norx.c @./debug @rm debug bench: @$(CC) $(CFLAGS) -o bench ../../utils/bench.c norx.c caesar.c @./bench @rm bench check: @$(CC) $(CFLAGS) -I../ -o check ../../utils/check.c norx.c caesar.c @./check @rm check .PHONY: check debug bench 另附上算法官网,代码包可以在里面下载https://norx.io/ 求问提供的makefile文件到底哪里有问题,还是我的make过程有问题,第一次使用make指令编译c程序,完全弄不懂-- PS:文件都在对应的目录下,环境变量里我已经把gnu make的bin文件夹添加进path里了,不懂怎么会提示找不到指定文件

cmakelists如何修改文件拓展名?

请教一下大家 cmake如何修改文件拓展名?类似makefile中的patsubst,现在想把这两句改成cmakelists,不知道怎么修改-。。 ``` DEPS = $(patsubst %.d,$(OBJ_DIR)/%.d,$(DEP_NAMES)) OBJS = $(patsubst %.o,$(OBJ_DIR)/%.o,$(OBJ_NAMES)) ```

Linux下多个子项目的工程依赖如何处理?详见正文

目前有一个项目,项目的结构如图。分为三个子项目。 ![图片说明](https://img-ask.csdn.net/upload/201909/08/1567929985_296268.jpg) Test是整个项目的测试部分,入口函数在这里,在windows环境下,cmake出的项目我需要先debug运行ISPC子项目生成一个.obj与.h文件,整个项目才能够跑的起来,这是前提。 但是当运行环境是linux时,由于cmake出的程序只有一份makefile,make构造时,势必无法找到ISPC生成的.o与.h文件,因为无法先运行ISPC子程序,所以目前的问题是在linux环境下,针对这个项目的情况,如何可以先运行ISPC部分能够生成想要的依赖文件,再运行Test部分???

用Cmake编译文件,提示这个

我已经执行过git submodule update --init命令了,还是提示这个 CMake Error at CMakeLists.txt:87 (message): Git submodules not initialized, execute: git submodule update --init -- Configuring incomplete, errors occurred!

如何将vs2008的工程转成makefile编译文件

需要将vs2008的工程弄成静态编译和在各系统编译.没有c币了,请大家帮帮忙啊。

如何使用Cmake构建OpenGL项目?用的CLion编辑器

最近在学OpenGL,下面的是一个简单的画线段程序,可以在VS2017上面运行,但VS有点卡,于是试着在CLion上面运行。 ``` #include <stdlib.h> #include <glut.h> void init(void) { glClearColor(1.0, 1.0, 1.0, 0.0); glMatrixMode(GL_PROJECTION); gluOrtho2D(0.0, 200.0, 0.0, 150.0); } void lineSegment(void) { glClear(GL_COLOR_BUFFER_BIT); glColor3f(1.0, 0.0, 0.0); glBegin(GL_LINES); glVertex2i(100, 0); glVertex2i(0, 75); glEnd(); glFlush(); } int main(int argc, char **argv) { glutInit(&argc, argv); glutInitDisplayMode(GLUT_SINGLE | GLUT_RGB); glutInitWindowPosition(100, 100); glutInitWindowSize(400, 300); glutCreateWindow("测试"); init(); glutDisplayFunc(lineSegment); glutMainLoop(); } ``` CMakeList文件 ``` cmake_minimum_required(VERSION 3.8) project(learnOpenGL) set(CMAKE_CXX_STANDARD 11) include_directories(C:/glut) link_directories(C:/glut) #find_library(libsrc glut C:/glut) #message(${libsrc}) set(SOURCE_FILES main.cpp) add_executable(learnOpenGL ${SOURCE_FILES}) #target_link_libraries( learnOpenGL ${libsrc}) target_link_libraries( learnOpenGL glut) ``` Build报错,如下? ``` C:/PROGRA~1/DevCpp/MinGW64/bin/../lib/gcc/x86_64-w64-mingw32/4.9.2/../../../../x86_64-w64-mingw32/bin/ld.exe: skipping incompatible C:/glut/glut.lib when searching for -lglut C:/PROGRA~1/DevCpp/MinGW64/bin/../lib/gcc/x86_64-w64-mingw32/4.9.2/../../../../x86_64-w64-mingw32/bin/ld.exe: skipping incompatible C:/glut/glut.dll when searching for -lglut C:/PROGRA~1/DevCpp/MinGW64/bin/../lib/gcc/x86_64-w64-mingw32/4.9.2/../../../../x86_64-w64-mingw32/bin/ld.exe: skipping incompatible C:/glut/glut.lib when searching for -lglut C:/PROGRA~1/DevCpp/MinGW64/bin/../lib/gcc/x86_64-w64-mingw32/4.9.2/../../../../x86_64-w64-mingw32/bin/ld.exe: skipping incompatible C:/glut/glut.dll when searching for -lglut C:/PROGRA~1/DevCpp/MinGW64/bin/../lib/gcc/x86_64-w64-mingw32/4.9.2/../../../../x86_64-w64-mingw32/bin/ld.exe: skipping incompatible C:/glut\glut.lib when searching for -lglut C:/PROGRA~1/DevCpp/MinGW64/bin/../lib/gcc/x86_64-w64-mingw32/4.9.2/../../../../x86_64-w64-mingw32/bin/ld.exe: cannot find -lglut collect2.exe: error: ld returned 1 exit status mingw32-make.exe[3]: *** [learnOpenGL.exe] Error 1 CMakeFiles\learnOpenGL.dir\build.make:96: recipe for target 'learnOpenGL.exe' failed CMakeFiles\Makefile2:66: recipe for target 'CMakeFiles/learnOpenGL.dir/all' failed mingw32-make.exe[2]: *** [CMakeFiles/learnOpenGL.dir/all] Error 2 mingw32-make.exe[1]: *** [CMakeFiles/learnOpenGL.dir/rule] Error 2 CMakeFiles\Makefile2:78: recipe for target 'CMakeFiles/learnOpenGL.dir/rule' failed mingw32-make.exe: *** [learnOpenGL] Error 2 Makefile:117: recipe for target 'learnOpenGL' failed ``` 折腾两天了,无论百度还是google都没有很好的实例。

c# 能否利用Makefile进行编译

能否利用Makefile 编译c#项目并生成csproj文件? 又类似cmake的软件么?

【已经解决】 Win10环境下采用CMake编译OpenCV项目,提示无法找到opencv

1. 安装过OpenCV 4.1 win pack版本,同时安装的Intel Sensor SDK第三方软件中有opencv 3.4版本。 都按照操作要求添加了环境变量路径。 2. 采用CMake编译一个文件出现一直提示错误,这个错误应该是很多人都遇到过的。 CMakeLists.txt文件内容如下: cmake_minimum_required(VERSION 3.10) project(CvTrack) set(CMAKE_BUILD_TYPE Debug) set(OpenCV_DIR "D:/opencv/build") find_package(OpenCV REQUIRED) add_executable(CvTracking "main.cpp") target_link_libraries(CvTrack ${OpenCV_LIBS}) ********************************************************************************************************************************************************** 产生的错误提示: Selecting Windows SDK version 10.0.17763.0 to target Windows 10.0.18362. OpenCV ARCH: x86 OpenCV RUNTIME: vc14 OpenCV STATIC: OFF CMake Warning at D:/opencv/build/OpenCVConfig.cmake:166 (message): Found OpenCV Windows Pack but it has no binaries compatible with your configuration. You should manually point CMake variable OpenCV_DIR to your build of OpenCV library. Call Stack (most recent call first): CMakeLists.txt:15 (find_package) CMake Error at CMakeLists.txt:15 (find_package): Found package configuration file: D:/opencv/build/OpenCVConfig.cmake but it set OpenCV_FOUND to FALSE so package "OpenCV" is considered to be NOT FOUND. ![图片说明](https://img-ask.csdn.net/upload/201912/09/1575860198_340992.png) 安装目录如下: ![图片说明](https://img-ask.csdn.net/upload/201912/09/1575860277_399662.png) ![图片说明](https://img-ask.csdn.net/upload/201912/09/1575860289_707476.png) 请问,这个问题如何解决呢?? /==/==/==/==/==/==/==/==/==/==/==/==/==/==/==/==/==/== 解决方法: 主要原因:根据提示,OpenCVConfig.cmake文件有问题;实际在OpenCV 4.1 wind pack安装版本中,OpenCVConfig.cmake在其它路径下也有一个文件,修改路径即。 其次原因:设定的工程名为CvTrack,在add\_excuatable中的TargetName不对应。所以:重新修正了一下CMakeLists.txt: cmake_minimum_required(VERSION 3.10) project(CvTrack) set(OpenCV_DIR "D:/opencv/build/x64/vc15/lib") # 错误修正 find_package(OpenCV REQUIRED) include_directories(${OpenCV_INCLUDE_DIRS}) add_executable(CvTrack "main.cpp") # 错误修正 target_link_libraries(CvTrack ${OpenCV_LIBS})

如何使CMake与go编程语言一起使用?

<div class="post-text" itemprop="text"> <p>I have been using CMake with C++ to build libraries and executables and would like to use the same for the <strong>go programming language</strong>.</p> <p><strong>What steps do I need to take to configure CMake so it would work with the go programming language?</strong></p> <p>Essentially, my compiler is 6g which produces a compiled foo.6 - I send it to a linker via 6l foo.6 and I am done. I have the compiler and linker already built and installed.</p> <p>Obviously, I can just write a simple Makefile for this, but it would be nice to use CMake consistently throughout my project. </p> <p>TIA for any advice that would help me get started.</p> </div>

windows下makefile怎么修改

makefile的文件在这里,我不知道怎么改,只有mingw32-make,没有cmake,求教 ``` # change these to reflect your Lua installation LUA= /tmp/lhf/lua-5.1.5 LUAINC= $(LUA)/src LUALIB= $(LUA)/src LUABIN= $(LUA)/src # these will probably work if Lua has been installed globally #LUA= /usr/local #LUAINC= $(LUA)/include #LUALIB= $(LUA)/lib #LUABIN= $(LUA)/bin # probably no need to change anything below here CC= gcc CFLAGS= $(INCS) $(WARN) -O2 $G WARN= -ansi -pedantic -Wall -Wextra INCS= -I$(LUAINC) LIBS= -L$(LUALIB) -llua -lm -ldl EXPORT= -Wl,-E ``` 这是文件压缩包里的文件 ![图片说明](https://img-ask.csdn.net/upload/201704/27/1493258506_375160.jpg)

cygwin安装后如何添加cmake

我在安装cygwin时忘记安装cmake了,后来编译的时候报错才发现这个问题,除了重新装cygwin外,有没有其他的解决办法啊?求大神指点迷津

makefile编译不能检测到头文件类中的函数修改

很奇怪的问题,我写了一个测试程序,用makefile进行编译,但如果我在头文件里声明了新的函数,在.cpp文件中定义这个函数,make时会提示我----错误:成员函数‘int mysql_soci_test::sum()’未在类‘mysql_soci_test’中声明--这个错误,但如果我不用makefile编译,用g++直接编译,就不会有问题。 下面是我的g++语句:g++ mysql_soci_test.h mysql_soci_test.cpp mysql_main.cpp -I include/soci -I /usr/include/mysql -L./lib -L /usr/lib64/mysql -lmysqlclient 下面是我的makefile中的语句: INCLUDES = -I include/soci -I /usr/include/mysql LIBS = -lmysqlclient -L./lib -L /usr/lib64/mysql calc: mysql_main.cpp mysql_soci_test.cpp mysql_soci_test.h g++ -o calc mysql_soci_test.h mysql_main.cpp mysql_soci_test.cpp -I. $(INCLUDES) $(LIBS) 感觉应该是没有问题的,但就是会出错,有哪位高手要是知道还望能告知一下,谢谢,在线等......

没有使用 CMAKE 生成目标的规则来添加库。 图书馆自己编译就行了

<div class="post-text" itemprop="text"> <p>I'm trying to use <a href="https://www.unidata.ucar.edu/software/udunits/udunits-current/doc/udunits/udunits2.html" rel="nofollow noreferrer">this</a> library in my source code. I can't show you my code base, so I made a simple hello world project that tries to utilize this library. Following the instructions to install the library using CMake works perfectly, fine, the problem is I'm trying to put it into my project directory and compile it from there using my own CmakeLists.txt.</p> <p>Here is the library download: <a href="ftp://ftp.unidata.ucar.edu/pub/udunits/" rel="nofollow noreferrer">ftp://ftp.unidata.ucar.edu/pub/udunits/</a></p> <p>I'm using <code>udunits-2.2.26.tar.gz</code></p> <p>This is my project structure:</p> <pre><code> proj/ |-- CMakeLists.txt |-- ext | `-- udunits-2.2.26/ `-- src `-- main.cpp </code></pre> <p>My CMakeLists.txt:</p> <pre><code>cmake_minimum_required(VERSION 3.1) project(proj) add_subdirectory("ext/udunits-2.2.26") add_executable(app src/main.cpp) install(TARGETS app DESTINATION bin) </code></pre> <p>My main.cpp:</p> <pre><code>#include &lt;iostream&gt; int main() { std::cout &lt;&lt; "Hello World" &lt;&lt; std::endl; return 0; } </code></pre> <p>What I'm doing is I'm making a build/ directory within proj and calling CMake like so: <code>ccmake ..</code></p> <p>I run the configuration, then generate the files, and finally I call make.</p> <p>Here is my output:</p> <pre><code>[ 8%] Built target app Scanning dependencies of target udunits2_doc [ 13%] Built target udunits2_doc Scanning dependencies of target udunits2lib_doc make[2]: *** No rule to make target `../COPYRIGHT', needed by `../ext/udunits-2.2.26/lib/udunits2lib.info'. Stop. make[1]: *** [ext/udunits-2.2.26/lib/CMakeFiles/udunits2lib_doc.dir/all] Error 2 make: *** [all] Error 2 </code></pre> <p>There's a COPYRIGHT file in the library that contains the license details for this library. Their CMake checks to see if it exists. I'm not sure why I'm having issues compiling it adding it into my own CMakeLists as a sub directory. </p> <p>If I grep all the make files for COPYRIGHT and remove all dependencies to it, it compiles just fine. So it's something to do with the .texi files depending on it, and I'm not sure how to fix this.</p> <p>I've spent all day googling and trying different things, I'd appreciate any help! Thanks!</p> </div> <p>转载于:https://stackoverflow.com/questions/53111095/no-rule-to-make-target-using-cmake-to-add-a-library-library-compiles-just-fine</p>

CMake Error at CMakeLists.txt:97 (ADD_TARGET_DEFINITIONS): Unknown CMake command "ADD_TARGET_DEFIN

cmake version 3.14.3 这个问题怎么解决啊 ``` – The C compiler identification is GNU 7.3.0 – The CXX compiler identification is GNU 7.3.0 – Check for working C compiler: /usr/bin/cc – Check for working C compiler: /usr/bin/cc – works – Detecting C compiler ABI info – Detecting C compiler ABI info - done – Detecting C compile features – Detecting C compile features - done – Check for working CXX compiler: /usr/bin/c++ – Check for working CXX compiler: /usr/bin/c++ – works – Detecting CXX compiler ABI info – Detecting CXX compiler ABI info - done – Detecting CXX compile features – Detecting CXX compile features - done CMake Error at CMakeLists.txt:97 (ADD_TARGET_DEFINITIONS): Unknown CMake command “ADD_TARGET_DEFINITIONS”. – Configuring incomplete, errors occurred! See also “/home/wang/code/epoch-4.12.8/SDF/VisIt/CMakeFiles/CMakeOutput.log”. make[1]: Entering directory ‘/home/wang/code/epoch-4.12.8/SDF/VisIt’ make[1]: *** No targets specified and no makefile found. Stop. make[1]: Leaving directory ‘/home/wang/code/epoch-4.12.8/SDF/VisIt’ ERROR: Failed to build VisIt reader. Makefile:384: recipe for target ‘visit’ failed make: *** [visit] Error 1 --------------------- 作者:zsunflowerwq 来源:CSDN 原文:https://blog.csdn.net/zsunflowerwq/article/details/89644390 版权声明:本文为博主原创文章,转载请附上博文链接! ```

用cmake编译opencv3.0 时候出现的问题

CMake Error at CMakeLists.txt:88 (project): No CMAKE_C_COMPILER could be found. 这是什么问题啊! 求大神解决 我是win764位 刚下的opencv3.0 用cmake进行configure就出错 安装的是vs2010

CMake 始终无法找到静态库?谁能

尝试把这个静态库文件 /home/song/Work/NVDW/samples/src/speedbump/source/sbd_yolov2_detect.a 和其他driveworks的文件link起来,但是始终报错。谁可以帮帮忙看看为什么?谢谢 ``` /usr/bin/c++ -gsplit-dwarf -Wall -Wunused -Wunused-value -Wunused-parameter -g -Wl,--no-undefined -Wl,--as-needed CMakeFiles/speedBump.dir/gen_main.cu.o -o speedBump -L/home/song/Work/NVDW/samples/src/speedbump/source -Wl,-rpath,/home/song/Work/NVDW/samples/src/speedbump/source:/usr/local/cuda/lib64:/usr/local/driveworks-2.2/targets/x86_64-Linux/lib /usr/local/cuda/lib64/libcudart.so /usr/local/driveworks-2.2/targets/x86_64-Linux/lib/libdriveworks.so /usr/local/driveworks-2.2/targets/x86_64-Linux/lib/libdriveworks_visualization.so /usr/local/cuda/lib64/libcudart.so /usr/lib/x86_64-linux-gnu/libcublas.so ../../framework/libsamples_allocator.a ../../framework/libsamples_framework.a -Wl,-Bstatic -lsbd_yolov2_detect ../../../3rdparty/src/glfw/libglfw-src.a -Wl,-Bdynamic -ldl -lpthread /usr/lib/x86_64-linux-gnu/libSM.so /usr/lib/x86_64-linux-gnu/libICE.so /usr/lib/x86_64-linux-gnu/libX11.so /usr/lib/x86_64-linux-gnu/libXext.so /usr/lib/x86_64-linux-gnu/libXxf86vm.so /usr/lib/x86_64-linux-gnu/libXinerama.so /usr/lib/x86_64-linux-gnu/libXcursor.so /usr/lib/x86_64-linux-gnu/libXrandr.so ../../../3rdparty/src/lodepng/liblodepng-src.a -ldrm /usr/local/cuda/lib64/libcudart.so ../../../3rdparty/src/glew/libglew-src.a -lGLU -lGL [build] /usr/bin/ld: cannot find -lsbd_yolov2_detect ``` error log: ``` [main] Building folder: samples [build] Starting build [proc] Executing command: /usr/bin/cmake --build /home/song/Work/NVDW/samples/build --config Debug --target all -- -j 8 [build] -- Could NOT find EGL (missing: EGL_LIBRARY EGL_INCLUDE_DIR) [build] -- Building with TRT version and cudnn version 7.5.1.14 [build] -- Building GLFW for X11 (static) [build] -- Driveworks Samples install dir: /home/song/Work/NVDW/samples/build/install [build] -- Found Driveworks [build] -- Configuring done [build] -- Generating done [build] -- Build files have been written to: /home/song/Work/NVDW/samples/build [build] [ 4%] Built target samples_allocator [build] [ 9%] Built target glew-src [build] [ 14%] Built target lodepng-src [build] [ 50%] Built target glfw-x11 [build] [ 52%] Built target update_cuda_deps [build] [ 54%] Built target glfw-src [build] [ 95%] Built target samples_framework [build] [ 97%] Linking CXX executable speedBump [build] /usr/bin/ld: cannot find -lsbd_yolov2_detect [build] collect2: error: ld returned 1 exit status [build] src/speedbump/source/CMakeFiles/speedBump.dir/build.make:344: recipe for target 'src/speedbump/source/speedBump' failed [build] make[2]: *** [src/speedbump/source/speedBump] Error 1 [build] make[1]: *** [src/speedbump/source/CMakeFiles/speedBump.dir/all] Error 2 [build] CMakeFiles/Makefile2:464: recipe for target 'src/speedbump/source/CMakeFiles/speedBump.dir/all' failed [build] Makefile:83: recipe for target 'all' failed [build] make: *** [all] Error 2 [build] Build finished with exit code 2 ```

win10 64位通过cmake+mingw配置opencv

CMake生成完后,在build文件夹内执行"mingw32-make"但执行到35%左右后报错![错误1](https://img-ask.csdn.net/upload/201712/29/1514517691_592967.png) ![错误2](https://img-ask.csdn.net/upload/201712/29/1514517710_47548.png) 一头雾水,不知道是哪里出了问题,麻烦大家指导一下,谢谢!

在中国程序员是青春饭吗?

今年,我也32了 ,为了不给大家误导,咨询了猎头、圈内好友,以及年过35岁的几位老程序员……舍了老脸去揭人家伤疤……希望能给大家以帮助,记得帮我点赞哦。 目录: 你以为的人生 一次又一次的伤害 猎头界的真相 如何应对互联网行业的「中年危机」 一、你以为的人生 刚入行时,拿着傲人的工资,想着好好干,以为我们的人生是这样的: 等真到了那一天,你会发现,你的人生很可能是这样的: ...

程序员请照顾好自己,周末病魔差点一套带走我。

程序员在一个周末的时间,得了重病,差点当场去世,还好及时挽救回来了。

和黑客斗争的 6 天!

互联网公司工作,很难避免不和黑客们打交道,我呆过的两家互联网公司,几乎每月每天每分钟都有黑客在公司网站上扫描。有的是寻找 Sql 注入的缺口,有的是寻找线上服务器可能存在的漏洞,大部分都...

搜狗输入法也在挑战国人的智商!

故事总是一个接着一个到来...上周写完《鲁大师已经彻底沦为一款垃圾流氓软件!》这篇文章之后,鲁大师的市场工作人员就找到了我,希望把这篇文章删除掉。经过一番沟通我先把这篇文章从公号中删除了...

总结了 150 余个神奇网站,你不来瞅瞅吗?

原博客再更新,可能就没了,之后将持续更新本篇博客。

副业收入是我做程序媛的3倍,工作外的B面人生是怎样的?

提到“程序员”,多数人脑海里首先想到的大约是:为人木讷、薪水超高、工作枯燥…… 然而,当离开工作岗位,撕去层层标签,脱下“程序员”这身外套,有的人生动又有趣,马上展现出了完全不同的A/B面人生! 不论是简单的爱好,还是正经的副业,他们都干得同样出色。偶尔,还能和程序员的特质结合,产生奇妙的“化学反应”。 @Charlotte:平日素颜示人,周末美妆博主 大家都以为程序媛也个个不修边幅,但我们也许...

MySQL数据库面试题(2020最新版)

文章目录数据库基础知识为什么要使用数据库什么是SQL?什么是MySQL?数据库三大范式是什么mysql有关权限的表都有哪几个MySQL的binlog有有几种录入格式?分别有什么区别?数据类型mysql有哪些数据类型引擎MySQL存储引擎MyISAM与InnoDB区别MyISAM索引与InnoDB索引的区别?InnoDB引擎的4大特性存储引擎选择索引什么是索引?索引有哪些优缺点?索引使用场景(重点)...

如果你是老板,你会不会踢了这样的员工?

有个好朋友ZS,是技术总监,昨天问我:“有一个老下属,跟了我很多年,做事勤勤恳恳,主动性也很好。但随着公司的发展,他的进步速度,跟不上团队的步伐了,有点...

我入职阿里后,才知道原来简历这么写

私下里,有不少读者问我:“二哥,如何才能写出一份专业的技术简历呢?我总感觉自己写的简历太烂了,所以投了无数份,都石沉大海了。”说实话,我自己好多年没有写过简历了,但我认识的一个同行,他在阿里,给我说了一些他当年写简历的方法论,我感觉太牛逼了,实在是忍不住,就分享了出来,希望能够帮助到你。 01、简历的本质 作为简历的撰写者,你必须要搞清楚一点,简历的本质是什么,它就是为了来销售你的价值主张的。往深...

优雅的替换if-else语句

场景 日常开发,if-else语句写的不少吧??当逻辑分支非常多的时候,if-else套了一层又一层,虽然业务功能倒是实现了,但是看起来是真的很不优雅,尤其是对于我这种有强迫症的程序"猿",看到这么多if-else,脑袋瓜子就嗡嗡的,总想着解锁新姿势:干掉过多的if-else!!!本文将介绍三板斧手段: 优先判断条件,条件不满足的,逻辑及时中断返回; 采用策略模式+工厂模式; 结合注解,锦...

离职半年了,老东家又发 offer,回不回?

有小伙伴问松哥这个问题,他在上海某公司,在离职了几个月后,前公司的领导联系到他,希望他能够返聘回去,他很纠结要不要回去? 俗话说好马不吃回头草,但是这个小伙伴既然感到纠结了,我觉得至少说明了两个问题:1.曾经的公司还不错;2.现在的日子也不是很如意。否则应该就不会纠结了。 老实说,松哥之前也有过类似的经历,今天就来和小伙伴们聊聊回头草到底吃不吃。 首先一个基本观点,就是离职了也没必要和老东家弄的苦...

2020阿里全球数学大赛:3万名高手、4道题、2天2夜未交卷

阿里巴巴全球数学竞赛( Alibaba Global Mathematics Competition)由马云发起,由中国科学技术协会、阿里巴巴基金会、阿里巴巴达摩院共同举办。大赛不设报名门槛,全世界爱好数学的人都可参与,不论是否出身数学专业、是否投身数学研究。 2020年阿里巴巴达摩院邀请北京大学、剑桥大学、浙江大学等高校的顶尖数学教师组建了出题组。中科院院士、美国艺术与科学院院士、北京国际数学...

男生更看重女生的身材脸蛋,还是思想?

往往,我们看不进去大段大段的逻辑。深刻的哲理,往往短而精悍,一阵见血。问:产品经理挺漂亮的,有点心动,但不知道合不合得来。男生更看重女生的身材脸蛋,还是...

程序员为什么千万不要瞎努力?

本文作者用对比非常鲜明的两个开发团队的故事,讲解了敏捷开发之道 —— 如果你的团队缺乏统一标准的环境,那么即使勤劳努力,不仅会极其耗时而且成果甚微,使用...

为什么程序员做外包会被瞧不起?

二哥,有个事想询问下您的意见,您觉得应届生值得去外包吗?公司虽然挺大的,中xx,但待遇感觉挺低,马上要报到,挺纠结的。

当HR压你价,说你只值7K,你该怎么回答?

当HR压你价,说你只值7K时,你可以流畅地回答,记住,是流畅,不能犹豫。 礼貌地说:“7K是吗?了解了。嗯~其实我对贵司的面试官印象很好。只不过,现在我的手头上已经有一份11K的offer。来面试,主要也是自己对贵司挺有兴趣的,所以过来看看……”(未完) 这段话主要是陪HR互诈的同时,从公司兴趣,公司职员印象上,都给予对方正面的肯定,既能提升HR的好感度,又能让谈判气氛融洽,为后面的发挥留足空间。...

面试:第十六章:Java中级开发(16k)

HashMap底层实现原理,红黑树,B+树,B树的结构原理 Spring的AOP和IOC是什么?它们常见的使用场景有哪些?Spring事务,事务的属性,传播行为,数据库隔离级别 Spring和SpringMVC,MyBatis以及SpringBoot的注解分别有哪些?SpringMVC的工作原理,SpringBoot框架的优点,MyBatis框架的优点 SpringCould组件有哪些,他们...

面试阿里p7,被按在地上摩擦,鬼知道我经历了什么?

面试阿里p7被问到的问题(当时我只知道第一个):@Conditional是做什么的?@Conditional多个条件是什么逻辑关系?条件判断在什么时候执...

面试了一个 31 岁程序员,让我有所触动,30岁以上的程序员该何去何从?

最近面试了一个31岁8年经验的程序猿,让我有点感慨,大龄程序猿该何去何从。

大三实习生,字节跳动面经分享,已拿Offer

说实话,自己的算法,我一个不会,太难了吧

程序员垃圾简历长什么样?

已经连续五年参加大厂校招、社招的技术面试工作,简历看的不下于万份 这篇文章会用实例告诉你,什么是差的程序员简历! 疫情快要结束了,各个公司也都开始春招了,作为即将红遍大江南北的新晋UP主,那当然要为小伙伴们做点事(手动狗头)。 就在公众号里公开征简历,义务帮大家看,并一一点评。《启舰:春招在即,义务帮大家看看简历吧》 一石激起千层浪,三天收到两百多封简历。 花光了两个星期的所有空闲时...

《Oracle Java SE编程自学与面试指南》最佳学习路线图2020年最新版(进大厂必备)

正确选择比瞎努力更重要!

《Oracle Java SE编程自学与面试指南》最佳学习路线图(2020最新版)

正确选择比瞎努力更重要!

都前后端分离了,咱就别做页面跳转了!统统 JSON 交互

文章目录1. 无状态登录1.1 什么是有状态1.2 什么是无状态1.3 如何实现无状态1.4 各自优缺点2. 登录交互2.1 前后端分离的数据交互2.2 登录成功2.3 登录失败3. 未认证处理方案4. 注销登录 这是本系列的第四篇,有小伙伴找不到之前文章,松哥给大家列一个索引出来: 挖一个大坑,Spring Security 开搞! 松哥手把手带你入门 Spring Security,别再问密...

字节跳动面试官竟然问了我JDBC?

轻松等回家通知

面试官:你连SSO都不懂,就别来面试了

大厂竟然要考我SSO,卧槽。

阿里面试官让我用Zk(Zookeeper)实现分布式锁

他可能没想到,我当场手写出来了

终于,月薪过5万了!

来看几个问题想不想月薪超过5万?想不想进入公司架构组?想不想成为项目组的负责人?想不想成为spring的高手,超越99%的对手?那么本文内容是你必须要掌握的。本文主要详解bean的生命...

自从喜欢上了B站这12个UP主,我越来越觉得自己是个废柴了!

不怕告诉你,我自从喜欢上了这12个UP主,哔哩哔哩成为了我手机上最耗电的软件,几乎每天都会看,可是吧,看的越多,我就越觉得自己是个废柴,唉,老天不公啊,不信你看看…… 间接性踌躇满志,持续性混吃等死,都是因为你们……但是,自己的学习力在慢慢变强,这是不容忽视的,推荐给你们! 都说B站是个宝,可是有人不会挖啊,没事,今天咱挖好的送你一箩筐,首先啊,我在B站上最喜欢看这个家伙的视频了,为啥 ,咱撇...

代码注释如此沙雕,会玩还是你们程序员!

某站后端代码被“开源”,同时刷遍全网的,还有代码里的那些神注释。 我们这才知道,原来程序员个个都是段子手;这么多年来,我们也走过了他们的无数套路… 首先,产品经理,是永远永远吐槽不完的!网友的评论也非常扎心,说看这些代码就像在阅读程序员的日记,每一页都写满了对产品经理的恨。 然后,也要发出直击灵魂的质问:你是尊贵的付费大会员吗? 这不禁让人想起之前某音乐app的穷逼Vip,果然,穷逼在哪里都是...

立即提问
相关内容推荐