交叉编译 glibc-2.14.1 for ARM平台,make的时候报如下错误,怎么解?

No rule to make target /root/cross_compile_from_scratch/glibc-build/misc/ioperm.o', needed by/root/cross_compile_from_scratch/glibc-build/misc/stamp.o'

2个回答

你下载的源码是否针对arm编译,是否都配置好含环境了

依赖不完整,看样子是需要先编译的没有编译

Csdn user default icon
上传中...
上传图片
插入图片
抄袭、复制答案,以达到刷声望分或其他目的的行为,在CSDN问答是严格禁止的,一经发现立刻封号。是时候展现真正的技术了!
其他相关推荐
我在CentOS6.5升级glibc-2.14 make install出现错误
我在CentOS6.5升级glibc-2.14 make install出现错误:Can't open configuration file /opt/glibc-2.14/etc/ld.so.conf: No such file or directory。 大家有谁遇到过,请帮我解决下子,困扰我了。谢谢!我没有悬赏分数了,抱歉。
升级glibc2.14失败,如何解决?
在CentOS 6环境下升级Android SDK的platform-tools版本到最新的23时,报/lib64/libc.so.6: version `GLIBC_2.14' not found错误,升级glibc2.14出现glibc-2.14/etc/ld.so.conf: No such file or directory错误,使用命令touch /glibc-2.14/etc/ld.so.conf不再报错,但查看glibc安装版本还是不对,系统的glibc版本始终是glibc-2.12,也就是依然没有安装进去,使用export LD_LIBRARY_PATH=/opt/glibc-2.14/lib:$LD_LIBRARY_PATH修改过临时变量,都不能解决,请问如何成功安装glibc?谢谢!备注:glibc的版本我用的是glibc-2.14.tar.xz这个压缩包。
arm交叉编译STLport-5.2.1库,编译错误?
**编译环境:** Ubuntu 12.04.1 LTS (GNU/Linux 3.2.0-24-generic x86_64) **编译器:** arm-hisiv300nptl-linux **编译过程:** $tar -xvf STLport-5.2.1.tar.bz2 $cd STLport-5.2.1 $./configure --target=arm-hisiv300-linux $make **编译错误打印:** In file included from ../../src/c_locale.c:26:0: ../../src/c_locale_glibc/c_locale_glibc2.c: In function ‘_Locale_ctype_name’: ../../src/c_locale_glibc/c_locale_glibc2.c:162:27: error: dereferencing pointer to incomplete type return ((locale_t)__loc)->__names[LC_CTYPE]; ^ ../../src/c_locale_glibc/c_locale_glibc2.c: In function ‘_Locale_numeric_name’: ../../src/c_locale_glibc/c_locale_glibc2.c:172:27: error: dereferencing pointer to incomplete type return ((locale_t)__loc)->__names[LC_NUMERIC]; ^ ../../src/c_locale_glibc/c_locale_glibc2.c: In function ‘_Locale_time_name’: ../../src/c_locale_glibc/c_locale_glibc2.c:177:27: error: dereferencing pointer to incomplete type return ((locale_t)__loc)->__names[LC_TIME]; ^ ../../src/c_locale_glibc/c_locale_glibc2.c: In function ‘_Locale_collate_name’: ../../src/c_locale_glibc/c_locale_glibc2.c:182:27: error: dereferencing pointer to incomplete type return ((locale_t)__loc)->__names[LC_COLLATE]; ^ ../../src/c_locale_glibc/c_locale_glibc2.c: In function ‘_Locale_monetary_name’: ../../src/c_locale_glibc/c_locale_glibc2.c:187:27: error: dereferencing pointer to incomplete type return ((locale_t)__loc)->__names[LC_MONETARY]; ^ ../../src/c_locale_glibc/c_locale_glibc2.c: In function ‘_Locale_messages_name’: ../../src/c_locale_glibc/c_locale_glibc2.c:192:27: error: dereferencing pointer to incomplete type return ((locale_t)__loc)->__names[LC_MESSAGES]; ^ In file included from ../../src/stlport_prefix.h:21:0, from ../../src/c_locale.c:19: ../../src/c_locale_glibc/c_locale_glibc2.c: In function ‘_Locale_ctype_table’: ../../src/c_locale_glibc/c_locale_glibc2.c:283:74: error: dereferencing pointer to incomplete type _STLP_STATIC_ASSERT( sizeof(_Locale_mask_t) == sizeof(((locale_t)__loc)->__ct ype_b[0]) ) ^ ../../stlport/stl/config/features.h:311:66: note: in definition of macro ‘_STLP_ STATIC_ASSERT’ # define _STLP_STATIC_ASSERT(expr) typedef char __static_assert[expr ? 1 : -1] ; ^ In file included from ../../src/c_locale.c:26:0: ../../src/c_locale_glibc/c_locale_glibc2.c:284:27: error: dereferencing pointer to incomplete type return ((locale_t)__loc)->__ctype_b; ^ ../../src/c_locale_glibc/c_locale_glibc2.c: In function ‘_Locale_toupper’: ../../src/c_locale_glibc/c_locale_glibc2.c:288:27: error: dereferencing pointer to incomplete type { return ((locale_t)__loc)->__ctype_toupper[c]; } ^ ../../src/c_locale_glibc/c_locale_glibc2.c: In function ‘_Locale_tolower’: ../../src/c_locale_glibc/c_locale_glibc2.c:291:27: error: dereferencing pointer to incomplete type { return ((locale_t)__loc)->__ctype_tolower[c]; } ^ ../../src/c_locale_glibc/c_locale_glibc2.c: In function ‘_Locale_decimal_point’: ../../src/c_locale_glibc/c_locale_glibc2.c:463:10: error: invalid type argument of unary ‘*’ (have ‘int’) return *(nl_langinfo_l(RADIXCHAR, (locale_t)__loc)); ^ ../../src/c_locale_glibc/c_locale_glibc2.c: In function ‘_Locale_thousands_sep’: ../../src/c_locale_glibc/c_locale_glibc2.c:468:10: error: invalid type argument of unary ‘*’ (have ‘int’) return *(nl_langinfo_l(THOUSEP, (locale_t)__loc)); ^
交叉编译 skipping incompatible libc.so.6
交叉编译libevent,有两个交叉编译工具链,其中一个编译通过了,另一个编译有问题。 ``` root@us16044:/opt/x86/applications/libeventlibevent-2.1.11-stable/# ./configure --prefix=/opt/x86/applications/libevent/libevent-2.1.11-stable/install-arago/ --host=arm-none-linux CC=/opt/vbox/arago-linux-devkit/bin/arm-arago-linux-gnueabi-gcc CXX=/opt/vbox/arago-linux-devkit/bin/arm-arago-linux-gnueabi-g++ root@us16044:/opt/x86/applications/libeventlibevent-2.1.11-stable/#make ...省略 /opt/vbox/arago-linux-devkit/bin/../lib/gcc/arm-arago-linux-gnueabi/4.5.3/../../../../arm-arago-linux-gnueabi/bin/ld: skipping incompatible /opt/vbox/arago-linux-devkit/bin/../lib/gcc/arm-arago-linux-gnueabi/4.5.3/../../../../arm-arago-linux-gnueabi/lib/../../lib/libc.so.6 when searching for ../../lib/libc.so.6 ...省略 ``` libc.so.6是存在的 ``` root@us16044:/opt/x86/applications/libevent# objdump -p /opt/vbox/arago-linux-devkit/lib/libc.so.6 /opt/vbox/arago-linux-devkit/lib/libc.so.6: file format elf32-i386 Program Header: PHDR off 0x00000034 vaddr 0x00000034 paddr 0x00000034 align 2**2 filesz 0x00000140 memsz 0x00000140 flags r-x INTERP off 0x0013ac20 vaddr 0x0013ac20 paddr 0x0013ac20 align 2**5 filesz 0x00000021 memsz 0x00000021 flags r-- LOAD off 0x00000000 vaddr 0x00000000 paddr 0x00000000 align 2**12 filesz 0x00154ae8 memsz 0x00154ae8 flags r-x LOAD off 0x001551c4 vaddr 0x001561c4 paddr 0x001561c4 align 2**12 filesz 0x000027d8 memsz 0x00005804 flags rw- DYNAMIC off 0x00156d7c vaddr 0x00157d7c paddr 0x00157d7c align 2**2 filesz 0x000000f0 memsz 0x000000f0 flags rw- NOTE off 0x00000174 vaddr 0x00000174 paddr 0x00000174 align 2**2 filesz 0x00000020 memsz 0x00000020 flags r-- TLS off 0x001551c4 vaddr 0x001561c4 paddr 0x001561c4 align 2**2 filesz 0x00000008 memsz 0x00000040 flags r-- EH_FRAME off 0x0013ac44 vaddr 0x0013ac44 paddr 0x0013ac44 align 2**2 filesz 0x00003304 memsz 0x00003304 flags r-- STACK off 0x00000000 vaddr 0x00000000 paddr 0x00000000 align 2**2 filesz 0x00000000 memsz 0x00000000 flags rw- RELRO off 0x001551c4 vaddr 0x001561c4 paddr 0x001561c4 align 2**0 filesz 0x00001e3c memsz 0x00001e3c flags r-- Dynamic Section: NEEDED ld-linux.so.2 SONAME libc.so.6 INIT 0x00016af0 FINI_ARRAY 0x001561cc FINI_ARRAYSZ 0x00000004 HASH 0x00151684 GNU_HASH 0x00000194 STRTAB 0x0000cf2c SYMTAB 0x00003dac STRSZ 0x00005a61 SYMENT 0x00000010 PLTGOT 0x00157ff4 PLTRELSZ 0x00000038 PLTREL 0x00000011 JMPREL 0x000169b4 REL 0x00013fb4 RELSZ 0x00002a00 RELENT 0x00000008 VERDEF 0x00013bc0 VERDEFNUM 0x0000001b FLAGS 0x00000010 VERNEED 0x00013f74 VERNEEDNUM 0x00000001 VERSYM 0x0001298e RELCOUNT 0x000004e2 Version definitions: 1 0x01 0x0865f4e6 libc.so.6 2 0x00 0x0d696910 GLIBC_2.0 3 0x00 0x0d696911 GLIBC_2.1 GLIBC_2.0 4 0x00 0x09691f71 GLIBC_2.1.1 GLIBC_2.1 5 0x00 0x09691f72 GLIBC_2.1.2 GLIBC_2.1.1 6 0x00 0x09691f73 GLIBC_2.1.3 GLIBC_2.1.2 7 0x00 0x0d696912 GLIBC_2.2 GLIBC_2.1.3 8 0x00 0x09691a71 GLIBC_2.2.1 GLIBC_2.2 9 0x00 0x09691a72 GLIBC_2.2.2 GLIBC_2.2.1 10 0x00 0x09691a73 GLIBC_2.2.3 GLIBC_2.2.2 11 0x00 0x09691a74 GLIBC_2.2.4 GLIBC_2.2.3 12 0x00 0x09691a76 GLIBC_2.2.6 GLIBC_2.2.4 13 0x00 0x0d696913 GLIBC_2.3 GLIBC_2.2.6 14 0x00 0x09691972 GLIBC_2.3.2 GLIBC_2.3 15 0x00 0x09691973 GLIBC_2.3.3 GLIBC_2.3.2 16 0x00 0x09691974 GLIBC_2.3.4 GLIBC_2.3.3 17 0x00 0x0d696914 GLIBC_2.4 GLIBC_2.3.4 18 0x00 0x0d696915 GLIBC_2.5 GLIBC_2.4 19 0x00 0x0d696916 GLIBC_2.6 GLIBC_2.5 20 0x00 0x0d696917 GLIBC_2.7 GLIBC_2.6 21 0x00 0x0d696918 GLIBC_2.8 GLIBC_2.7 22 0x00 0x0d696919 GLIBC_2.9 GLIBC_2.8 23 0x00 0x06969190 GLIBC_2.10 GLIBC_2.9 24 0x00 0x06969191 GLIBC_2.11 GLIBC_2.10 25 0x00 0x06969192 GLIBC_2.12 GLIBC_2.11 26 0x00 0x0963cf85 GLIBC_PRIVATE GLIBC_2.12 27 0x00 0x0b792650 GCC_3.0 Version References: required from ld-linux.so.2: 0x0963cf85 0x00 30 GLIBC_PRIVATE 0x0d696913 0x00 29 GLIBC_2.3 0x0d696911 0x00 28 GLIBC_2.1 ``` c/c++新手,编译过程这边不太懂,求帮助
centOS7系统中报GLIBC_2.14' not found
centOS7版本的linux系统启动一个服务时报: ./lib/libc.so.6: version `GLIBC_2.14' not found (required by /lib64/librt.so.1) 使用strings /lib64/libc.so.6 | grep GLIBC: GLIBC_2.2.5 GLIBC_2.2.6 GLIBC_2.3 GLIBC_2.3.2 GLIBC_2.3.3 GLIBC_2.3.4 GLIBC_2.4 GLIBC_2.5 GLIBC_2.6 GLIBC_2.7 GLIBC_2.8 GLIBC_2.9 GLIBC_2.10 GLIBC_2.11 GLIBC_2.12 GLIBC_2.13 GLIBC_2.14 GLIBC_2.15 GLIBC_2.16 GLIBC_2.17 GLIBC_PRIVATE 是存在GLIBC_2.14的,这是什么原因,应该怎么解决呢,请大家帮忙解决下,谢谢
求救:Linux 出现segmentation fault 问题怎么解决
OpenSUSE 11原来安装的glibc-2.11,下载了glibc-2.14. 编译安装, 然后执行了 ln -sf /usr/local/glibc-2.14/lib/libc-2.14.so /lib64/libc.so.6 就出现segmentation fault ,任何操作都无法执行,求救解决方法
linux设置的环境变量无效
我是rhel6.2系统,执行某程序时提示: /lib64/libc.so.6: version `GLIBC_2.14' not found 于是安装glibc-2.14,安装位置在/opt/glibc-2.14,安装完了以后增加临时环境变量: export LD_LIBRARY_PATH=/opt/glibc-2.14/lib,glibc-1.14,这样就ok了。 但环境临时环境变量重启就会失效,于是我在/etc/profile末尾增加了这样一行 export PATH="/opt/glibc-2.14/lib:$PATH 但这样行不管用,重启后仍然会报错: /lib64/libc.so.6: version `GLIBC_2.14' not found , 只能通过设置临时环境变量的方法让其不报错。很困惑
安装glibc出错怎么解决!!!!!
mv: "/mnt/hgfs/linux/glibc-2.17/build/csu/stamp.oST" 与"/mnt/hgfs/linux/glibc-2.17/build/csu/stamp.oS" 为同一文件 make[2]: *** [/mnt/hgfs/linux/glibc-2.17/build/csu/stamp.oS] 错误 1 make[2]: *** 正在等待未完成的任务.... make[2]: Leaving directory `/mnt/hgfs/linux/glibc-2.17/csu' make[1]: *** [csu/subdir_lib] 错误 2 make[1]: Leaving directory `/mnt/hgfs/linux/glibc-2.17' make: *** [all] 错误 2 [root@localhost build]# make instal make -r PARALLELMFLAGS="" -C .. objdir=`pwd` instal make[1]: Entering directory `/mnt/hgfs/linux/glibc-2.17' make[1]: *** 没有规则可以创建目标“instal”。 停止。 make[1]: Leaving directory `/mnt/hgfs/linux/glibc-2.17' make: *** [instal] 错误 2 [root@localhost build]# ../configure --prefix=/opt/glibc-2.17^C [root@localhost build]#
ubuntu12.04下 opencv库交叉编译后 动态库找不到
ubuntu上我装了pc 和arm 两个版本的opencv2.4.9 目录分别是/usr/local/opencv2.4.9 和/opt/opencv2.4.9-for-arm pc版本的库文件都在/usr/local/lib下 arm版本库文件在/opt/opencv2.4.9-for-arm/lib下 whereis libopencv___core 的时候,只列出的/usr/local/lib/libopencv_core.so 交叉编译器在/opt/Embedsky/gcc-4.6.2-glibc-2.13-linaro-multilib-2011.12/tq-linaro-toolchain/bin下 我写一个opencv测试程序test.cpp 交叉编译出现警告 ``` # arm-linux-g++ -o test test.cpp -I /opt/opencv2.4.9-for-arm/lib/include -L /opt/opencv2.4.9-for-arm/lib -lopencv_core -lopencv_highgui -lpthread -lrt In file included from /opt/opencv2.4.9-for-arm/lib/include/opencv2/flann/kmeans_index.h:50:0, from /opt/opencv2.4.9-for-arm/lib/include/opencv2/flann/all_indices.h:38, from /opt/opencv2.4.9-for-arm/lib/include/opencv2/flann/flann_base.hpp:44, from /opt/opencv2.4.9-for-arm/lib/include/opencv2/flann/flann.hpp:50, from /opt/opencv2.4.9-for-arm/lib/include/opencv/cv.h:69, from test.cpp:2: /opt/opencv2.4.9-for-arm/lib/include/opencv2/flann/logger.h:73:9: note: the mangling of 'va_list' has changed in GCC 4.4 /opt/Embedsky/gcc-4.6.2-glibc-2.13-linaro-multilib-2011.12/tq-linaro-toolchain/bin/../lib/gcc/arm-fsl-linux-gnueabi/4.6.2/../../../../arm-fsl-linux-gnueabi/bin/ld: warning: ../../lib/libopencv_core.so, needed by /opt/opencv2.4.9-for-arm/lib/libopencv_highgui.so, not found (try using -rpath or -rpath-link) /opt/Embedsky/gcc-4.6.2-glibc-2.13-linaro-multilib-2011.12/tq-linaro-toolchain/bin/../lib/gcc/arm-fsl-linux-gnueabi/4.6.2/../../../../arm-fsl-linux-gnueabi/bin/ld: warning: ../../lib/libopencv_imgproc.so, needed by /opt/opencv2.4.9-for-arm/lib/libopencv_highgui.so, not found (try using -rpath or -rpath-link) root@tsie-All-Series:/home/tsie/nfs/test/opencv_test# whereis libopencv_core libopencv_core: /usr/local/lib/libopencv_core.so ``` 这里面好像用到交叉编译器的ld,找opencv的.so文件看提示是跑到交叉编译器所在文件夹里面的lib去找?? 我也吧opencv的交叉库放到这个文件夹里面,再编译还是同样的问题 然后我尝试加上运行时库路径参数 -Wl,-rpath,/opt/opencv2.4.9-for-arm/lib,再编译,弹出来一样的信息。 然后,就没有然后了。我晕 这究竟谁什么问题啊 求各路大神给点思路
linux升级glibc2.11报错
linux升级glibc2.11报错,部分报错信息如下: gcc ../sysdeps/x86_64/dl-trampoline.S -c -I../include -I/usr/glibc/glibc-2.11.1/glibc-build/elf -I/usr/glibc/glibc-2.11.1/glibc-build -I../sysdeps/x86_64/elf -I../nptl/sysdeps/unix/sysv/linux/x86_64 -I../sysdeps/unix/sysv/linux/x86_64 -I../sysdeps/unix/sysv/linux/wordsize-64 -I../nptl/sysdeps/unix/sysv/linux -I../nptl/sysdeps/pthread -I../sysdeps/pthread -I../ports/sysdeps/unix/sysv/linux -I../sysdeps/unix/sysv/linux -I../sysdeps/gnu -I../sysdeps/unix/common -I../sysdeps/unix/mman -I../sysdeps/unix/inet -I../nptl/sysdeps/unix/sysv -I../ports/sysdeps/unix/sysv -I../sysdeps/unix/sysv -I../sysdeps/unix/x86_64 -I../nptl/sysdeps/unix -I../ports/sysdeps/unix -I../sysdeps/unix -I../sysdeps/posix -I../sysdeps/x86_64/fpu -I../nptl/sysdeps/x86_64 -I../sysdeps/x86_64 -I../sysdeps/wordsize-64 -I../sysdeps/ieee754/ldbl-96 -I../sysdeps/ieee754/dbl-64 -I../sysdeps/ieee754/flt-32 -I../sysdeps/ieee754 -I../sysdeps/generic/elf -I../sysdeps/generic -I../nptl -I../ports -I.. -I../libio -I. -D_LIBC_REENTRANT -include ../include/libc-symbols.h -DASSEMBLER -g -Wa,--noexecstack -o /usr/glibc/glibc-2.11.1/glibc-build/elf/dl-trampoline.o -MD -MP -MF /usr/glibc/glibc-2.11.1/glibc-build/elf/dl-trampoline.o.dt -MT /usr/glibc/glibc-2.11.1/glibc-build/elf/dl-trampoline.o ../sysdeps/x86_64/dl-trampoline.h: Assembler messages: ../sysdeps/x86_64/dl-trampoline.h:23: Error: no such instruction: `vmovdqu %ymm0,(192)(%rsp)' ../sysdeps/x86_64/dl-trampoline.h:24: Error: no such instruction: `vmovdqu %ymm1,(192+64)(%rsp)' ../sysdeps/x86_64/dl-trampoline.h:25: Error: no such instruction: `vmovdqu %ymm2,(192+64*2)(%rsp)' ../sysdeps/x86_64/dl-trampoline.h:26: Error: no such instruction: `vmovdqu %ymm3,(192+64*3)(%rsp)' ../sysdeps/x86_64/dl-trampoline.h:27: Error: no such instruction: `vmovdqu %ymm4,(192+64*4)(%rsp)' ../sysdeps/x86_64/dl-trampoline.h:28: Error: no such instruction: `vmovdqu %ymm5,(192+64*5)(%rsp)' ../sysdeps/x86_64/dl-trampoline.h:29: Error: no such instruction: `vmovdqu %ymm6,(192+64*6)(%rsp)' ../sysdeps/x86_64/dl-trampoline.h:30: Error: no such instruction: `vmovdqu %ymm7,(192+64*7)(%rsp)' ../sysdeps/x86_64/dl-trampoline.h:34: Error: no such instruction: `vmovdqa %xmm0,(704)(%rsp)' ../sysdeps/x86_64/dl-trampoline.h:35: Error: no such instruction: `vmovdqa %xmm1,(704+16)(%rsp)' ../sysdeps/x86_64/dl-trampoline.h:36: Error: no such instruction: `vmovdqa %xmm2,(704+16*2)(%rsp)' ../sysdeps/x86_64/dl-trampoline.h:37: Error: no such instruction: `vmovdqa %xmm3,(704+16*3)(%rsp)' ../sysdeps/x86_64/dl-trampoline.h:38: Error: no such instruction: `vmovdqa %xmm4,(704+16*4)(%rsp)' ../sysdeps/x86_64/dl-trampoline.h:39: Error: no such instruction: `vmovdqa %xmm5,(704+16*5)(%rsp)' ../sysdeps/x86_64/dl-trampoline.h:40: Error: no such instruction: `vmovdqa %xmm6,(704+16*6)(%rsp)' ../sysdeps/x86_64/dl-trampoline.h:41: Error: no such instruction: `vmovdqa %xmm7,(704+16*7)(%rsp)' ../sysdeps/x86_64/dl-trampoline.h:70: Error: no such instruction: `vpcmpeqq (704)(%rsp),%xmm0,%xmm8' ../sysdeps/x86_64/dl-trampoline.h:71: Error: no such instruction: `vpmovmskb %xmm8,%esi' ../sysdeps/x86_64/dl-trampoline.h:74: Error: no such instruction: `vmovdqa %xmm0,(192)(%rsp)' ../sysdeps/x86_64/dl-trampoline.h:76: Error: no such instruction: `vmovdqu (192)(%rsp),%ymm0' ../sysdeps/x86_64/dl-trampoline.h:77: Error: no such instruction: `vmovdqa %xmm0,(64)(%rsp)' ../sysdeps/x86_64/dl-trampoline.h:79: Error: no such instruction: `vpcmpeqq (704+16)(%rsp),%xmm1,%xmm8' ../sysdeps/x86_64/dl-trampoline.h:80: Error: no such instruction: `vpmovmskb %xmm8,%esi' ../sysdeps/x86_64/dl-trampoline.h:83: Error: no such instruction: `vmovdqa %xmm1,(192+64)(%rsp)' ../sysdeps/x86_64/dl-trampoline.h:85: Error: no such instruction: `vmovdqu (192+64)(%rsp),%ymm1' ../sysdeps/x86_64/dl-trampoline.h:86: Error: no such instruction: `vmovdqa %xmm1,(64+16)(%rsp)' ../sysdeps/x86_64/dl-trampoline.h:88: Error: no such instruction: `vpcmpeqq (704+16*2)(%rsp),%xmm2,%xmm8' ../sysdeps/x86_64/dl-trampoline.h:89: Error: no such instruction: `vpmovmskb %xmm8,%esi' ../sysdeps/x86_64/dl-trampoline.h:92: Error: no such instruction: `vmovdqa %xmm2,(192+64*2)(%rsp)' ../sysdeps/x86_64/dl-trampoline.h:94: Error: no such instruction: `vmovdqu (192+64*2)(%rsp),%ymm2' ../sysdeps/x86_64/dl-trampoline.h:95: Error: no such instruction: `vmovdqa %xmm2,(64+16*2)(%rsp)' ../sysdeps/x86_64/dl-trampoline.h:97: Error: no such instruction: `vpcmpeqq (704+16*3)(%rsp),%xmm3,%xmm8' ../sysdeps/x86_64/dl-trampoline.h:98: Error: no such instruction: `vpmovmskb %xmm8,%esi' ../sysdeps/x86_64/dl-trampoline.h:101: Error: no such instruction: `vmovdqa %xmm3,(192+64*3)(%rsp)' ../sysdeps/x86_64/dl-trampoline.h:103: Error: no such instruction: `vmovdqu (192+64*3)(%rsp),%ymm3' ../sysdeps/x86_64/dl-trampoline.h:104: Error: no such instruction: `vmovdqa %xmm3,(64+16*3)(%rsp)' ../sysdeps/x86_64/dl-trampoline.h:106: Error: no such instruction: `vpcmpeqq (704+16*4)(%rsp),%xmm4,%xmm8' ../sysdeps/x86_64/dl-trampoline.h:107: Error: no such instruction: `vpmovmskb %xmm8,%esi' ../sysdeps/x86_64/dl-trampoline.h:110: Error: no such instruction: `vmovdqa %xmm4,(192+64*4)(%rsp)' ../sysdeps/x86_64/dl-trampoline.h:112: Error: no such instruction: `vmovdqu (192+64*4)(%rsp),%ymm4' ../sysdeps/x86_64/dl-trampoline.h:113: Error: no such instruction: `vmovdqa %xmm4,(64+16*4)(%rsp)' ../sysdeps/x86_64/dl-trampoline.h:115: Error: no such instruction: `vpcmpeqq (704+16*5)(%rsp),%xmm5,%xmm8' ../sysdeps/x86_64/dl-trampoline.h:116: Error: no such instruction: `vpmovmskb %xmm8,%esi' ../sysdeps/x86_64/dl-trampoline.h:119: Error: no such instruction: `vmovdqa %xmm5,(192+64*5)(%rsp)' ../sysdeps/x86_64/dl-trampoline.h:121: Error: no such instruction: `vmovdqu (192+64*5)(%rsp),%ymm5' ../sysdeps/x86_64/dl-trampoline.h:122: Error: no such instruction: `vmovdqa %xmm5,(64+16*5)(%rsp)' ../sysdeps/x86_64/dl-trampoline.h:124: Error: no such instruction: `vpcmpeqq (704+16*6)(%rsp),%xmm6,%xmm8' ../sysdeps/x86_64/dl-trampoline.h:125: Error: no such instruction: `vpmovmskb %xmm8,%esi' ../sysdeps/x86_64/dl-trampoline.h:128: Error: no such instruction: `vmovdqa %xmm6,(192+64*6)(%rsp)' ../sysdeps/x86_64/dl-trampoline.h:130: Error: no such instruction: `vmovdqu (192+64*6)(%rsp),%ymm6' ../sysdeps/x86_64/dl-trampoline.h:131: Error: no such instruction: `vmovdqa %xmm6,(64+16*6)(%rsp)' ../sysdeps/x86_64/dl-trampoline.h:133: Error: no such instruction: `vpcmpeqq (704+16*7)(%rsp),%xmm7,%xmm8' ../sysdeps/x86_64/dl-trampoline.h:134: Error: no such instruction: `vpmovmskb %xmm8,%esi' ../sysdeps/x86_64/dl-trampoline.h:137: Error: no such instruction: `vmovdqa %xmm7,(192+64*7)(%rsp)' ../sysdeps/x86_64/dl-trampoline.h:139: Error: no such instruction: `vmovdqu (192+64*7)(%rsp),%ymm7' ../sysdeps/x86_64/dl-trampoline.h:140: Error: no such instruction: `vmovdqa %xmm7,(64+16*7)(%rsp)' ../sysdeps/x86_64/dl-trampoline.h:217: Error: no such instruction: `vmovdqu %ymm0,80(%rcx)' ../sysdeps/x86_64/dl-trampoline.h:218: Error: no such instruction: `vmovdqu %ymm1,144(%rcx)' ../sysdeps/x86_64/dl-trampoline.h:222: Error: no such instruction: `vmovdqa %xmm0,(208)(%rcx)' ../sysdeps/x86_64/dl-trampoline.h:223: Error: no such instruction: `vmovdqa %xmm1,(208+16)(%rcx)' ../sysdeps/x86_64/dl-trampoline.h:243: Error: no such instruction: `vpcmpeqq (208)(%rsp),%xmm0,%xmm2' ../sysdeps/x86_64/dl-trampoline.h:244: Error: no such instruction: `vpmovmskb %xmm2,%esi' ../sysdeps/x86_64/dl-trampoline.h:247: Error: no such instruction: `vmovdqu 80(%rsp),%ymm0' ../sysdeps/x86_64/dl-trampoline.h:249: Error: no such instruction: `vpcmpeqq (208+16)(%rsp),%xmm1,%xmm2' ../sysdeps/x86_64/dl-trampoline.h:250: Error: no such instruction: `vpmovmskb %xmm2,%esi' ../sysdeps/x86_64/dl-trampoline.h:253: Error: no such instruction: `vmovdqu 144(%rsp),%ymm1' make[2]: *** [/usr/glibc/glibc-2.11.1/glibc-build/elf/dl-trampoline.o] 错误 1 make[2]: Leaving directory `/usr/glibc/glibc-2.11.1/elf' make[1]: *** [elf/subdir_lib] 错误 2 make[1]: Leaving directory `/usr/glibc/glibc-2.11.1' make: *** [all] 错误 2
arm9开发板升级glibc2.14的问题
现在板子里的版本是2.5,然后运行一个Qt程序的时候提示glibc版本太低,运行不了, 于是就开始琢磨着升级板子里的glibc,可是问题来了,我交叉编译了glibc2.14后怎么去替换 板子里原有的2.5呢,每次将libc.so.6软连接到glibc2.14后就出现了段错误,ls cp这些基本 指令都用不了,我也该怎么弄呢??望诸位能点拨一下小弟啊。。。
redhat 升级glibc到2.29版本会对系统产生什么影响?
最近在迁移php的服务器,需要手动安装php编译安装所需的依赖包(运维不让用yum,贼恶心),在安装 libxml2-2.9.8-5.fc30.x86_64(安全部门要求的,要比libxml2-2.9.1-6.e17_2.3.x86_64这个版本高,说是有拒绝服务的风险,我也很无奈)的时候,报错了: ``` error: Failed dependencies: libc.so.6(GLIBC_2.28)(64bit) is needed by libxml2-2.9.8-5.fc30.x86_64 libm.so.6(GLIBC_2.29)(64bit) is needed by libxml2-2.9.8-5.fc30.x86_64 ``` * 问题一:如果我按照它的提示去升级glibc到2.29版本,会对系统产生什么影响吗?因为我查了一下,有些人说系统会起不来,建议不轻易去升级这个。 * 问题二:如果要升级glibc,那么该如何升级呢? * 问题三:或者下一个低一点版本的libxml2包,是不是不需要升级glibc了呢? 希望各位大神不吝赐教,再次谢过!
liunx 安装 systemd-219-42.el7.x86_64.rpm
为啥总是有那么多要安装啊!求大神指点 rpm -ivh systemd-219-42.el7.x86_64.rpm warning: systemd-219-42.el7.x86_64.rpm: Header V3 RSA/SHA256 Signature, key ID f4a80eb5: NOKEY error: Failed dependencies: kmod >= 18-4 is needed by systemd-219-42.el7.x86_64 libc.so.6(GLIBC_2.16)(64bit) is needed by systemd-219-42.el7.x86_64 libc.so.6(GLIBC_2.17)(64bit) is needed by systemd-219-42.el7.x86_64 libcryptsetup.so.4()(64bit) is needed by systemd-219-42.el7.x86_64 libcryptsetup.so.4(CRYPTSETUP_1.0)(64bit) is needed by systemd-219-42.el7.x86_64 libkmod.so.2()(64bit) is needed by systemd-219-42.el7.x86_64 libkmod.so.2(LIBKMOD_5)(64bit) is needed by systemd-219-42.el7.x86_64 liblzma.so.5()(64bit) is needed by systemd-219-42.el7.x86_64 liblzma.so.5(XZ_5.0)(64bit) is needed by systemd-219-42.el7.x86_64 libmount.so.1(MOUNT_2.20)(64bit) is needed by systemd-219-42.el7.x86_64 libqrencode.so.3()(64bit) is needed by systemd-219-42.el7.x86_64 systemd-libs = 219-42.el7 is needed by systemd-219-42.el7.x86_64 dracut < 033-499 conflicts with systemd-219-42.el7.x86_64 initscripts < 9.49.28-1 conflicts with systemd-219-42.el7.x86_64
arm-linux/bin/ld: cannot find -lopencv_imgproc
用qte编译一个opencv程序时,显示如下错误: ligang@ligang-virtual-machine:/work/qtepro/opencv$ make /mysoftware/qte/bin/qmake -unix -o Makefile opencv.pro arm-linux-g++ -Wl,-O1 -Wl,-rpath,/mysoftware/qte/lib -o opencv main.o -L/mysoftware/qte/lib -lopencv_imgproc -lopencv_core -lopencv_highgui -lopencv_ml /usr/local/lib/libopencv_core.so /usr/local/lib/libopencv_highgui.so /usr/local/lib/libopencv_imgproc.so /usr/local/lib/libopencv_ml.so -lQtNetwork -L/mysoftware/tslib/lib -L/mysoftware/qte/lib -lQtCore -lm -lrt -ldl -lpthread /mysoftware/gcc-3.4.5-glibc-2.3.6/bin/../lib/gcc/arm-linux/3.4.5/../../../../arm-linux/bin/ld: skipping incompatible /mysoftware/qte/lib/libopencv_imgproc.so when searching for -lopencv_imgproc /mysoftware/gcc-3.4.5-glibc-2.3.6/bin/../lib/gcc/arm-linux/3.4.5/../../../../arm-linux/bin/ld: skipping incompatible /mysoftware/qte/lib/libopencv_imgproc.so when searching for -lopencv_imgproc /mysoftware/gcc-3.4.5-glibc-2.3.6/bin/../lib/gcc/arm-linux/3.4.5/../../../../arm-linux/bin/ld: cannot find -lopencv_imgproc 配置应该都是正确的,难道是opencv的库没有头文件库吗?还是需要该它的symbollink?
Linux 编译安装libc.so.6时出现Segmentation fault (core dumped)错误导致ls等命令不能用怎么办?
在学校集群上装tensorflow,import tensorflow时出现ImportError: /lib64/libc.so.6: version `GLIBC_2.16' not found,网上查资料按以下步骤进行操作: (1)下载glibc-2.16.0.tar.bz并解压为 ~/Download/glibc-2.16.0 (2)cd ~/Download/glibc-2.16.0/ mkdir build cd build ../configure --prefix=/usr --disable-profile --enable-add-ons --with-headers=/usr/include --with-binutils=/usr/bin make (3) make install时出现错误: ...... ...... ![图片说明](https://img-ask.csdn.net/upload/201901/05/1546689124_286319.jpg) ![图片说明](https://img-ask.csdn.net/upload/201901/05/1546689159_184865.jpg) 如图所示: (1)make install 时出现错误:make[1]: *** [install] Segmentation fault (core dumped) (2)ls等命令无法使用,显示缺少version `GLIBC_2.14' (3)尝试gdb调试,结果显示与(2)中一样的问题 另外,系统本来的libc.so.6链接到libc-2.12.so,最高到GLIBC_2.12,由此看来libc-2.16好像已经安装了一部分。 求各路大神帮帮小弟!!!在线等,挺急的!!!不管是把glibc-2.16安装好还是回退到原来的版本都可以,目的只有一个,那就是让ls,cp,gdb等命令能正常使用。 集群linux版本(red hat)太低了,用起来太麻烦,把系统修复好之后我就不折腾了。
centos yum skip-broken to work around the problem
错误如下: #yum install gcc Loaded plugins: fastestmirror, post-transaction-actions Setting up Install Process Loading mirror speeds from cached hostfile qa_mav_centos6 | 951 B 00:00 qa_mav_centos6.7_i686 | 951 B 00:00 qa_mav_centos6.7_noarch | 951 B 00:00 Resolving Dependencies --> Running transaction check ---> Package gcc.i686 0:4.4.7-16.el6 will be installed --> Processing Dependency: cpp = 4.4.7-16.el6 for package: gcc-4.4.7-16.el6.i686 --> Processing Dependency: libgomp = 4.4.7-16.el6 for package: gcc-4.4.7-16.el6.i686 --> Processing Dependency: cloog-ppl >= 0.15 for package: gcc-4.4.7-16.el6.i686 --> Processing Dependency: glibc-devel >= 2.2.90-12 for package: gcc-4.4.7-16.el6.i686 --> Processing Dependency: libgomp.so.1 for package: gcc-4.4.7-16.el6.i686 --> Running transaction check ---> Package cloog-ppl.i686 0:0.15.7-1.2.el6 will be installed --> Processing Dependency: libppl.so.7 for package: cloog-ppl-0.15.7-1.2.el6.i686 --> Processing Dependency: libppl_c.so.2 for package: cloog-ppl-0.15.7-1.2.el6.i686 ---> Package cpp.i686 0:4.4.7-16.el6 will be installed --> Processing Dependency: libmpfr.so.1 for package: cpp-4.4.7-16.el6.i686 ---> Package glibc-devel.i686 0:2.12-1.166.el6_7.7 will be installed --> Processing Dependency: glibc = 2.12-1.166.el6_7.7 for package: glibc-devel-2.12-1.166.el6_7.7.i686 --> Processing Dependency: glibc-headers = 2.12-1.166.el6_7.7 for package: glibc-devel-2.12-1.166.el6_7.7.i686 --> Processing Dependency: glibc-headers for package: glibc-devel-2.12-1.166.el6_7.7.i686 ---> Package libgomp.i686 0:4.4.7-16.el6 will be installed --> Running transaction check ---> Package glibc-devel.i686 0:2.12-1.166.el6_7.7 will be installed --> Processing Dependency: glibc = 2.12-1.166.el6_7.7 for package: glibc-devel-2.12-1.166.el6_7.7.i686 ---> Package glibc-headers.i686 0:2.12-1.166.el6_7.7 will be installed --> Processing Dependency: glibc = 2.12-1.166.el6_7.7 for package: glibc-headers-2.12-1.166.el6_7.7.i686 ---> Package mpfr.i686 0:2.4.1-6.el6 will be installed ---> Package ppl.i686 0:0.10.2-11.el6 will be installed --> Finished Dependency Resolution Error: Package: glibc-devel-2.12-1.166.el6_7.7.i686 (qa_os_updates_3_0_centos6.7_32_3.0) Requires: glibc = 2.12-1.166.el6_7.7 Installed: glibc-2.12-1.192.el6.i686 (@qa_os_updates_3_3_centos6.7_32_3.3) glibc = 2.12-1.192.el6 Available: glibc-2.12-1.166.el6.i686 (qa_os_centos6.7_32) glibc = 2.12-1.166.el6 Available: glibc-2.12-1.166.el6_7.1.i686 (qa_os_updates_3_0_centos6.7_32_3.0) glibc = 2.12-1.166.el6_7.1 Available: glibc-2.12-1.166.el6_7.3.i686 (qa_os_updates_3_0_centos6.7_32_3.0) glibc = 2.12-1.166.el6_7.3 Available: glibc-2.12-1.166.el6_7.7.i686 (qa_os_updates_3_0_centos6.7_32_3.0) glibc = 2.12-1.166.el6_7.7 Error: Package: glibc-headers-2.12-1.166.el6_7.7.i686 (qa_os_updates_3_0_centos6.7_32_3.0) Requires: glibc = 2.12-1.166.el6_7.7 Installed: glibc-2.12-1.192.el6.i686 (@qa_os_updates_3_3_centos6.7_32_3.3) glibc = 2.12-1.192.el6 Available: glibc-2.12-1.166.el6.i686 (qa_os_centos6.7_32) glibc = 2.12-1.166.el6 Available: glibc-2.12-1.166.el6_7.1.i686 (qa_os_updates_3_0_centos6.7_32_3.0) glibc = 2.12-1.166.el6_7.1 Available: glibc-2.12-1.166.el6_7.3.i686 (qa_os_updates_3_0_centos6.7_32_3.0) glibc = 2.12-1.166.el6_7.3 Available: glibc-2.12-1.166.el6_7.7.i686 (qa_os_updates_3_0_centos6.7_32_3.0) glibc = 2.12-1.166.el6_7.7 You could try using --skip-broken to work around the problem You could try running: rpm -Va --nofiles --nodigest 我的yum源如下: # ls /etc/yum.repos.d/ -l total 152 -rw------- 1 cmcadmin cmcadmin 1414 Oct 31 07:29 cmc_base.repo -rw-r--r-- 1 cmcadmin cmcadmin 113 Oct 31 07:23 cmc_sdeos.repo -rw------- 1 cmcadmin cmcadmin 119 Oct 31 07:29 cmc_sdetools.repo -rw------- 1 cmcadmin cmcadmin 310 Oct 31 07:29 cmc_tsp.repo -rw-r--r-- 1 root root 174 Sep 21 05:21 qa_mav_centos6.7_i686.repo -rw-r--r-- 1 root root 182 Sep 21 05:21 qa_mav_centos6.7_noarch.repo -rw-r--r-- 1 root root 167 Sep 21 05:21 qa_mav_centos6.repo -rw-r--r-- 1 root root 151 Oct 31 07:24 qa_os_centos6.7_32.repo -rw-r--r-- 1 root root 155 Sep 21 05:14 qa_os_centos6.7_i686.repo -rw-r--r-- 1 root root 163 Sep 21 05:14 qa_os_centos6.7_noarch.repo -rw-r--r-- 1 root root 170 Oct 31 07:24 qa_os_noarch_centos6.7_noarch.repo -rw-r--r-- 1 root root 183 Oct 31 07:24 qa_os_updates_3_0_centos6.7_32_3.0.repo -rw-r--r-- 1 root root 183 Oct 31 07:24 qa_os_updates_3_1_centos6.7_32_3.1.repo -rw-r--r-- 1 root root 183 Oct 31 07:24 qa_os_updates_3_2_centos6.7_32_3.2.repo -rw-r--r-- 1 root root 183 Oct 31 07:24 qa_os_updates_3_3_centos6.7_32_3.3.repo -rw-r--r-- 1 root root 183 Oct 31 07:24 qa_os_updates_3_4_centos6.7_32_3.4.repo -rw-r--r-- 1 root root 167 Oct 31 07:24 qa_os_updates_centos6.7_32.repo -rw-r--r-- 1 root root 191 Sep 21 05:14 qa_os_updates_centos6.7_i686_3.0.repo -rw-r--r-- 1 root root 191 Sep 21 05:14 qa_os_updates_centos6.7_i686_3.1.repo -rw-r--r-- 1 root root 187 Sep 21 05:14 qa_os_updates_centos6.7_noarch.repo -rw-r--r-- 1 root root 186 Oct 31 07:24 qa_os_updates_noarch_centos6.7_noarch.repo -rw-r--r-- 1 root root 167 Oct 31 07:24 qa_puppetlabs_centos6.7_32.repo -rw-r--r-- 1 root root 166 Sep 21 05:14 qa_puppetlabs_centos6.7_i686.repo -rw-r--r-- 1 root root 174 Sep 21 05:14 qa_puppetlabs_centos6.7_noarch.repo -rw-r--r-- 1 root root 193 Oct 31 07:24 qa_puppetlabs_dependencies_centos6.7_32.repo -rw-r--r-- 1 root root 205 Sep 21 05:14 qa_puppetlabs_dependencies_centos6.7_i686.repo -rw-r--r-- 1 root root 213 Sep 21 05:14 qa_puppetlabs_dependencies_centos6.7_noarch.repo -rw-r--r-- 1 root root 212 Oct 31 07:24 qa_puppetlabs_dependencies_noarch_centos6.7_noarch.repo -rw-r--r-- 1 root root 186 Oct 31 07:24 qa_puppetlabs_noarch_centos6.7_noarch.repo -rw-r--r-- 1 root root 169 Sep 21 05:14 qa_puppet_modules_webex_noarch.repo -rw-r--r-- 1 root root 151 Sep 21 05:21 qa_slim_noarch32.repo -rw-r--r-- 1 root root 163 Sep 21 05:21 qa_systools_centos6.7_i686.repo -rw-r--r-- 1 root root 170 Sep 21 05:21 qa_systools_centos6.7_noarch.repo -rw-r--r-- 1 root root 165 Oct 31 07:24 qa_systuning_centos6.7_32.repo -rw-r--r-- 1 root root 174 Sep 21 05:14 qa_systuning_centos6.7_i686.repo -rw-r--r-- 1 root root 182 Sep 21 05:14 qa_systuning_centos6.7_noarch.repo -rw-r--r-- 1 root root 184 Oct 31 07:24 qa_systuning_noarch_centos6.7_noarch.repo -rw-r--r-- 1 root root 153 Sep 21 05:21 qa_vmware_centos6.7_i686.repo 已经清除过源缓存:yum clean all 和重新生成源缓存: yum makecache 还是解决不了。
opencv3.1.0交叉编译 使用摄像头 编译出错
opencv3.1.0交叉编译: 宿主机:ubuntu 14.04 交叉编译工具:gcc-4.6.2-glibc-2.13-linaro 在使用Cmake-gui配置时,因为要使用摄像头(OV3640)取图像,进行图像处理,所以将Operating System填为Linux, 并将WITH_V4L勾选上,之后执行make命令,总是编译错误,提示许多的库找不到,如下图中所示; 如果将Operating System填为arm-linux,没有勾选WITH_V4L,则可以make编译通过,但在arm开发板上用OpenCV打不开摄像头,isOpened ()返回值是false。请帮忙分析问题原因,希望给提供些正确的解决办法,非常感激! ![勾选WITH_V4L 编译错误信息](https://img-ask.csdn.net/upload/201605/29/1464522128_617542.png)![勾选WITH_V4L 编译错误信息](https://img-ask.csdn.net/upload/201605/29/1464522146_811706.jpg) ![cmake-gui 配置为Linux](https://img-ask.csdn.net/upload/201605/30/1464565387_398821.png) ![cmake-gui 配置为arm-linux](https://img-ask.csdn.net/upload/201605/30/1464565406_575197.png)
yum install mysql-community-server 安装mysql 报错求大神帮忙!!!!
[root@11 mysql]# yum install mysql-community-server Loaded plugins: fastestmirror Setting up Install Process Loading mirror speeds from cached hostfile Resolving Dependencies --> Running transaction check ---> Package mysql-community-server.x86_64 0:8.0.16-1.el7 will be installed --> Processing Dependency: mysql-community-common(x86-64) = 8.0.16-1.el7 for package: mysql-community-server-8.0.16-1.el7.x86_64 --> Processing Dependency: mysql-community-client(x86-64) >= 8.0.11 for package: mysql-community-server-8.0.16-1.el7.x86_64 --> Processing Dependency: systemd for package: mysql-community-server-8.0.16-1.el7.x86_64 --> Processing Dependency: systemd for package: mysql-community-server-8.0.16-1.el7.x86_64 --> Processing Dependency: libstdc++.so.6(GLIBCXX_3.4.19)(64bit) for package: mysql-community-server-8.0.16-1.el7.x86_64 --> Processing Dependency: libstdc++.so.6(GLIBCXX_3.4.18)(64bit) for package: mysql-community-server-8.0.16-1.el7.x86_64 --> Processing Dependency: libstdc++.so.6(GLIBCXX_3.4.17)(64bit) for package: mysql-community-server-8.0.16-1.el7.x86_64 --> Processing Dependency: libstdc++.so.6(GLIBCXX_3.4.15)(64bit) for package: mysql-community-server-8.0.16-1.el7.x86_64 --> Processing Dependency: libstdc++.so.6(GLIBCXX_3.4.14)(64bit) for package: mysql-community-server-8.0.16-1.el7.x86_64 --> Processing Dependency: libstdc++.so.6(CXXABI_1.3.7)(64bit) for package: mysql-community-server-8.0.16-1.el7.x86_64 --> Processing Dependency: libstdc++.so.6(CXXABI_1.3.5)(64bit) for package: mysql-community-server-8.0.16-1.el7.x86_64 --> Processing Dependency: libc.so.6(GLIBC_2.17)(64bit) for package: mysql-community-server-8.0.16-1.el7.x86_64 --> Processing Dependency: libsasl2.so.3()(64bit) for package: mysql-community-server-8.0.16-1.el7.x86_64 --> Running transaction check ---> Package mysql-community-client.x86_64 0:8.0.16-1.el7 will be installed --> Processing Dependency: mysql-community-libs(x86-64) >= 8.0.11 for package: mysql-community-client-8.0.16-1.el7.x86_64 --> Processing Dependency: libstdc++.so.6(GLIBCXX_3.4.19)(64bit) for package: mysql-community-client-8.0.16-1.el7.x86_64 --> Processing Dependency: libstdc++.so.6(GLIBCXX_3.4.18)(64bit) for package: mysql-community-client-8.0.16-1.el7.x86_64 --> Processing Dependency: libstdc++.so.6(GLIBCXX_3.4.15)(64bit) for package: mysql-community-client-8.0.16-1.el7.x86_64 --> Processing Dependency: libstdc++.so.6(GLIBCXX_3.4.14)(64bit) for package: mysql-community-client-8.0.16-1.el7.x86_64 --> Processing Dependency: libstdc++.so.6(CXXABI_1.3.5)(64bit) for package: mysql-community-client-8.0.16-1.el7.x86_64 --> Processing Dependency: libc.so.6(GLIBC_2.14)(64bit) for package: mysql-community-client-8.0.16-1.el7.x86_64 ---> Package mysql-community-common.x86_64 0:8.0.16-1.el7 will be installed ---> Package mysql-community-server.x86_64 0:8.0.16-1.el7 will be installed --> Processing Dependency: systemd for package: mysql-community-server-8.0.16-1.el7.x86_64 --> Processing Dependency: systemd for package: mysql-community-server-8.0.16-1.el7.x86_64 --> Processing Dependency: libstdc++.so.6(GLIBCXX_3.4.19)(64bit) for package: mysql-community-server-8.0.16-1.el7.x86_64 --> Processing Dependency: libstdc++.so.6(GLIBCXX_3.4.18)(64bit) for package: mysql-community-server-8.0.16-1.el7.x86_64 --> Processing Dependency: libstdc++.so.6(GLIBCXX_3.4.17)(64bit) for package: mysql-community-server-8.0.16-1.el7.x86_64 --> Processing Dependency: libstdc++.so.6(GLIBCXX_3.4.15)(64bit) for package: mysql-community-server-8.0.16-1.el7.x86_64 --> Processing Dependency: libstdc++.so.6(GLIBCXX_3.4.14)(64bit) for package: mysql-community-server-8.0.16-1.el7.x86_64 --> Processing Dependency: libstdc++.so.6(CXXABI_1.3.7)(64bit) for package: mysql-community-server-8.0.16-1.el7.x86_64 --> Processing Dependency: libstdc++.so.6(CXXABI_1.3.5)(64bit) for package: mysql-community-server-8.0.16-1.el7.x86_64 --> Processing Dependency: libc.so.6(GLIBC_2.17)(64bit) for package: mysql-community-server-8.0.16-1.el7.x86_64 --> Processing Dependency: libsasl2.so.3()(64bit) for package: mysql-community-server-8.0.16-1.el7.x86_64 --> Running transaction check ---> Package mysql-community-client.x86_64 0:8.0.16-1.el7 will be installed --> Processing Dependency: libstdc++.so.6(GLIBCXX_3.4.19)(64bit) for package: mysql-community-client-8.0.16-1.el7.x86_64 --> Processing Dependency: libstdc++.so.6(GLIBCXX_3.4.18)(64bit) for package: mysql-community-client-8.0.16-1.el7.x86_64 --> Processing Dependency: libstdc++.so.6(GLIBCXX_3.4.15)(64bit) for package: mysql-community-client-8.0.16-1.el7.x86_64 --> Processing Dependency: libstdc++.so.6(GLIBCXX_3.4.14)(64bit) for package: mysql-community-client-8.0.16-1.el7.x86_64 --> Processing Dependency: libstdc++.so.6(CXXABI_1.3.5)(64bit) for package: mysql-community-client-8.0.16-1.el7.x86_64 --> Processing Dependency: libc.so.6(GLIBC_2.14)(64bit) for package: mysql-community-client-8.0.16-1.el7.x86_64 ---> Package mysql-community-libs.x86_64 0:8.0.16-1.el7 will be installed --> Processing Dependency: libstdc++.so.6(GLIBCXX_3.4.18)(64bit) for package: mysql-community-libs-8.0.16-1.el7.x86_64 --> Processing Dependency: libstdc++.so.6(CXXABI_1.3.5)(64bit) for package: mysql-community-libs-8.0.16-1.el7.x86_64 --> Processing Dependency: libc.so.6(GLIBC_2.14)(64bit) for package: mysql-community-libs-8.0.16-1.el7.x86_64 ---> Package mysql-community-server.x86_64 0:8.0.16-1.el7 will be installed --> Processing Dependency: systemd for package: mysql-community-server-8.0.16-1.el7.x86_64 --> Processing Dependency: systemd for package: mysql-community-server-8.0.16-1.el7.x86_64 --> Processing Dependency: libstdc++.so.6(GLIBCXX_3.4.19)(64bit) for package: mysql-community-server-8.0.16-1.el7.x86_64 --> Processing Dependency: libstdc++.so.6(GLIBCXX_3.4.18)(64bit) for package: mysql-community-server-8.0.16-1.el7.x86_64 --> Processing Dependency: libstdc++.so.6(GLIBCXX_3.4.17)(64bit) for package: mysql-community-server-8.0.16-1.el7.x86_64 --> Processing Dependency: libstdc++.so.6(GLIBCXX_3.4.15)(64bit) for package: mysql-community-server-8.0.16-1.el7.x86_64 --> Processing Dependency: libstdc++.so.6(GLIBCXX_3.4.14)(64bit) for package: mysql-community-server-8.0.16-1.el7.x86_64 --> Processing Dependency: libstdc++.so.6(CXXABI_1.3.7)(64bit) for package: mysql-community-server-8.0.16-1.el7.x86_64 --> Processing Dependency: libstdc++.so.6(CXXABI_1.3.5)(64bit) for package: mysql-community-server-8.0.16-1.el7.x86_64 --> Processing Dependency: libc.so.6(GLIBC_2.17)(64bit) for package: mysql-community-server-8.0.16-1.el7.x86_64 --> Processing Dependency: libsasl2.so.3()(64bit) for package: mysql-community-server-8.0.16-1.el7.x86_64 --> Finished Dependency Resolution Error: Package: mysql-community-server-8.0.16-1.el7.x86_64 (mysql80-community) Requires: libstdc++.so.6(GLIBCXX_3.4.18)(64bit) Error: Package: mysql-community-server-8.0.16-1.el7.x86_64 (mysql80-community) Requires: libstdc++.so.6(GLIBCXX_3.4.19)(64bit) Error: Package: mysql-community-client-8.0.16-1.el7.x86_64 (mysql80-community) Requires: libstdc++.so.6(GLIBCXX_3.4.15)(64bit) Error: Package: mysql-community-server-8.0.16-1.el7.x86_64 (mysql80-community) Requires: libstdc++.so.6(CXXABI_1.3.5)(64bit) Error: Package: mysql-community-client-8.0.16-1.el7.x86_64 (mysql80-community) Requires: libstdc++.so.6(GLIBCXX_3.4.14)(64bit) Error: Package: mysql-community-server-8.0.16-1.el7.x86_64 (mysql80-community) Requires: systemd Error: Package: mysql-community-libs-8.0.16-1.el7.x86_64 (mysql80-community) Requires: libstdc++.so.6(CXXABI_1.3.5)(64bit) Error: Package: mysql-community-libs-8.0.16-1.el7.x86_64 (mysql80-community) Requires: libstdc++.so.6(GLIBCXX_3.4.18)(64bit) Error: Package: mysql-community-client-8.0.16-1.el7.x86_64 (mysql80-community) Requires: libc.so.6(GLIBC_2.14)(64bit) Error: Package: mysql-community-server-8.0.16-1.el7.x86_64 (mysql80-community) Requires: libstdc++.so.6(CXXABI_1.3.7)(64bit) Error: Package: mysql-community-server-8.0.16-1.el7.x86_64 (mysql80-community) Requires: libsasl2.so.3()(64bit) Error: Package: mysql-community-server-8.0.16-1.el7.x86_64 (mysql80-community) Requires: libstdc++.so.6(GLIBCXX_3.4.14)(64bit) Error: Package: mysql-community-server-8.0.16-1.el7.x86_64 (mysql80-community) Requires: libc.so.6(GLIBC_2.17)(64bit) Error: Package: mysql-community-server-8.0.16-1.el7.x86_64 (mysql80-community) Requires: libstdc++.so.6(GLIBCXX_3.4.15)(64bit) Error: Package: mysql-community-client-8.0.16-1.el7.x86_64 (mysql80-community) Requires: libstdc++.so.6(GLIBCXX_3.4.19)(64bit) Error: Package: mysql-community-client-8.0.16-1.el7.x86_64 (mysql80-community) Requires: libstdc++.so.6(CXXABI_1.3.5)(64bit) Error: Package: mysql-community-libs-8.0.16-1.el7.x86_64 (mysql80-community) Requires: libc.so.6(GLIBC_2.14)(64bit) Error: Package: mysql-community-server-8.0.16-1.el7.x86_64 (mysql80-community) Requires: libstdc++.so.6(GLIBCXX_3.4.17)(64bit) Error: Package: mysql-community-client-8.0.16-1.el7.x86_64 (mysql80-community) Requires: libstdc++.so.6(GLIBCXX_3.4.18)(64bit) You could try using --skip-broken to work around the problem ** Found 3 pre-existing rpmdb problem(s), 'yum check' output follows: 2:postfix-2.6.6-8.el6.x86_64 has missing requires of libmysqlclient.so.16()(64bit) 2:postfix-2.6.6-8.el6.x86_64 has missing requires of libmysqlclient.so.16(libmysqlclient_16)(64bit) 2:postfix-2.6.6-8.el6.x86_64 has missing requires of mysql-libs
误删了glibc,centos下报错-bash: /bin/ls: /lib64/ld-linux-x86-64.so.2: bad ELF interpreter: No such file or directory
因为操作不当误删了glibc库,然后任何命令都报错-bash: /bin/ls: /lib64/ld-linux-x86-64.so.2: bad ELF interpreter: No such file or directory;进入了救援模式,挂载镜像的时候又报错unknown filesystem type ios9660;然后要怎么样才能恢复系统呢
相见恨晚的超实用网站
相见恨晚的超实用网站 持续更新中。。。
爬虫福利二 之 妹子图网MM批量下载
爬虫福利一:27报网MM批量下载 点击 看了本文,相信大家对爬虫一定会产生强烈的兴趣,激励自己去学习爬虫,在这里提前祝:大家学有所成! 目标网站:妹子图网 环境:Python3.x 相关第三方模块:requests、beautifulsoup4 Re:各位在测试时只需要将代码里的变量path 指定为你当前系统要保存的路径,使用 python xxx.py 或IDE运行即可。 ...
字节跳动视频编解码面经
三四月份投了字节跳动的实习(图形图像岗位),然后hr打电话过来问了一下会不会opengl,c++,shador,当时只会一点c++,其他两个都不会,也就直接被拒了。 七月初内推了字节跳动的提前批,因为内推没有具体的岗位,hr又打电话问要不要考虑一下图形图像岗,我说实习投过这个岗位不合适,不会opengl和shador,然后hr就说秋招更看重基础。我当时想着能进去就不错了,管他哪个岗呢,就同意了面试...
开源一个功能完整的SpringBoot项目框架
福利来了,给大家带来一个福利。 最近想了解一下有关Spring Boot的开源项目,看了很多开源的框架,大多是一些demo或者是一个未成形的项目,基本功能都不完整,尤其是用户权限和菜单方面几乎没有完整的。 想到我之前做的框架,里面通用模块有:用户模块,权限模块,菜单模块,功能模块也齐全了,每一个功能都是完整的。 打算把这个框架分享出来,供大家使用和学习。 为什么用框架? 框架可以学习整体...
源码阅读(19):Java中主要的Map结构——HashMap容器(下1)
HashMap容器从字面的理解就是,基于Hash算法构造的Map容器。从数据结构的知识体系来说,HashMap容器是散列表在Java中的具体表达(并非线性表结构)。具体来说就是,利用K-V键值对中键对象的某个属性(默认使用该对象的“内存起始位置”这一属性)作为计算依据进行哈希计算(调用hashCode方法),然后再以计算后的返回值为依据,将当前K-V键值对在符合HashMap容器构造原则的基础上,放置到HashMap容器的某个位置上,且这个位置和之前添加的K-V键值对的存储位置完全独立,不一定构成连续的存储
c++制作的植物大战僵尸,开源,一代二代结合游戏
此游戏全部由本人自己制作完成。游戏大部分的素材来源于原版游戏素材,少部分搜集于网络,以及自己制作。 此游戏为同人游戏而且仅供学习交流使用,任何人未经授权,不得对本游戏进行更改、盗用等,否则后果自负。目前有六种僵尸和六种植物,植物和僵尸的动画都是本人做的。qq:2117610943 开源代码下载 提取码:3vzm 点击下载--&gt; 11月28日 新增四种植物 统一植物画风,全部修...
Java学习的正确打开方式
在博主认为,对于入门级学习java的最佳学习方法莫过于视频+博客+书籍+总结,前三者博主将淋漓尽致地挥毫于这篇博客文章中,至于总结在于个人,实际上越到后面你会发现学习的最好方式就是阅读参考官方文档其次就是国内的书籍,博客次之,这又是一个层次了,这里暂时不提后面再谈。博主将为各位入门java保驾护航,各位只管冲鸭!!!上天是公平的,只要不辜负时间,时间自然不会辜负你。 何谓学习?博主所理解的学习,它是一个过程,是一个不断累积、不断沉淀、不断总结、善于传达自己的个人见解以及乐于分享的过程。
程序员必须掌握的核心算法有哪些?
由于我之前一直强调数据结构以及算法学习的重要性,所以就有一些读者经常问我,数据结构与算法应该要学习到哪个程度呢?,说实话,这个问题我不知道要怎么回答你,主要取决于你想学习到哪些程度,不过针对这个问题,我稍微总结一下我学过的算法知识点,以及我觉得值得学习的算法。这些算法与数据结构的学习大多数是零散的,并没有一本把他们全部覆盖的书籍。下面是我觉得值得学习的一些算法以及数据结构,当然,我也会整理一些看过...
Python——画一棵漂亮的樱花树(不同种樱花+玫瑰+圣诞树喔)
最近翻到一篇知乎,上面有不少用Python(大多是turtle库)绘制的树图,感觉很漂亮,我整理了一下,挑了一些我觉得不错的代码分享给大家(这些我都测试过,确实可以生成) one 樱花树 动态生成樱花 效果图(这个是动态的): 实现代码 import turtle as T import random import time # 画樱花的躯干(60,t) def Tree(branch, ...
linux系列之常用运维命令整理笔录
本博客记录工作中需要的linux运维命令,大学时候开始接触linux,会一些基本操作,可是都没有整理起来,加上是做开发,不做运维,有些命令忘记了,所以现在整理成博客,当然vi,文件操作等就不介绍了,慢慢积累一些其它拓展的命令,博客不定时更新 free -m 其中:m表示兆,也可以用g,注意都要小写 Men:表示物理内存统计 total:表示物理内存总数(total=used+free) use...
Python 基础(一):入门必备知识
Python 入门必备知识,你都掌握了吗?
深度学习图像算法在内容安全领域的应用
互联网给人们生活带来便利的同时也隐含了大量不良信息,防范互联网平台有害内容传播引起了多方面的高度关注。本次演讲从技术层面分享网易易盾在内容安全领域的算法实践经验,包括深度...
程序员接私活怎样防止做完了不给钱?
首先跟大家说明一点,我们做 IT 类的外包开发,是非标品开发,所以很有可能在开发过程中会有这样那样的需求修改,而这种需求修改很容易造成扯皮,进而影响到费用支付,甚至出现做完了项目收不到钱的情况。 那么,怎么保证自己的薪酬安全呢? 我们在开工前,一定要做好一些证据方面的准备(也就是“讨薪”的理论依据),这其中最重要的就是需求文档和验收标准。一定要让需求方提供这两个文档资料作为开发的基础。之后开发...
网页实现一个简单的音乐播放器(大佬别看。(⊙﹏⊙))
今天闲着无事,就想写点东西。然后听了下歌,就打算写个播放器。 于是乎用h5 audio的加上js简单的播放器完工了。 演示地点演示 html代码如下` music 这个年纪 七月的风 音乐 ` 然后就是css`*{ margin: 0; padding: 0; text-decoration: none; list-...
Python十大装B语法
Python 是一种代表简单思想的语言,其语法相对简单,很容易上手。不过,如果就此小视 Python 语法的精妙和深邃,那就大错特错了。本文精心筛选了最能展现 Python 语法之精妙的十个知识点,并附上详细的实例代码。如能在实战中融会贯通、灵活使用,必将使代码更为精炼、高效,同时也会极大提升代码B格,使之看上去更老练,读起来更优雅。
数据库优化 - SQL优化
以实际SQL入手,带你一步一步走上SQL优化之路!
2019年11月中国大陆编程语言排行榜
2019年11月2日,我统计了某招聘网站,获得有效程序员招聘数据9万条。针对招聘信息,提取编程语言关键字,并统计如下: 编程语言比例 rank pl_ percentage 1 java 33.62% 2 cpp 16.42% 3 c_sharp 12.82% 4 javascript 12.31% 5 python 7.93% 6 go 7.25% 7 p...
通俗易懂地给女朋友讲:线程池的内部原理
餐盘在灯光的照耀下格外晶莹洁白,女朋友拿起红酒杯轻轻地抿了一小口,对我说:“经常听你说线程池,到底线程池到底是个什么原理?”
经典算法(5)杨辉三角
写在前面: 我是 扬帆向海,这个昵称来源于我的名字以及女朋友的名字。我热爱技术、热爱开源、热爱编程。技术是开源的、知识是共享的。 这博客是对自己学习的一点点总结及记录,如果您对 Java、算法 感兴趣,可以关注我的动态,我们一起学习。 用知识改变命运,让我们的家人过上更好的生活。 目录一、杨辉三角的介绍二、杨辉三角的算法思想三、代码实现1.第一种写法2.第二种写法 一、杨辉三角的介绍 百度
腾讯算法面试题:64匹马8个跑道需要多少轮才能选出最快的四匹?
昨天,有网友私信我,说去阿里面试,彻底的被打击到了。问了为什么网上大量使用ThreadLocal的源码都会加上private static?他被难住了,因为他从来都没有考虑过这个问题。无独有偶,今天笔者又发现有网友吐槽了一道腾讯的面试题,我们一起来看看。 腾讯算法面试题:64匹马8个跑道需要多少轮才能选出最快的四匹? 在互联网职场论坛,一名程序员发帖求助到。二面腾讯,其中一个算法题:64匹...
面试官:你连RESTful都不知道我怎么敢要你?
干货,2019 RESTful最贱实践
为啥国人偏爱Mybatis,而老外喜欢Hibernate/JPA呢?
关于SQL和ORM的争论,永远都不会终止,我也一直在思考这个问题。昨天又跟群里的小伙伴进行了一番讨论,感触还是有一些,于是就有了今天这篇文。 声明:本文不会下关于Mybatis和JPA两个持久层框架哪个更好这样的结论。只是摆事实,讲道理,所以,请各位看官勿喷。 一、事件起因 关于Mybatis和JPA孰优孰劣的问题,争论已经很多年了。一直也没有结论,毕竟每个人的喜好和习惯是大不相同的。我也看...
项目中的if else太多了,该怎么重构?
介绍 最近跟着公司的大佬开发了一款IM系统,类似QQ和微信哈,就是聊天软件。我们有一部分业务逻辑是这样的 if (msgType = "文本") { // dosomething } else if(msgType = "图片") { // doshomething } else if(msgType = "视频") { // doshomething } else { // doshom...
致 Python 初学者
欢迎来到“Python进阶”专栏!来到这里的每一位同学,应该大致上学习了很多 Python 的基础知识,正在努力成长的过程中。在此期间,一定遇到了很多的困惑,对未来的学习方向感到迷茫。我非常理解你们所面临的处境。我从2007年开始接触 python 这门编程语言,从2009年开始单一使用 python 应对所有的开发工作,直至今天。回顾自己的学习过程,也曾经遇到过无数的困难,也曾经迷茫过、困惑过。开办这个专栏,正是为了帮助像我当年一样困惑的 Python 初学者走出困境、快速成长。希望我的经验能真正帮到你
Python 编程实用技巧
Python是一门很灵活的语言,也有很多实用的方法,有时候实现一个功能可以用多种方法实现,我这里总结了一些常用的方法,并会持续更新。
“狗屁不通文章生成器”登顶GitHub热榜,分分钟写出万字形式主义大作
一、垃圾文字生成器介绍 最近在浏览GitHub的时候,发现了这样一个骨骼清奇的雷人项目,而且热度还特别高。 项目中文名:狗屁不通文章生成器 项目英文名:BullshitGenerator 根据作者的介绍,他是偶尔需要一些中文文字用于GUI开发时测试文本渲染,因此开发了这个废话生成器。但由于生成的废话实在是太过富于哲理,所以最近已经被小伙伴们给玩坏了。 他的文风可能是这样的: 你发现,
程序员:我终于知道post和get的区别
IT界知名的程序员曾说:对于那些月薪三万以下,自称IT工程师的码农们,其实我们从来没有把他们归为我们IT工程师的队伍。他们虽然总是以IT工程师自居,但只是他们一厢情愿罢了。 此话一出,不知激起了多少(码农)程序员的愤怒,却又无可奈何,于是码农问程序员。 码农:你知道get和post请求到底有什么区别? 程序员:你看这篇就知道了。 码农:你月薪三万了? 程序员:嗯。 码农:你是怎么做到的? 程序员:
"狗屁不通文章生成器"登顶GitHub热榜,分分钟写出万字形式主义大作
前言 GitHub 被誉为全球最大的同性交友网站,……,陪伴我们已经走过 10+ 年时间,它托管了大量的软件代码,同时也承载了程序员无尽的欢乐。 上周给大家分享了一篇10个让你笑的合不拢嘴的Github项目,而且还拿了7万+个Star哦,有兴趣的朋友,可以看看, 印象最深刻的是 “ 呼吸不止,码字不停 ”: 老实交代,你是不是经常准备写个技术博客,打开word后瞬间灵感便秘,码不出字? 有什么
推荐几款比较实用的工具,网站
1.盘百度PanDownload 这个云盘工具是免费的,可以进行资源搜索,提速(偶尔会抽风????) 不要去某站买付费的???? PanDownload下载地址 2.BeJSON 这是一款拥有各种在线工具的网站,推荐它的主要原因是网站简洁,功能齐全,广告相比其他广告好太多了 bejson网站 3.二维码美化 这个网站的二维码美化很好看,网站界面也很...
《程序人生》系列-这个程序员只用了20行代码就拿了冠军
你知道的越多,你不知道的越多 点赞再看,养成习惯GitHub上已经开源https://github.com/JavaFamily,有一线大厂面试点脑图,欢迎Star和完善 前言 这一期不算《吊打面试官》系列的,所有没前言我直接开始。 絮叨 本来应该是没有这期的,看过我上期的小伙伴应该是知道的嘛,双十一比较忙嘛,要值班又要去帮忙拍摄年会的视频素材,还得搞个程序员一天的Vlog,还要写BU
相关热词 如何提升c#开发能力 矩阵乘法c# c#调用谷歌浏览器 c# 去空格去转义符 c#用户登录窗体代码 c# 流 c# linux 可视化 c# mvc 返回图片 c# 像素空间 c# 日期 最后一天
立即提问