在pom里添加maven-compiler-plugin插件版本信息,无法识别plugins标签

在pom里添加maven-compiler-plugin插件版本信息,无法识别plugins标签。
但是.m2\repository\org\apache\maven\plugins\maven-surefire-plugin\2.12.4下又正常有maven-surefire-plugin-2.12.4.jar这个文件
图片说明
图片说明

5个回答

你这个配的有问题,缺东西,plugins标签外围缺少build标签
图片说明

plugins标签外围缺少build标签

1.8
1.8

在后面添加编码,看看如何 UTF-8

1.8
1.8
UTF-8

上面的代码自动识别了。

 <source>1.8</source>
<target>1.8</target>
<encoding>UTF-8</encoding>

请参考图片--

Csdn user default icon
上传中...
上传图片
插入图片
抄袭、复制答案,以达到刷声望分或其他目的的行为,在CSDN问答是严格禁止的,一经发现立刻封号。是时候展现真正的技术了!
其他相关推荐
maven配置私服打包报错Failed to execute goal org.apache.maven.plugins:maven-compiler-plugin:3.5:compile
直接使用阿里云镜像仓库打包没问题,替换为私服镜像仓库后报错: 就是pom.xml中的plugin报错 ``` <plugin> <groupId>org.apache.maven.plugins</groupId> <artifactId>maven-compiler-plugin</artifactId> <version>3.5</version> <configuration> <source>1.8</source> <target>1.8</target> <encoding>UTF-8</encoding> </configuration> </plugin> ``` 网上找了半天说这个指定的jdk版本的问题,查了一下版本没问题都是1.8 报错内容: [ERROR] Failed to execute goal org.apache.maven.plugins:maven-compiler-plugin:3.5:compile (default-compile) on project mytest-web: Execution default-compile of goal org.apache.maven.plugins:maven-compiler-plugin:3.5:compile failed: Plugin org.apache.maven.plugins:maven-compiler-plugin:3.5 or one of its dependencies could not be resolved: Failed to collect dependencies at org.apache.maven.plugins:maven-compiler-plugin:jar:3.5 -> org.apache.maven:maven-toolchain:jar:2.2.1 -> org.apache.maven:maven-core:jar:2.2.1 -> commons-cli:commons-cli:jar:1.2: Failed to read artifact descriptor for commons-cli:commons-cli:jar:1.2: Failure to find org.apache:apache:pom:4 in http://localhost:8081/nexus/content/groups/public/ was cached in the local repository, resolution will not be reattempted until the update interval of public has elapsed or updates are forced -> [Help 1] org.apache.maven.lifecycle.LifecycleExecutionException: Failed to execute goal org.apache.maven.plugins:maven-compiler-plugin:3.5:compile (default-compile) on project mytest-web: Execution default-compile of goal org.apache.maven.plugins:maven-compiler-plugin:3.5:compile failed: Plugin org.apache.maven.plugins:maven-compiler-plugin:3.5 or one of its dependencies could not be resolved: Failed to collect dependencies at org.apache.maven.plugins:maven-compiler-plugin:jar:3.5 -> org.apache.maven:maven-toolchain:jar:2.2.1 -> org.apache.maven:maven-core:jar:2.2.1 -> commons-cli:commons-cli:jar:1.2 at org.apache.maven.lifecycle.internal.MojoExecutor.execute(MojoExecutor.java:213) at org.apache.maven.lifecycle.internal.MojoExecutor.execute(MojoExecutor.java:154) at org.apache.maven.lifecycle.internal.MojoExecutor.execute(MojoExecutor.java:146) at org.apache.maven.lifecycle.internal.LifecycleModuleBuilder.buildProject(LifecycleModuleBuilder.java:117) at org.apache.maven.lifecycle.internal.LifecycleModuleBuilder.buildProject(LifecycleModuleBuilder.java:81) at org.apache.maven.lifecycle.internal.builder.singlethreaded.SingleThreadedBuilder.build(SingleThreadedBuilder.java:51) at org.apache.maven.lifecycle.internal.LifecycleStarter.execute(LifecycleStarter.java:128) at org.apache.maven.DefaultMaven.doExecute(DefaultMaven.java:309) at org.apache.maven.DefaultMaven.doExecute(DefaultMaven.java:194) at org.apache.maven.DefaultMaven.execute(DefaultMaven.java:107) at org.apache.maven.cli.MavenCli.execute(MavenCli.java:993) at org.apache.maven.cli.MavenCli.doMain(MavenCli.java:345) at org.apache.maven.cli.MavenCli.main(MavenCli.java:191) at sun.reflect.NativeMethodAccessorImpl.invoke0(Native Method) at sun.reflect.NativeMethodAccessorImpl.invoke(NativeMethodAccessorImpl.java:62) at sun.reflect.DelegatingMethodAccessorImpl.invoke(DelegatingMethodAccessorImpl.java:43) at java.lang.reflect.Method.invoke(Method.java:498) at org.codehaus.plexus.classworlds.launcher.Launcher.launchEnhanced(Launcher.java:289) at org.codehaus.plexus.classworlds.launcher.Launcher.launch(Launcher.java:229) at org.codehaus.plexus.classworlds.launcher.Launcher.mainWithExitCode(Launcher.java:415) at org.codehaus.plexus.classworlds.launcher.Launcher.main(Launcher.java:356) Caused by: org.apache.maven.plugin.PluginExecutionException: Execution default-compile of goal org.apache.maven.plugins:maven-compiler-plugin:3.5:compile failed: Plugin org.apache.maven.plugins:maven-compiler-plugin:3.5 or one of its dependencies could not be resolved: Failed to collect dependencies at org.apache.maven.plugins:maven-compiler-plugin:jar:3.5 -> org.apache.maven:maven-toolchain:jar:2.2.1 -> org.apache.maven:maven-core:jar:2.2.1 -> commons-cli:commons-cli:jar:1.2 at org.apache.maven.plugin.DefaultBuildPluginManager.executeMojo(DefaultBuildPluginManager.java:106) at org.apache.maven.lifecycle.internal.MojoExecutor.execute(MojoExecutor.java:208) ... 20 more Caused by: org.apache.maven.plugin.PluginResolutionException: Plugin org.apache.maven.plugins:maven-compiler-plugin:3.5 or one of its dependencies could not be resolved: Failed to collect dependencies at org.apache.maven.plugins:maven-compiler-plugin:jar:3.5 -> org.apache.maven:maven-toolchain:jar:2.2.1 -> org.apache.maven:maven-core:jar:2.2.1 -> commons-cli:commons-cli:jar:1.2 at org.apache.maven.plugin.internal.DefaultPluginDependenciesResolver.resolveInternal(DefaultPluginDependenciesResolver.java:214) at org.apache.maven.plugin.internal.DefaultPluginDependenciesResolver.resolve(DefaultPluginDependenciesResolver.java:149) at org.apache.maven.plugin.internal.DefaultMavenPluginManager.createPluginRealm(DefaultMavenPluginManager.java:402) at org.apache.maven.plugin.internal.DefaultMavenPluginManager.setupPluginRealm(DefaultMavenPluginManager.java:374) at org.apache.maven.plugin.DefaultBuildPluginManager.getPluginRealm(DefaultBuildPluginManager.java:231) at org.apache.maven.plugin.DefaultBuildPluginManager.executeMojo(DefaultBuildPluginManager.java:102) ... 21 more Caused by: org.eclipse.aether.collection.DependencyCollectionException: Failed to collect dependencies at org.apache.maven.plugins:maven-compiler-plugin:jar:3.5 -> org.apache.maven:maven-toolchain:jar:2.2.1 -> org.apache.maven:maven-core:jar:2.2.1 -> commons-cli:commons-cli:jar:1.2 at org.eclipse.aether.internal.impl.DefaultDependencyCollector.collectDependencies(DefaultDependencyCollector.java:300) at org.eclipse.aether.internal.impl.DefaultRepositorySystem.collectDependencies(DefaultRepositorySystem.java:325) at org.apache.maven.plugin.internal.DefaultPluginDependenciesResolver.resolveInternal(DefaultPluginDependenciesResolver.java:202) ... 26 more Caused by: org.eclipse.aether.resolution.ArtifactDescriptorException: Failed to read artifact descriptor for commons-cli:commons-cli:jar:1.2 at org.apache.maven.repository.internal.DefaultArtifactDescriptorReader.loadPom(DefaultArtifactDescriptorReader.java:330) at org.apache.maven.repository.internal.DefaultArtifactDescriptorReader.readArtifactDescriptor(DefaultArtifactDescriptorReader.java:199) at org.eclipse.aether.internal.impl.DefaultDependencyCollector.resolveCachedArtifactDescriptor(DefaultDependencyCollector.java:544) at org.eclipse.aether.internal.impl.DefaultDependencyCollector.getArtifactDescriptorResult(DefaultDependencyCollector.java:528) at org.eclipse.aether.internal.impl.DefaultDependencyCollector.processDependency(DefaultDependencyCollector.java:418) at org.eclipse.aether.internal.impl.DefaultDependencyCollector.processDependency(DefaultDependencyCollector.java:372) at org.eclipse.aether.internal.impl.DefaultDependencyCollector.process(DefaultDependencyCollector.java:360) at org.eclipse.aether.internal.impl.DefaultDependencyCollector.doRecurse(DefaultDependencyCollector.java:513) at org.eclipse.aether.internal.impl.DefaultDependencyCollector.processDependency(DefaultDependencyCollector.java:467) at org.eclipse.aether.internal.impl.DefaultDependencyCollector.processDependency(DefaultDependencyCollector.java:372) at org.eclipse.aether.internal.impl.DefaultDependencyCollector.process(DefaultDependencyCollector.java:360) at org.eclipse.aether.internal.impl.DefaultDependencyCollector.doRecurse(DefaultDependencyCollector.java:513) at org.eclipse.aether.internal.impl.DefaultDependencyCollector.processDependency(DefaultDependencyCollector.java:467) at org.eclipse.aether.internal.impl.DefaultDependencyCollector.processDependency(DefaultDependencyCollector.java:372) at org.eclipse.aether.internal.impl.DefaultDependencyCollector.process(DefaultDependencyCollector.java:360) at org.eclipse.aether.internal.impl.DefaultDependencyCollector.collectDependencies(DefaultDependencyCollector.java:263) ... 28 more Caused by: org.apache.maven.model.resolution.UnresolvableModelException: Failure to find org.apache:apache:pom:4 in http://localhost:8081/nexus/content/groups/public/ was cached in the local repository, resolution will not be reattempted until the update interval of public has elapsed or updates are forced at org.apache.maven.repository.internal.DefaultModelResolver.resolveModel(DefaultModelResolver.java:178) at org.apache.maven.repository.internal.DefaultModelResolver.resolveModel(DefaultModelResolver.java:224) at org.apache.maven.model.building.DefaultModelBuilder.readParentExternally(DefaultModelBuilder.java:1051) at org.apache.maven.model.building.DefaultModelBuilder.readParent(DefaultModelBuilder.java:829) at org.apache.maven.model.building.DefaultModelBuilder.build(DefaultModelBuilder.java:331) at org.apache.maven.repository.internal.DefaultArtifactDescriptorReader.loadPom(DefaultArtifactDescriptorReader.java:321) ... 43 more Caused by: org.eclipse.aether.resolution.ArtifactResolutionException: Failure to find org.apache:apache:pom:4 in http://localhost:8081/nexus/content/groups/public/ was cached in the local repository, resolution will not be reattempted until the update interval of public has elapsed or updates are forced at org.eclipse.aether.internal.impl.DefaultArtifactResolver.resolve(DefaultArtifactResolver.java:453) at org.eclipse.aether.internal.impl.DefaultArtifactResolver.resolveArtifacts(DefaultArtifactResolver.java:255) at org.eclipse.aether.internal.impl.DefaultArtifactResolver.resolveArtifact(DefaultArtifactResolver.java:232) at org.apache.maven.repository.internal.DefaultModelResolver.resolveModel(DefaultModelResolver.java:174) ... 48 more Caused by: org.eclipse.aether.transfer.ArtifactNotFoundException: Failure to find org.apache:apache:pom:4 in http://localhost:8081/nexus/content/groups/public/ was cached in the local repository, resolution will not be reattempted until the update interval of public has elapsed or updates are forced at org.eclipse.aether.internal.impl.DefaultUpdateCheckManager.newException(DefaultUpdateCheckManager.java:240) at org.eclipse.aether.internal.impl.DefaultUpdateCheckManager.checkArtifact(DefaultUpdateCheckManager.java:215) at org.eclipse.aether.internal.impl.DefaultArtifactResolver.gatherDownloads(DefaultArtifactResolver.java:594) at org.eclipse.aether.internal.impl.DefaultArtifactResolver.performDownloads(DefaultArtifactResolver.java:512) at org.eclipse.aether.internal.impl.DefaultArtifactResolver.resolve(DefaultArtifactResolver.java:430) ... 51 more [ERROR] [ERROR] Re-run Maven using the -X switch to enable full debug logging. [ERROR] [ERROR] For more information about the errors and possible solutions, please read the following articles: [ERROR] [Help 1] http://cwiki.apache.org/confluence/display/MAVEN/PluginResolutionException
mycelipse创建maven项目报错
Could not get mojo execution paramater value Plugin org.apache.maven.plugins:maven-compiler-plugin:2.0.2 or one of its dependencies could not be resolved: Unable to get dependency information for org.apache.maven.plugins:maven-compiler-plugin:maven-plugin:2.0.2: Failed to process POM for org.apache.maven.plugins:maven-compiler-plugin:maven-plugin:2.0.2: Non-resolvable parent POM org.apache.maven:maven-parent:5 for org.apache.maven.plugins:maven-plugins:8: Failed to resolve POM for org.apache.maven:maven-parent:5 due to Missing: ---------- 1) org.apache.maven:maven-parent:pom:5 ---------- 1 required artifact is missing. for artifact: org.apache.maven:maven-parent:pom:5 from the specified remote repositories: central (http://repo1.maven.org/maven2, releases=true, snapshots=false)
新建Maven项目报错,提示连接不上中央存储库
CoreException: Could not calculate build plan: Plugin org.apache.maven.plugins:maven-compiler-plugin:2.3.2 or one of its dependencies could not be resolved: Failed to read artifact descriptor for org.apache.maven.plugins:maven-compiler-plugin:jar:2.3.2: ArtifactResolutionException: Failure to transfer org.apache.maven.plugins:maven-compiler-plugin:pom:2.3.2 from http://repo.maven.apache.org/maven2 was cached in the local repository, resolution will not be reattempted until the update interval of central has elapsed or updates are forced. Original error: Could not transfer artifact org.apache.maven.plugins:maven-compiler-plugin:pom:2.3.2 from/to central (http://repo.maven.apache.org/maven2): null to http://repo.maven.apache.org/maven2/org/apache/maven/plugins/maven-compiler-plugin/2.3.2/maven-compiler-plugin-2.3.2.pom
eclipse 中创建Maven 报错,求解决方案
CoreException: Could not calculate build plan: Plugin org.apache.maven.plugins:maven-compiler-plugin:3.1 or one of its dependencies could not be resolved: Failed to read artifact descriptor for org.apache.maven.plugins:maven-compiler-plugin:jar:3.1: ArtifactResolutionException: Failure to transfer org.apache.maven.plugins:maven-compiler-plugin:pom:3.1 from https://repo.maven.apache.org/maven2 was cached in the local repository, resolution will not be reattempted until the update interval of central has elapsed or updates are forced. Original error: Could not transfer artifact org.apache.maven.plugins:maven-compiler-plugin:pom:3.1 from/to central (https://repo.maven.apache.org/maven2): repo.maven.apache.org
pom文件中引用org.apache.maven.plugins报错
错误:Plugin execution not covered by lifecycle configuration: org.apache.maven.plugins:maven-compiler-plugin:3.1:testCompile (execution: default-testCompile, phase: test-compile)
Jenkins打包项目报错,JDK1.8
``` [INFO] BUILD FAILURE [INFO] ------------------------------------------------------------------------ [INFO] Total time: 6.400 s [INFO] Finished at: 2019-12-31T17:08:37+08:00 [INFO] Final Memory: 32M/117M [INFO] ------------------------------------------------------------------------ [ERROR] Failed to execute goal org.apache.maven.plugins:maven-compiler-plugin:3.8.1:compile (default-compile) on project cmdbunion_eureka: Execution default-compile of goal org.apache.maven.plugins:maven-compiler-plugin:3.8.1:compile failed: A required class was missing while executing org.apache.maven.plugins:maven-compiler-plugin:3.8.1:compile: org/codehaus/plexus/compiler/util/scan/InclusionScanException [ERROR] ----------------------------------------------------- [ERROR] realm = plugin>org.apache.maven.plugins:maven-compiler-plugin:3.8.1 [ERROR] strategy = org.codehaus.plexus.classworlds.strategy.SelfFirstStrategy [ERROR] urls[0] = file:/DATA/repo/repository/org/apache/maven/plugins/maven-compiler-plugin/3.8.1/maven-compiler-plugin-3.8.1.jar [ERROR] urls[1] = file:/DATA/repo/repository/org/codehaus/plexus/plexus-utils/1.1/plexus-utils-1.1.jar [JENKINS] Archiving /DATA/var/lib/jenkins/workspace/cmdbunion_parent/cmdbunion_eureka/pom.xml to com.travelsky/cmdbunion_eureka/0.0.1-SNAPSHOT/cmdbunion_eureka-0.0.1-SNAPSHOT.pom [ERROR] Number of foreign imports: 1 [ERROR] import: Entry[import from realm ClassRealm[maven.api, parent: null]] [ERROR] [ERROR] -----------------------------------------------------: org.codehaus.plexus.compiler.util.scan.InclusionScanException [ERROR] -> [Help 1] [ERROR] [ERROR] To see the full stack trace of the errors, re-run Maven with the -e switch. [ERROR] Re-run Maven using the -X switch to enable full debug logging. [JENKINS] Archiving /DATA/var/lib/jenkins/workspace/cmdbunion_parent/cmdbunion_titsm/pom.xml to com.travelsky/cmdbunion_titsm/0.0.1-SNAPSHOT/cmdbunion_titsm-0.0.1-SNAPSHOT.pom [ERROR] [ERROR] For more information about the errors and possible solutions, please read the following articles: [ERROR] [Help 1] http://cwiki.apache.org/confluence/display/MAVEN/PluginContainerException [ERROR] [ERROR] After correcting the problems, you can resume the build with the command [ERROR] mvn <goals> -rf :cmdbunion_eureka ``` ![图片说明](https://img-ask.csdn.net/upload/201912/31/1577783774_342114.png) ![图片说明](https://img-ask.csdn.net/upload/201912/31/1577783814_821416.png)
maven 中的pom.xml里的<plugin>标签报错
<build>//报错 <plugins> <plugin> <!-- 编译插件 --> <groupId>org.apache.maven.plugins</groupId> <artifactId>maven-compiler-plugin</artifactId> <version>2.3.2</version> <configuration> <source>${java.verison}</source> <target>${java.verison}</target> </configuration> </plugin> </plugins> </build> ``` ```
maven3 2个问题求解答 网上搜不到
1. maven的内置插件是在哪里定义的 有哪些内置插件 看了源码里的主pom,只有以下插件 ``` - <pluginManagement> - <!-- NOTE: These plugins will be removed from future versions of the super POM --> - <!-- They are kept for the moment as they are very unlikely to conflict with lifecycle mappings (MNG-4453) --> - <plugins> - <plugin> <artifactId>maven-antrun-plugin</artifactId> <version>1.3</version> </plugin> - <plugin> <artifactId>maven-assembly-plugin</artifactId> <version>2.2-beta-5</version> </plugin> - <plugin> <artifactId>maven-dependency-plugin</artifactId> <version>2.8</version> </plugin> - <plugin> <artifactId>maven-release-plugin</artifactId> <version>2.3.2</version> </plugin> </plugins> </pluginManagement> ``` 2、我在我自己的父pom里声明了插件 ``` <pluginManagement> <plugins> <plugin> <groupId>org.apache.maven.plugins</groupId> <artifactId>maven-compiler-plugin</artifactId> <version>2.3.2</version> <configuration> <source>1.6</source> <target>1.6</target> <encoding>UTF-8</encoding> </configuration> </plugin> <plugin> <groupId>org.apache.maven.plugins</groupId> <artifactId>maven-resources-plugin</artifactId> <version>2.5</version> <configuration> <useDefaultDelimiters>false</useDefaultDelimiters> <delimiters> <delimiter>$[*]</delimiter> </delimiters> <encoding>UTF-8</encoding> </configuration> </plugin> <plugin> <groupId>org.owasp</groupId> <artifactId>dependency-check-maven</artifactId> <executions> <execution> <goals> <goal>check</goal> </goals> </execution> </executions> <configuration> <format>xml</format> </configuration> </plugin> </plugins> </pluginManagement> ``` 但我在其他子模块中并没有用这些插件,但是这些插件还是起作用了,为什么?
jpress mvn package失败,求大神指导
报错代码如下: [INFO] Scanning for projects... [WARNING] [WARNING] Some problems were encountered while building the effective model for io.jpress:codegen:jar:1.0 [WARNING] 'version' contains an expression but should be a constant. @ io.jpress:parent:${jpress.version}, D:\Program Files\jpress\pom.xml, line 10, column 14 [WARNING] 'build.plugins.plugin.version' for org.apache.maven.plugins:maven-compiler-plugin is missing. @ io.jpress:parent:${jpress.version}, D:\Program Files\jpress\pom.xml, line 146, column 21 [WARNING] [WARNING] Some problems were encountered while building the effective model for io.jpress:jpress-commons:jar:1.0 [WARNING] 'build.plugins.plugin.version' for org.apache.maven.plugins:maven-compiler-plugin is missing. @ io.jpress:parent:${jpress.version}, D:\Program Files\jpress\pom.xml, line 146, column 21 [WARNING] [WARNING] Some problems were encountered while building the effective model for io.jpress:jpress-core:jar:1.0 [WARNING] 'build.plugins.plugin.version' for org.apache.maven.plugins:maven-compiler-plugin is missing. @ io.jpress:jpress-core:[unknown-version], D:\Program Files\jpress\jpress-core\pom.xml, line 55, column 21 [WARNING] [WARNING] Some problems were encountered while building the effective model for io.jpress:jpress-web:jar:1.0 [WARNING] 'build.plugins.plugin.version' for org.apache.maven.plugins:maven-compiler-plugin is missing. @ io.jpress:parent:${jpress.version}, D:\Program Files\jpress\pom.xml, line 146, column 21 [WARNING] [WARNING] Some problems were encountered while building the effective model for io.jpress:jpress-service-api:jar:1.0 [WARNING] 'build.plugins.plugin.version' for org.apache.maven.plugins:maven-compiler-plugin is missing. @ io.jpress:parent:${jpress.version}, D:\Program Files\jpress\pom.xml, line 146, column 21 [WARNING] [WARNING] Some problems were encountered while building the effective model for io.jpress:jpress-service-provider:jar:1.0 [WARNING] 'build.plugins.plugin.version' for org.apache.maven.plugins:maven-compiler-plugin is missing. @ io.jpress:parent:${jpress.version}, D:\Program Files\jpress\pom.xml, line 146, column 21 [WARNING] [WARNING] Some problems were encountered while building the effective model for io.jpress:jpress-model:jar:1.0 [WARNING] 'build.plugins.plugin.version' for org.apache.maven.plugins:maven-compiler-plugin is missing. @ io.jpress:parent:${jpress.version}, D:\Program Files\jpress\pom.xml, line 146, column 21 [WARNING] [WARNING] Some problems were encountered while building the effective model for io.jpress:jpress-template:jar:1.0 [WARNING] 'build.plugins.plugin.version' for org.apache.maven.plugins:maven-compiler-plugin is missing. @ io.jpress:parent:${jpress.version}, D:\Program Files\jpress\pom.xml, line 146, column 21 [WARNING] [WARNING] Some problems were encountered while building the effective model for io.jpress:module-article-model:jar:1.0 [WARNING] 'build.plugins.plugin.version' for org.apache.maven.plugins:maven-compiler-plugin is missing. @ io.jpress:parent:${jpress.version}, D:\Program Files\jpress\pom.xml, line 146, column 21 [WARNING] [WARNING] Some problems were encountered while building the effective model for io.jpress:module-article-web:jar:1.0 [WARNING] 'build.plugins.plugin.version' for org.apache.maven.plugins:maven-compiler-plugin is missing. @ io.jpress:parent:${jpress.version}, D:\Program Files\jpress\pom.xml, line 146, column 21 [WARNING] [WARNING] Some problems were encountered while building the effective model for io.jpress:module-article-service-api:jar:1.0 [WARNING] 'build.plugins.plugin.version' for org.apache.maven.plugins:maven-compiler-plugin is missing. @ io.jpress:parent:${jpress.version}, D:\Program Files\jpress\pom.xml, line 146, column 21 [WARNING] [WARNING] Some problems were encountered while building the effective model for io.jpress:module-article-service-provider:jar:1.0 [WARNING] 'build.plugins.plugin.version' for org.apache.maven.plugins:maven-compiler-plugin is missing. @ io.jpress:parent:${jpress.version}, D:\Program Files\jpress\pom.xml, line 146, column 21 [WARNING] [WARNING] Some problems were encountered while building the effective model for io.jpress:module-article:pom:1.0 [WARNING] 'build.plugins.plugin.version' for org.apache.maven.plugins:maven-compiler-plugin is missing. @ io.jpress:parent:${jpress.version}, D:\Program Files\jpress\pom.xml, line 146, column 21 [WARNING] [WARNING] Some problems were encountered while building the effective model for io.jpress:module-page-model:jar:1.0 [WARNING] 'build.plugins.plugin.version' for org.apache.maven.plugins:maven-compiler-plugin is missing. @ io.jpress:parent:${jpress.version}, D:\Program Files\jpress\pom.xml, line 146, column 21 [WARNING] [WARNING] Some problems were encountered while building the effective model for io.jpress:module-page-web:jar:1.0 [WARNING] 'build.plugins.plugin.version' for org.apache.maven.plugins:maven-compiler-plugin is missing. @ io.jpress:parent:${jpress.version}, D:\Program Files\jpress\pom.xml, line 146, column 21 [WARNING] [WARNING] Some problems were encountered while building the effective model for io.jpress:module-page-service-api:jar:1.0 [WARNING] 'build.plugins.plugin.version' for org.apache.maven.plugins:maven-compiler-plugin is missing. @ io.jpress:parent:${jpress.version}, D:\Program Files\jpress\pom.xml, line 146, column 21 [WARNING] [WARNING] Some problems were encountered while building the effective model for io.jpress:module-page-service-provider:jar:1.0 [WARNING] 'build.plugins.plugin.version' for org.apache.maven.plugins:maven-compiler-plugin is missing. @ io.jpress:parent:${jpress.version}, D:\Program Files\jpress\pom.xml, line 146, column 21 [WARNING] [WARNING] Some problems were encountered while building the effective model for io.jpress:module-page:pom:1.0 [WARNING] 'build.plugins.plugin.version' for org.apache.maven.plugins:maven-compiler-plugin is missing. @ io.jpress:parent:${jpress.version}, D:\Program Files\jpress\pom.xml, line 146, column 21 [WARNING] [WARNING] Some problems were encountered while building the effective model for io.jpress:starter:jar:1.0 [WARNING] 'build.plugins.plugin.(groupId:artifactId)' must be unique but found duplicate declaration of plugin org.apache.maven.plugins:maven-remote-resources-plugin @ io.jpress:starter:[unknown-version], D:\Program Files\jpress\starter\pom.xml, line 203, column 21 [WARNING] 'build.plugins.plugin.version' for org.apache.maven.plugins:maven-compiler-plugin is missing. @ io.jpress:starter:[unknown-version], D:\Program Files\jpress\starter\pom.xml, line 142, column 21 [WARNING] [WARNING] Some problems were encountered while building the effective model for io.jpress:starter-tomcat:war:1.0 [WARNING] 'build.plugins.plugin.version' for org.apache.maven.plugins:maven-compiler-plugin is missing. @ io.jpress:starter-tomcat:[unknown-version], D:\Program Files\jpress\starter-tomcat\pom.xml, line 164, column 21 [WARNING] 'build.plugins.plugin.version' for org.apache.maven.plugins:maven-war-plugin is missing. @ io.jpress:starter-tomcat:[unknown-version], D:\Program Files\jpress\starter-tomcat\pom.xml, line 221, column 21 [WARNING] [WARNING] Some problems were encountered while building the effective model for io.jpress:parent:pom:1.0 [WARNING] 'version' contains an expression but should be a constant. @ io.jpress:parent:${jpress.version}, D:\Program Files\jpress\pom.xml, line 10, column 14 [WARNING] 'build.plugins.plugin.version' for org.apache.maven.plugins:maven-compiler-plugin is missing. @ io.jpress:parent:${jpress.version}, D:\Program Files\jpress\pom.xml, line 146, column 21 [WARNING] [WARNING] It is highly recommended to fix these problems because they threaten the stability of your build. [WARNING] [WARNING] For this reason, future Maven versions might no longer support building such malformed projects. [WARNING] [INFO] ------------------------------------------------------------------------ [INFO] Reactor Build Order: [INFO] [INFO] parent [pom] [INFO] codegen [jar] [INFO] jpress-commons [jar] [INFO] jpress-model [jar] [INFO] jpress-service-api [jar] [INFO] jpress-core [jar] [INFO] jpress-web [jar] [INFO] jpress-service-provider [jar] [INFO] jpress-template [jar] [INFO] module-article [pom] [INFO] module-article-model [jar] [INFO] module-article-service-api [jar] [INFO] module-article-service-provider [jar] [INFO] module-article-web [jar] [INFO] module-page [pom] [INFO] module-page-model [jar] [INFO] module-page-service-api [jar] [INFO] module-page-service-provider [jar] [INFO] module-page-web [jar] [INFO] starter [jar] [INFO] starter-tomcat [war] [INFO] [INFO] --------------------------< io.jpress:parent >-------------------------- [INFO] Building parent 1.0 [1/21] [INFO] --------------------------------[ pom ]--------------------------------- [INFO] [INFO] -------------------------< io.jpress:codegen >-------------------------- [INFO] Building codegen 1.0 [2/21] [INFO] --------------------------------[ jar ]--------------------------------- [INFO] [INFO] --- maven-resources-plugin:2.6:resources (default-resources) @ codegen --- [WARNING] Using platform encoding (GBK actually) to copy filtered resources, i.e. build is platform dependent! [INFO] Copying 9 resources [INFO] skip non existing resourceDirectory D:\Program Files\jpress\codegen\src\main\resources [INFO] [INFO] --- maven-compiler-plugin:3.1:compile (default-compile) @ codegen --- [INFO] Changes detected - recompiling the module! [INFO] Compiling 7 source files to D:\Program Files\jpress\codegen\target\classes [INFO] ------------------------------------------------------------- [ERROR] COMPILATION ERROR : [INFO] ------------------------------------------------------------- [ERROR] No compiler is provided in this environment. Perhaps you are running on a JRE rather than a JDK? [INFO] 1 error [INFO] ------------------------------------------------------------- [INFO] ------------------------------------------------------------------------ [INFO] Reactor Summary: [INFO] [INFO] parent 1.0 ......................................... SUCCESS [ 0.228 s] [INFO] codegen ............................................ FAILURE [ 4.318 s] [INFO] jpress-commons ..................................... SKIPPED [INFO] jpress-model ....................................... SKIPPED [INFO] jpress-service-api ................................. SKIPPED [INFO] jpress-core ........................................ SKIPPED [INFO] jpress-web ......................................... SKIPPED [INFO] jpress-service-provider ............................ SKIPPED [INFO] jpress-template .................................... SKIPPED [INFO] module-article ..................................... SKIPPED [INFO] module-article-model ............................... SKIPPED [INFO] module-article-service-api ......................... SKIPPED [INFO] module-article-service-provider .................... SKIPPED [INFO] module-article-web ................................. SKIPPED [INFO] module-page ........................................ SKIPPED [INFO] module-page-model .................................. SKIPPED [INFO] module-page-service-api ............................ SKIPPED [INFO] module-page-service-provider ....................... SKIPPED [INFO] module-page-web .................................... SKIPPED [INFO] starter ............................................ SKIPPED [INFO] starter-tomcat 1.0 ................................. SKIPPED [INFO] ------------------------------------------------------------------------ [INFO] BUILD FAILURE [INFO] ------------------------------------------------------------------------ [INFO] Total time: 6.688 s [INFO] Finished at: 2018-10-27T17:50:59+08:00 [INFO] ------------------------------------------------------------------------ [ERROR] Failed to execute goal org.apache.maven.plugins:maven-compiler-plugin:3.1:compile (default-compile) on project codegen: Compilation failure [ERROR] No compiler is provided in this environment. Perhaps you are running on a JRE rather than a JDK? [ERROR] [ERROR] -> [Help 1] [ERROR] [ERROR] To see the full stack trace of the errors, re-run Maven with the -e switch. [ERROR] Re-run Maven using the -X switch to enable full debug logging. [ERROR] [ERROR] For more information about the errors and possible solutions, please read the following articles: [ERROR] [Help 1] http://cwiki.apache.org/confluence/display/MAVEN/MojoFailureException [ERROR] [ERROR] After correcting the problems, you can resume the build with the command [ERROR] mvn <goals> -rf :codegen mvn -version运行正常: Apache Maven 3.5.4 (1edded0938998edf8bf061f1ceb3cfdeccf443fe; 2018-06-18T02:33:14+08:00) Maven home: D:\Program Files\Apache\maven3.5.4\bin\.. Java version: 1.8.0_141, vendor: Oracle Corporation, runtime: C:\Program Files\Java\jre1.8.0_141 Default locale: zh_CN, platform encoding: GBK OS name: "windows 10", version: "10.0", arch: "amd64", family: "windows" 阿里云镜像配置没问题: <mirrors> <!-- mirror | Specifies a repository mirror site to use instead of a given repository. The repository that | this mirror serves has an ID that matches the mirrorOf element of this mirror. IDs are used | for inheritance and direct lookup purposes, and must be unique across the set of mirrors. | <mirror> <id>mirrorId</id> <mirrorOf>repositoryId</mirrorOf> <name>Human Readable Name for this Mirror.</name> <url>http://my.repository.com/repo/path</url> </mirror> --> <mirror> <id>alimaven</id> <name>aliyun maven</name> <url>http://maven.aliyun.com/nexus/content/groups/public/</url> <mirrorOf>central</mirrorOf> </mirror> </mirrors>
maven编译依赖快照版本有时间,导致依赖库找不到
MANIFEST.MF文件里面的信息: Manifest-Version: 1.0 Built-By: Administrator Build-Jdk: 1.6.0_10-rc2 Class-Path: lib/storage-1.0-20131202.054649-56.jar lib/compframe-1.0-2 0131202.072442-8.jar 实际下载到lib目录中的是storage-1.0--SNAPSHOT.jar这样。 pom文件: ​... org.apache.maven.plugins maven-compiler-plugin 3.0 lib UTF-8 <!-- 设置程序入口类,并设置依赖目录 --> <plugin> <groupId>org.apache.maven.plugins</groupId> <artifactId>maven-jar-plugin</artifactId> <version>2.4</version> <configuration> <archive> <manifest> <addClasspath>true</addClasspath> <classpathPrefix>lib</classpathPrefix> <mainClass>main.Main</mainClass> </manifest> </archive> </configuration> </plugin> <!-- 设置依赖库到打包生成目录下的lib目录 --> <plugin> <groupId>org.apache.maven.plugins</groupId> <artifactId>maven-dependency-plugin</artifactId> <executions> <execution> <id>copy</id> <phase>install</phase> <goals> <goal>copy-dependencies</goal> </goals> <configuration> <outputDirectory> ${project.build.directory}/lib </outputDirectory> </configuration> </execution> </executions> </plugin> ...
在控制台上maven打包报错。
楼主刚看徐晓斌的《maven实战》,正在控制台上鼓捣maven呢,mvn clean compile,mvn clean test也成功,然后mvn clean package打包也成功,但是由于打出来的Jar包没有指定main方法的位置,我就按照书上的案例,加入maven-shade-plugin插件,在pom.xml加入这话话,一直打包都是错误的。 pom.xml文件配置如下: ``` <?xml version="1.0" encoding="UTF-8"?> <project xmlns="http://maven.apache.org/POM/4.0.0" xmlns:xsi="http://www.w3.org/2001/XMLSchema-instance" xsi:schemaLocation="http://maven.apache.org/POM/4.0.0 http://maven.apache.org/xsd/maven-4.0.0.xsd"> <modelVersion>4.0.0</modelVersion> <groupId>xx.xx.xxx</groupId> <artifactId>hello-maven</artifactId> <version>1.0-SNAPSHOT</version> <packaging>jar</packaging> <properties> <project.build.sourceEncoding>UTF-8</project.build.sourceEncoding> </properties> <dependencies> <dependency> <groupId>junit</groupId> <artifactId>junit</artifactId> <version>3.8.1</version> <scope>test</scope> </dependency> </dependencies> <build> <plugins> <plugin> <groupId>org.apache.maven.plugins</groupId> <artifactId>maven-compiler-plugin</artifactId> <configuration> <source>1.6</source> <target>1.6</target> </configuration> </plugin> <plugin> <groupId>org.apache.maven.plugins</groupId> <artifactId>maven-shade-plugin</artifactId> <version>1.2.1</version> <configuration> <transformers> <transformer implementation = "org.apache.maven.plugins.shade.resource.MainifestResourceTransformer"> <mainClass>xx.xxx.xxx.hellomaven.App</mainClass> </transformer> </transformers> </configuration> <executions> <execution> <phase>package</phase> <goals> <goal>shade</goal> </goals> </execution> </executions> </plugin> </plugins> </build> </project> ``` 控制台报错信息如下: ``` [INFO] BUILD FAILURE [INFO] ------------------------------------------------------------------------ [INFO] Total time: 1.731s [INFO] Finished at: Tue Mar 29 11:40:17 CST 2016 [INFO] Final Memory: 10M/24M [INFO] ------------------------------------------------------------------------ [ERROR] Failed to execute goal org.apache.maven.plugins:maven-shade-plugin:1.2.1 :shade (default) on project hello-maven: Unable to parse configuration of mojo o rg.apache.maven.plugins:maven-shade-plugin:1.2.1:shade: ClassNotFoundException: Class name which was explicitly given in configuration using 'implementation' at tribute: 'org.apache.maven.plugins.shade.resource.MainifestResourceTransformer' cannot be loaded -> [Help 1] [ERROR] [ERROR] To see the full stack trace of the errors, re-run Maven with the -e swit ch. [ERROR] Re-run Maven using the -X switch to enable full debug logging. [ERROR] [ERROR] For more information about the errors and possible solutions, please rea d the following articles: [ERROR] [Help 1] http://cwiki.apache.org/confluence/display/MAVEN/PluginConfigur ationException ``` ~\m2\repository\org\apache\maven\plugins\maven-compiler-plugin 里面居然是2.3.2版本,我的本地仓库下载下载下来的不是指定的那个1.2.1版本,这是怎么回事?
eclipse创建maven工程时报错
使用的是官方的Eclipse中自带的m2e插件,创建maven项目时就弹出个错误 ![图片说明](https://img-ask.csdn.net/upload/201507/15/1436949464_186734.png) 在pom.xml文件那会显示个红X,提示如下: Multiple annotations found at this line: - Plugin execution not covered by lifecycle configuration: org.apache.maven.plugins:maven-compiler-plugin:3.1:testCompile (execution: default-testCompile, phase: test- compile) - Execution default-resources of goal org.apache.maven.plugins:maven-resources-plugin:2.6:resources failed: Plugin org.apache.maven.plugins:maven-resources-plugin:2.6 or one of its dependencies could not be resolved: The following artifacts could not be resolved: org.apache.maven:maven-plugin-api:jar:2.0.6, org.apache.maven:maven- project:jar:2.0.6, org.apache.maven:maven-profile:jar:2.0.6, org.apache.maven:maven-artifact-manager:jar:2.0.6, org.apache.maven:maven-plugin-registry:jar:2.0.6, org.apache.maven:maven-core:jar:2.0.6, org.apache.maven:maven-plugin-parameter-documenter:jar:2.0.6, org.apache.maven:maven-repository-metadata:jar:2.0.6, org.apache.maven:maven-error-diagnostics:jar:2.0.6, org.apache.maven:maven-plugin-descriptor:jar:2.0.6, org.apache.maven:maven-artifact:jar:2.0.6, org.apache.maven:maven- settings:jar:2.0.6, org.apache.maven:maven-model:jar:2.0.6, org.apache.maven:maven-monitor:jar:2.0.6, org.codehaus.plexus:plexus-container-default:jar:1.0-alpha-9-stable-1: Failure to transfer org.apache.maven:maven-plugin-api:jar:2.0.6 from https://repo.maven.apache.org/maven2 was cached in the local repository, resolution will not be reattempted until the update interval of central has elapsed or updates are forced. Original error: Could not transfer artifact org.apache.maven:maven-plugin-api:jar:2.0.6 from/to central (https://repo.maven.apache.org/maven2): The operation was cancelled. (org.apache.maven.plugins:maven-resources-plugin:2.6:resources:default-resources:process-resources) org.apache.maven.plugin.PluginExecutionException: Execution default-resources of goal org.apache.maven.plugins:maven-resources-plugin:2.6:resources failed: Plugin org.apache.maven.plugins:maven-resources-plugin:2.6 or one of its dependencies could not be resolved: The following artifacts could not be resolved: org.apache.maven:maven- plugin-api:jar:2.0.6, org.apache.maven:maven-project:jar:2.0.6, org.apache.maven:maven-profile:jar:2.0.6, org.apache.maven:maven-artifact-manager:jar:2.0.6, org.apache.maven:maven-plugin-registry:jar:2.0.6, org.apache.maven:maven-core:jar:2.0.6, org.apache.maven:maven-plugin-parameter-documenter:jar:2.0.6, org.apache.maven:maven-repository-metadata:jar:2.0.6, org.apache.maven:maven-error-diagnostics:jar:2.0.6, org.apache.maven:maven-plugin-descriptor:jar:2.0.6, org.apache.maven:maven-artifact:jar:2.0.6, org.apache.maven:maven-settings:jar:2.0.6, org.apache.maven:maven-model:jar:2.0.6, org.apache.maven:maven-monitor:jar:2.0.6, org.codehaus.plexus:plexus-container-default:jar:1.0-alpha-9-stable-1: Failure to transfer org.apache.maven:maven-plugin-api:jar:2.0.6 from https://repo.maven.apache.org/ maven2 was cached in the local repository, resolution will not be reattempted until the update interval of central has elapsed or updates are forced. Original error: Could not transfer artifact org.apache.maven:maven-plugin-api:jar:2.0.6 from/to central (https://repo.maven.apache.org/maven2): The operation was cancelled. at org.apache.maven.plugin.DefaultBuildPluginManager.executeMojo(DefaultBuildPluginManager.java:106) at org.eclipse.m2e.core.internal.embedder.MavenImpl.execute(MavenImpl.java:331) at org.eclipse.m2e.core.internal.embedder.MavenImpl$11.call(MavenImpl.java:1362) at org.eclipse.m2e.core.internal.embedder.MavenImpl$11.call(MavenImpl.java:1) at org.eclipse.m2e.core.internal.embedder.MavenExecutionContext.executeBare(MavenExecutionContext.java:176) at org.eclipse.m2e.core.internal.embedder.MavenExecutionContext.execute(MavenExecutionContext.java:112) at org.eclipse.m2e.core.internal.embedder.MavenImpl.execute(MavenImpl.java:1360) at org.eclipse.m2e.core.project.configurator.MojoExecutionBuildParticipant.build(MojoExecutionBuildParticipant.java:52) at org.eclipse.m2e.core.internal.builder.MavenBuilderImpl.build(MavenBuilderImpl.java:137) at org.eclipse.m2e.core.internal.builder.MavenBuilder$1.method(MavenBuilder.java:172) at org.eclipse.m2e.core.internal.builder.MavenBuilder$1.method(MavenBuilder.java:1) at org.eclipse.m2e.core.internal.builder.MavenBuilder$BuildMethod$1$1.call(MavenBuilder.java: 115) at org.eclipse.m2e.core.internal.embedder.MavenExecutionContext.executeBare(MavenExecutionContext.java:176) at org.eclipse.m2e.core.internal.embedder.MavenExecutionContext.execute(MavenExecutionContext.java:112) at org.eclipse.m2e.core.internal.builder.MavenBuilder$BuildMethod $1.call(MavenBuilder.java:105) at org.eclipse.m2e.core.internal.embedder.MavenExecutionContext.executeBare(MavenExecutionContext.java:176) at org.eclipse.m2e.core.internal.embedder.MavenExecutionContext.execute(MavenExecutionContext.java:151) at org.eclipse.m2e.core.internal.embedder.MavenExecutionContext.execute(MavenExecutionContext.java:99) at org.eclipse.m2e.core.internal.builder.MavenBuilder $BuildMethod.execute(MavenBuilder.java:86) at org.eclipse.m2e.core.internal.builder.MavenBuilder.build(MavenBuilder.java:200) at org.eclipse.core.internal.events.BuildManager $2.run(BuildManager.java:734) at org.eclipse.core.runtime.SafeRunner.run(SafeRunner.java:42) at org.eclipse.core.internal.events.BuildManager.basicBuild(BuildManager.java:205) at org.eclipse.core.internal.events.BuildManager.basicBuild(BuildManager.java:245) at org.eclipse.core.internal.events.BuildManager$1.run(BuildManager.java:300) at org.eclipse.core.runtime.SafeRunner.run(SafeRunner.java:42) at org.eclipse.core.internal.events.BuildManager.basicBuild(BuildManager.java:303) at org.eclipse.core.internal.events.BuildManager.basicBuildLoop(BuildManager.java:359) at org.eclipse.core.internal.events.BuildManager.build(BuildManager.java:382) at org.eclipse.core.internal.events.AutoBuildJob.doBuild(AutoBuildJob.java:144) at org.eclipse.core.internal.events.AutoBuildJob.run(AutoBuildJob.java:235) at org.eclipse.core.internal.jobs.Worker.run(Worker.java:55) Caused by: org.apache.maven.plugin.PluginResolutionException: Plugin org.apache.maven.plugins:maven-resources- plugin:2.6 or one of its dependencies could not be resolved: The following artifacts could not be resolved: org.apache.maven:maven-plugin-api:jar:2.0.6, org.apache.maven:maven- project:jar:2.0.6, org.apache.maven:maven-profile:jar:2.0.6, 请问如何解决?谢谢 ----- 本机安装的maven是3.2.2 eclipse是4.5 m2e是1.2 ----- 最后也不知道什么原因,重新下了eclipse就没有问题了
工程pom里已配置关了test, 但想命令行临时运行一下test,mvn命令是怎样的?
我的Maven工程pom.xml里已配置关了test, <plugin> <artifactId>maven-surefire-plugin</artifactId> <version>2.7.1</version> <executions> <execution> <id>default-test</id> <phase>test</phase> <goals> <goal>test</goal> </goals> </execution> </executions> <configuration> <!-- <testFailureIgnore>true</testFailureIgnore> --> <!-- <skip>true</skip> --> <skipTests>true</skipTests> </configuration> </plugin> 但我想命令行运行,临时打开test跑一下, 我用 mvn test -DskipTests=false 但仍然是skip跳过 D:\GIT_Work\iVIEW8.5\oss\xml\xmlservice\api>mvn test -DskipTests=false [INFO] Scanning for projects... [INFO] [INFO] ------------------------------------------------------------------------ [INFO] Building xmlservice-api 8.2.0-SNAPSHOT [INFO] ------------------------------------------------------------------------ [INFO] [INFO] --- maven-resources-plugin:2.5:resources (default-resources) @ xmlservice-api --- [debug] execute contextualize [INFO] Using 'UTF-8' encoding to copy filtered resources. [INFO] Copying 2 resources [INFO] [INFO] --- maven-compiler-plugin:2.5.1:compile (default-compile) @ xmlservice-api --- [INFO] Nothing to compile - all classes are up to date [INFO] [INFO] --- native2ascii-maven-plugin:1.0-beta-1:native2ascii (native2ascii) @ xmlservice-api --- [INFO] Includes: [*.properties] [INFO] Excludes: [] [INFO] Processing D:\GIT_Work\iVIEW8.5\oss\xml\xmlservice\api\target\classes\xmlservicebiz.properties [INFO] Processing D:\GIT_Work\iVIEW8.5\oss\xml\xmlservice\api\target\classes\xmlservicebiz_zh_CN.properties [INFO] [INFO] --- maven-resources-plugin:2.5:testResources (default-testResources) @ xmlservice-api --- [debug] execute contextualize [INFO] Using 'UTF-8' encoding to copy filtered resources. [INFO] Copying 4 resources [INFO] [INFO] --- maven-compiler-plugin:2.5.1:testCompile (default-testCompile) @ xmlservice-api --- [INFO] Nothing to compile - all classes are up to date [INFO] [INFO] --- maven-surefire-plugin:2.7.1:test (default-test) @ xmlservice-api --- [INFO] Tests are skipped. [INFO] ------------------------------------------------------------------------ [INFO] BUILD SUCCESS [INFO] ------------------------------------------------------------------------ [INFO] Total time: 0.939s [INFO] Finished at: Fri Sep 18 17:47:24 CST 2015 [INFO] Final Memory: 11M/371M [INFO] ------------------------------------------------------------------------ 临时打开test跑一下的mvn命令应该是怎样的呢?
maven 依赖 用 tomcat7-maven插件 run运行时报错 求解决
tomcat7 用maven依赖插件 运行报错 //项目框架 spring+springmvc ![图片说明](https://img-ask.csdn.net/upload/201908/08/1565260003_595830.png) //目录结构 ![图片说明](https://img-ask.csdn.net/upload/201908/08/1565260208_492937.png) //web.xml ``` <?xml version="1.0" encoding="UTF-8"?> <web-app xmlns:xsi="http://www.w3.org/2001/XMLSchema-instance" xmlns="http://java.sun.com/xml/ns/javaee" xsi:schemaLocation="http://java.sun.com/xml/ns/javaee http://java.sun.com/xml/ns/javaee/web-app_2_5.xsd" version="2.5"> <display-name>ss1</display-name> <welcome-file-list> <welcome-file>index.html</welcome-file> </welcome-file-list> <!-- SpringSecurity过滤器链 名字一定要叫做springSecurityFilterChain 是她内置的 --> <filter> <filter-name>springSecurityFilterChain</filter-name> <filter-class>org.springframework.web.filter.DelegatingFilterProxy</filter-class> </filter> <filter-mapping> <filter-name>springSecurityFilterChain</filter-name> <!--/*代表拦截所有资源--> <url-pattern>/*</url-pattern> </filter-mapping> <!-- 启动Spring --> <listener> <listener-class>org.springframework.web.context.ContextLoaderListener</listener-class> </listener> <context-param> <param-name>contextConfigLocation</param-name> <param-value> classpath:applicationContext.xml classpath:spring-security.xml </param-value> </context-param> <!--启动SpringMVC--> <servlet> <servlet-name>ss1</servlet-name> <servlet-class>org.springframework.web.servlet.DispatcherServlet</servlet-class> <init-param> <param-name>contextConfigLocation</param-name> <param-value>classpath:springmvc.xml</param-value> </init-param> <!-- 服务器启动加载Servlet 默认第一次访问启动--> <load-on-startup>1</load-on-startup> </servlet> <servlet-mapping> <servlet-name>ss1</servlet-name> <url-pattern>/</url-pattern> </servlet-mapping> </web-app> ``` //pom.xml ``` <?xml version="1.0" encoding="UTF-8"?> <project xmlns="http://maven.apache.org/POM/4.0.0" xmlns:xsi="http://www.w3.org/2001/XMLSchema-instance" xsi:schemaLocation="http://maven.apache.org/POM/4.0.0 http://maven.apache.org/xsd/maven-4.0.0.xsd"> <modelVersion>4.0.0</modelVersion> <groupId>cn.ruanlam</groupId> <artifactId>02.spring-security</artifactId> <version>1.0-SNAPSHOT</version> <modules> <module>../02.springsecurity</module> </modules> <packaging>pom</packaging> <url>http://www.example.com</url> <properties> <jdk.version>1.8</jdk.version> <spring.version>4.3.10.RELEASE</spring.version> <spring.security.version>4.2.3.RELEASE</spring.security.version> <jstl.version>1.2</jstl.version> <servlet.version>2.5</servlet.version> </properties> <dependencies> <!-- Spring dependencies --> <dependency> <groupId>org.springframework</groupId> <artifactId>spring-core</artifactId> <version>${spring.version}</version> </dependency> <dependency> <groupId>org.springframework</groupId> <artifactId>spring-web</artifactId> <version>${spring.version}</version> </dependency> <dependency> <groupId>org.springframework</groupId> <artifactId>spring-webmvc</artifactId> <version>${spring.version}</version> </dependency> <!-- Spring Security --> <dependency> <groupId>org.springframework.security</groupId> <artifactId>spring-security-web</artifactId> <version>${spring.security.version}</version> </dependency> <dependency> <groupId>org.springframework.security</groupId> <artifactId>spring-security-config</artifactId> <version>${spring.security.version}</version> </dependency> <!-- jstl for jsp page --> <dependency> <groupId>jstl</groupId> <artifactId>jstl</artifactId> <version>${jstl.version}</version> </dependency> <dependency> <groupId>javax.servlet</groupId> <artifactId>servlet-api</artifactId> <version>${servlet.version}</version> <scope>provided</scope> </dependency> <dependency> <groupId>com.fasterxml.jackson.core</groupId> <artifactId>jackson-databind</artifactId> <version>2.9.5</version> </dependency> </dependencies> <build> <plugins> <plugin> <groupId>org.apache.maven.plugins</groupId> <artifactId>maven-surefire-plugin</artifactId> <version>2.6</version> <configuration> <skipTests>true</skipTests> </configuration> </plugin> <!-- jdk版本插件 --> <plugin> <groupId>org.apache.maven.plugins</groupId> <artifactId>maven-compiler-plugin</artifactId> <version>3.2</version> <configuration> <source>1.8</source> <target>1.8</target> <encoding>UTF-8</encoding> <showWarnings>true</showWarnings> </configuration> </plugin> <!-- tomcat7插件 --> <plugin> <groupId>org.apache.tomcat.maven</groupId> <artifactId>tomcat7-maven-plugin</artifactId> <version>2.2</version> <configuration> <port>8080</port> <path>/ss1</path> <server>tomcat7</server> <uriEncoding>UTF-8</uriEncoding> </configuration> </plugin> </plugins> </build> </project> ``` //报错内容 ``` D:\career\Java\jdk1.8.0_152\bin\java.exe -Dmaven.multiModuleProjectDirectory=D:\career\workspaceTest\02.springsecurity -Dmaven.home=D:\career\Java\apache-maven-3.6.0 -Dclassworlds.conf=D:\career\Java\apache-maven-3.6.0\bin\m2.conf "-javaagent:D:\career\JetBrains\IntelliJ IDEA 2018.2.1\lib\idea_rt.jar=65491:D:\career\JetBrains\IntelliJ IDEA 2018.2.1\bin" -Dfile.encoding=UTF-8 -classpath D:\career\Java\apache-maven-3.6.0\boot\plexus-classworlds-2.5.2.jar org.codehaus.classworlds.Launcher -Didea.version=2018.2.1 -s D:\career\Java\apache-maven-3.6.0\conf\settings.xml org.apache.tomcat.maven:tomcat7-maven-plugin:2.2:run [INFO] Scanning for projects... [ERROR] [ERROR] Some problems were encountered while processing the POMs: [ERROR] Child module D:\career\workspaceTest\02.springsecurity\pom.xml of D:\career\workspaceTest\02.springsecurity\pom.xml forms aggregation cycle D:\career\workspaceTest\02.springsecurity\pom.xml -> D:\career\workspaceTest\02.springsecurity\pom.xml @ @ [ERROR] The build could not read 1 project -> [Help 1] [ERROR] [ERROR] The project cn.ruanlam:02.spring-security:1.0-SNAPSHOT (D:\career\workspaceTest\02.springsecurity\pom.xml) has 1 error [ERROR] Child module D:\career\workspaceTest\02.springsecurity\pom.xml of D:\career\workspaceTest\02.springsecurity\pom.xml forms aggregation cycle D:\career\workspaceTest\02.springsecurity\pom.xml -> D:\career\workspaceTest\02.springsecurity\pom.xml [ERROR] [ERROR] To see the full stack trace of the errors, re-run Maven with the -e switch. [ERROR] Re-run Maven using the -X switch to enable full debug logging. [ERROR] [ERROR] For more information about the errors and possible solutions, please read the following articles: [ERROR] [Help 1] http://cwiki.apache.org/confluence/display/MAVEN/ProjectBuildingException Process finished with exit code 1 ``` //最终已解决 pom.xml 标签packaging里面改成war ``` <?xml version="1.0" encoding="UTF-8"?> <project xmlns="http://maven.apache.org/POM/4.0.0" xmlns:xsi="http://www.w3.org/2001/XMLSchema-instance" xsi:schemaLocation="http://maven.apache.org/POM/4.0.0 http://maven.apache.org/xsd/maven-4.0.0.xsd"> <modelVersion>4.0.0</modelVersion> <groupId>cn.ruanlam</groupId> <artifactId>02.spring-security</artifactId> <version>0.0.1-SNAPSHOT</version> <packaging>war</packaging> <name>rVideos</name> <url>http://maven.apache.org</url> <properties> <jdk.version>1.8</jdk.version> <spring.version>4.3.10.RELEASE</spring.version> <spring.security.version>4.2.3.RELEASE</spring.security.version> <jstl.version>1.2</jstl.version> <servlet.version>2.5</servlet.version> </properties> <dependencies> <!-- Spring dependencies --> <dependency> <groupId>org.springframework</groupId> <artifactId>spring-core</artifactId> <version>${spring.version}</version> </dependency> <dependency> <groupId>org.springframework</groupId> <artifactId>spring-web</artifactId> <version>${spring.version}</version> </dependency> <dependency> <groupId>org.springframework</groupId> <artifactId>spring-webmvc</artifactId> <version>${spring.version}</version> </dependency> <!-- Spring Security --> <dependency> <groupId>org.springframework.security</groupId> <artifactId>spring-security-web</artifactId> <version>${spring.security.version}</version> </dependency> <dependency> <groupId>org.springframework.security</groupId> <artifactId>spring-security-config</artifactId> <version>${spring.security.version}</version> </dependency> <!-- jstl for jsp page --> <dependency> <groupId>jstl</groupId> <artifactId>jstl</artifactId> <version>${jstl.version}</version> </dependency> <dependency> <groupId>javax.servlet</groupId> <artifactId>servlet-api</artifactId> <version>${servlet.version}</version> <scope>provided</scope> </dependency> <dependency> <groupId>com.fasterxml.jackson.core</groupId> <artifactId>jackson-databind</artifactId> <version>2.9.5</version> </dependency> <!-- JSON lib 开发包 以及它的依赖包 --> <dependency> <groupId>net.sf.json-lib</groupId> <artifactId>json-lib</artifactId> <classifier>jdk15</classifier> <version>2.4</version> </dependency> <dependency> <groupId>commons-beanutils</groupId> <artifactId>commons-beanutils</artifactId> <version>1.8.3</version> </dependency> <dependency> <groupId>commons-collections</groupId> <artifactId>commons-collections</artifactId> <version>3.2.1</version> </dependency> <dependency> <groupId>commons-lang</groupId> <artifactId>commons-lang</artifactId> <version>2.6</version> </dependency> <dependency> <groupId>net.sf.ezmorph</groupId> <artifactId>ezmorph</artifactId> <version>1.0.5</version> </dependency> <!--mybaits相关依赖--> <dependency> <groupId>org.mybatis</groupId> <artifactId>mybatis</artifactId> <version>3.4.4</version> </dependency> <dependency> <groupId>log4j</groupId> <artifactId>log4j</artifactId> <version>1.2.17</version> </dependency> <dependency> <groupId>org.mybatis</groupId> <artifactId>mybatis-spring</artifactId> <version>1.3.0</version> </dependency> <dependency> <groupId>com.alibaba</groupId> <artifactId>druid</artifactId> <version>1.1.7</version> </dependency> <!--mysql的驱动--> <dependency> <groupId>mysql</groupId> <artifactId>mysql-connector-java</artifactId> <version>5.1.41</version> </dependency> <dependency> <groupId>junit</groupId> <artifactId>junit</artifactId> <version>4.12</version> <scope>test</scope> </dependency> <!--jdbc依赖--> <dependency> <groupId>org.springframework</groupId> <artifactId>spring-jdbc</artifactId> <version>${spring.version}</version> </dependency> <dependency> <groupId>org.springframework</groupId> <artifactId>spring-test</artifactId> <version>${spring.version}</version> </dependency> <dependency> <groupId>com.fasterxml.jackson.core</groupId> <artifactId>jackson-databind</artifactId> <version>2.9.5</version> </dependency> <dependency> <groupId>junit</groupId> <artifactId>junit</artifactId> <version>RELEASE</version> <scope>compile</scope> </dependency> </dependencies> <build> <plugins> <plugin> <groupId>org.apache.maven.plugins</groupId> <artifactId>maven-surefire-plugin</artifactId> <version>2.6</version> <configuration> <skipTests>true</skipTests> </configuration> </plugin> <!-- jdk版本插件 --> <plugin> <groupId>org.apache.maven.plugins</groupId> <artifactId>maven-compiler-plugin</artifactId> <version>3.2</version> <configuration> <source>1.8</source> <target>1.8</target> <encoding>UTF-8</encoding> <showWarnings>true</showWarnings> </configuration> </plugin> <!-- tomcat7插件 --> <plugin> <groupId>org.apache.tomcat.maven</groupId> <artifactId>tomcat7-maven-plugin</artifactId> <version>2.1</version> <configuration> <port>8080</port> <path>/ss2</path> <server>tomcat7</server> <uriEncoding>UTF-8</uriEncoding> </configuration> </plugin> </plugins> <!-- idea不会自动把xml配置文件加载到target里面--> <resources> <resource> <directory>${basedir}/src/main/resource</directory> <includes> <!--<include>**/*.xml</include>--> <include>**/*.*</include> </includes> </resource> </resources> <!-- <resources> <resource> <directory>src/main/java</directory> <includes> <include>**/*.*</include> </includes> <excludes> <exclude>**/*.java</exclude> </excludes> </resource> </resources>--> </build> </project> ```
springboot入门项目打包出错
执行clean package时候报错项目正常运行 [INFO] --- maven-clean-plugin:2.6.1:clean (default-clean) @ demo-test --- [INFO] Deleting E:\EclipseMars\e3-manager\demo-test\target [INFO] [INFO] --- maven-resources-plugin:2.6:resources (default-resources) @ demo-test --- [INFO] Using 'UTF-8' encoding to copy filtered resources. [INFO] Copying 1 resource [INFO] Copying 0 resource [INFO] [INFO] --- maven-compiler-plugin:3.1:compile (default-compile) @ demo-test --- [INFO] Changes detected - recompiling the module! [INFO] Compiling 2 source files to E:\EclipseMars\e3-manager\demo-test\target\classes [INFO] ------------------------------------------------------------- [ERROR] COMPILATION ERROR : [INFO] ------------------------------------------------------------- [ERROR] No compiler is provided in this environment. Perhaps you are running on a JRE rather than a JDK? [INFO] 1 error [INFO] ------------------------------------------------------------- [INFO] ------------------------------------------------------------------------ [INFO] BUILD FAILURE [INFO] ------------------------------------------------------------------------ [INFO] Total time: 16.689 s [INFO] Finished at: 2018-06-30T16:12:47+08:00 [INFO] Final Memory: 20M/112M [INFO] ------------------------------------------------------------------------ [WARNING] The requested profile "pom.xml" could not be activated because it does not exist. [ERROR] Failed to execute goal org.apache.maven.plugins:maven-compiler-plugin:3.1:compile (default-compile) on project demo-test: Compilation failure [ERROR] No compiler is provided in this environment. Perhaps you are running on a JRE rather than a JDK? [ERROR] -> [Help 1] [ERROR] [ERROR] To see the full stack trace of the errors, re-run Maven with the -e switch. [ERROR] Re-run Maven using the -X switch to enable full debug logging. [ERROR] [ERROR] For more information about the errors and possible solutions, please read the following articles: [ERROR] [Help 1] http://cwiki.apache.org/confluence/display/MAVEN/MojoFailureException 百度上说的jre我都试过了,我用的是jdk而且是1.8. Failed to execute goal org.apache.maven.plugins:maven-compiler-plugin:3.1:compile (default-compile) on project demo-test: Compilation failure说找不到3.1 但是我配置这个jar包换个版本却还是报错找不到3.1这个版本。
新建maven工程报错,该怎么解决?
具体情况是这样的,公司jdk为1.6 ,eclipse为kepler版本 ,为了和他们俩不冲突,我下载了maven3.2.5,然后各种配置。。。。。 新建maven项目pom第一行报错:org/apache/maven/plugins/war/WarMojo : Unsupported major.minor version 51.0 然后下面的plugin标签:Multiple annotations found at this line: - CoreException: Could not get the value for parameter compilerId for plugin execution default- testCompile: TypeNotPresentException: Type org.apache.maven.plugin.compiler.TestCompilerMojo not present: UnsupportedClassVersionError: org/apache/maven/plugin/compiler/TestCompilerMojo : Unsupported major.minor version 51.0 - Plugin execution not covered by lifecycle configuration: org.apache.maven.plugins:maven- compiler-plugin:3.7.0:testCompile (execution: default-testCompile, phase: test-compile) - CoreException: Could not get the value for parameter compilerId for plugin execution default- compile: TypeNotPresentException: Type org.apache.maven.plugin.compiler.CompilerMojo not present: UnsupportedClassVersionError: org/apache/maven/plugin/compiler/CompilerMojo : Unsupported major.minor version 51.0 - Plugin execution not covered by lifecycle configuration: org.apache.maven.plugins:maven- compiler-plugin:3.7.0:compile (execution: default-compile, phase: compile) 我真的不知道该怎么解决,网上都说jdk版本和maven冲突,我按照maven官网给出的jdk'版本对应要求下载的3.2.5 为什么就不行了呢,官网是假的?
maven插件启动tomc这个错的原因是什么?
[INFO] Scanning for projects... [WARNING] [WARNING] Some problems were encountered while building the effective model for com.taotao:mytaotao-search-service:war:0.0.1-SNAPSHOT [WARNING] 'dependencies.dependency.(groupId:artifactId:type:classifier)' must be unique: org.apache.zookeeper:zookeeper:jar -> duplicate declaration of version (?) @ com.taotao:mytaotao-search-service:[unknown-version], D:\develop\DevWorkSpace\myworkspace\mytaotao-search\mytaotao-search-service\pom.xml, line 76, column 15 [WARNING] 'dependencies.dependency.(groupId:artifactId:type:classifier)' must be unique: com.github.sgroschupf:zkclient:jar -> duplicate declaration of version (?) @ com.taotao:mytaotao-search-service:[unknown-version], D:\develop\DevWorkSpace\myworkspace\mytaotao-search\mytaotao-search-service\pom.xml, line 80, column 15 [WARNING] [WARNING] It is highly recommended to fix these problems because they threaten the stability of your build. [WARNING] [WARNING] For this reason, future Maven versions might no longer support building such malformed projects. [WARNING] [INFO] ------------------------------------------------------------------------ [INFO] Reactor Build Order: [INFO] [INFO] mytaotao-search [INFO] mytaotao-search-interface [INFO] mytaotao-search-service [INFO] [INFO] ------------------------------------------------------------------------ [INFO] Building mytaotao-search 0.0.1-SNAPSHOT [INFO] ------------------------------------------------------------------------ [INFO] [INFO] --- maven-clean-plugin:2.5:clean (default-clean) @ mytaotao-search --- [INFO] [INFO] >>> tomcat7-maven-plugin:2.2:run (default-cli) > process-classes @ mytaotao-search >>> [INFO] [INFO] <<< tomcat7-maven-plugin:2.2:run (default-cli) < process-classes @ mytaotao-search <<< [INFO] [INFO] --- tomcat7-maven-plugin:2.2:run (default-cli) @ mytaotao-search --- [INFO] Skipping non-war project [INFO] [INFO] ------------------------------------------------------------------------ [INFO] Building mytaotao-search-interface 0.0.1-SNAPSHOT [INFO] ------------------------------------------------------------------------ [INFO] [INFO] --- maven-clean-plugin:2.5:clean (default-clean) @ mytaotao-search-interface --- [INFO] Deleting D:\develop\DevWorkSpace\myworkspace\mytaotao-search\mytaotao-search-interface\target [INFO] [INFO] >>> tomcat7-maven-plugin:2.2:run (default-cli) > process-classes @ mytaotao-search-interface >>> [INFO] [INFO] --- maven-resources-plugin:2.7:resources (default-resources) @ mytaotao-search-interface --- [INFO] Using 'UTF-8' encoding to copy filtered resources. [INFO] Copying 0 resource [INFO] [INFO] --- maven-compiler-plugin:3.2:compile (default-compile) @ mytaotao-search-interface --- [INFO] Changes detected - recompiling the module! [INFO] Compiling 3 source files to D:\develop\DevWorkSpace\myworkspace\mytaotao-search\mytaotao-search-interface\target\classes [INFO] [INFO] <<< tomcat7-maven-plugin:2.2:run (default-cli) < process-classes @ mytaotao-search-interface <<< [INFO] [INFO] --- tomcat7-maven-plugin:2.2:run (default-cli) @ mytaotao-search-interface --- [INFO] Skipping non-war project [INFO] [INFO] ------------------------------------------------------------------------ [INFO] Building mytaotao-search-service 0.0.1-SNAPSHOT [INFO] ------------------------------------------------------------------------ [INFO] [INFO] --- maven-clean-plugin:2.5:clean (default-clean) @ mytaotao-search-service --- [INFO] Deleting D:\develop\DevWorkSpace\myworkspace\mytaotao-search\mytaotao-search-service\target [INFO] ------------------------------------------------------------------------ [INFO] Reactor Summary: [INFO] [INFO] mytaotao-search .................................... SUCCESS [ 1.731 s] [INFO] mytaotao-search-interface .......................... SUCCESS [ 1.385 s] [INFO] mytaotao-search-service ............................ FAILURE [ 1.457 s] [INFO] ------------------------------------------------------------------------ [INFO] BUILD FAILURE [INFO] ------------------------------------------------------------------------ [INFO] Total time: 5.198 s [INFO] Finished at: 2017-06-22T21:15:09+08:00 [INFO] Final Memory: 17M/170M [INFO] ------------------------------------------------------------------------ [ERROR] Failed to execute goal org.apache.maven.plugins:maven-clean-plugin:2.5:clean (default-clean) on project mytaotao-search-service: Failed to clean project: Failed to delete D:\develop\DevWorkSpace\myworkspace\mytaotao-search\mytaotao-search-service\target\tomcat\conf\logging.properties -> [Help 1] [ERROR] [ERROR] To see the full stack trace of the errors, re-run Maven with the -e switch. [ERROR] Re-run Maven using the -X switch to enable full debug logging. [ERROR] [ERROR] For more information about the errors and possible solutions, please read the following articles: [ERROR] [Help 1] http://cwiki.apache.org/confluence/display/MAVEN/MojoExecutionException [ERROR] [ERROR] After correcting the problems, you can resume the build with the command [ERROR] mvn <goals> -rf :mytaotao-search-service
这是什么错??????????
CoreException: Could not get the value for parameter compilerId for plugin execution default-compile: PluginResolutionException: Plugin org.apache.maven.plugins:maven-compiler-plugin:2.5.1 or one of its dependencies could not be resolved: Failed to collect dependencies for org.apache.maven.plugins:maven-compiler-plugin:jar:2.5.1 (): ArtifactDescriptorException: Failed to read artifact descriptor for org.codehaus.plexus:plexus-compiler-api:jar:1.9.1: UnresolvableModelException: Failure to transfer org.codehaus.plexus:plexus-components:pom:1.1.20 from http://repo1.maven.org/maven2 was cached in the local repository, resolution will not be reattempted until the update interval of central has elapsed or updates are forced. Original error: Could not transfer artifact org.codehaus.plexus:plexus-components:pom:1.1.20 from/to central (http://repo1.maven.org/maven2): The operation was cancelled.
配置maven中出现的问题
在为一个历史遗留工程配置完svn+maven+hudson后,hudson控制台报错 org.apache.maven.lifecycle.LifecycleExecutionException: Failed to execute goal org.apache.maven.plugins:maven-compiler-plugin:2.0.2:compile (default-compile) on project qoe2: Compilation failure 然后pom.xml的配置是 ![图片说明](https://img-ask.csdn.net/upload/201505/19/1432002708_372768.png)
Java学习的正确打开方式
在博主认为,对于入门级学习java的最佳学习方法莫过于视频+博客+书籍+总结,前三者博主将淋漓尽致地挥毫于这篇博客文章中,至于总结在于个人,实际上越到后面你会发现学习的最好方式就是阅读参考官方文档其次就是国内的书籍,博客次之,这又是一个层次了,这里暂时不提后面再谈。博主将为各位入门java保驾护航,各位只管冲鸭!!!上天是公平的,只要不辜负时间,时间自然不会辜负你。 何谓学习?博主所理解的学习,它
大学四年自学走来,这些私藏的实用工具/学习网站我贡献出来了
大学四年,看课本是不可能一直看课本的了,对于学习,特别是自学,善于搜索网上的一些资源来辅助,还是非常有必要的,下面我就把这几年私藏的各种资源,网站贡献出来给你们。主要有:电子书搜索、实用工具、在线视频学习网站、非视频学习网站、软件下载、面试/求职必备网站。 注意:文中提到的所有资源,文末我都给你整理好了,你们只管拿去,如果觉得不错,转发、分享就是最大的支持了。 一、PDF搜索网站推荐 对于大部
linux系列之常用运维命令整理笔录
本博客记录工作中需要的linux运维命令,大学时候开始接触linux,会一些基本操作,可是都没有整理起来,加上是做开发,不做运维,有些命令忘记了,所以现在整理成博客,当然vi,文件操作等就不介绍了,慢慢积累一些其它拓展的命令,博客不定时更新 顺便拉下票,我在参加csdn博客之星竞选,欢迎投票支持,每个QQ或者微信每天都可以投5票,扫二维码即可,http://m234140.nofollow.ax.
Vue + Spring Boot 项目实战(十四):用户认证方案与完善的访问拦截
本篇文章主要讲解 token、session 等用户认证方案的区别并分析常见误区,以及如何通过前后端的配合实现完善的访问拦截,为下一步权限控制的实现打下基础。
比特币原理详解
一、什么是比特币 比特币是一种电子货币,是一种基于密码学的货币,在2008年11月1日由中本聪发表比特币白皮书,文中提出了一种去中心化的电子记账系统,我们平时的电子现金是银行来记账,因为银行的背后是国家信用。去中心化电子记账系统是参与者共同记账。比特币可以防止主权危机、信用风险。其好处不多做赘述,这一层面介绍的文章很多,本文主要从更深层的技术原理角度进行介绍。 二、问题引入  假设现有4个人
程序员接私活怎样防止做完了不给钱?
首先跟大家说明一点,我们做 IT 类的外包开发,是非标品开发,所以很有可能在开发过程中会有这样那样的需求修改,而这种需求修改很容易造成扯皮,进而影响到费用支付,甚至出现做完了项目收不到钱的情况。 那么,怎么保证自己的薪酬安全呢? 我们在开工前,一定要做好一些证据方面的准备(也就是“讨薪”的理论依据),这其中最重要的就是需求文档和验收标准。一定要让需求方提供这两个文档资料作为开发的基础。之后开发
网页实现一个简单的音乐播放器(大佬别看。(⊙﹏⊙))
今天闲着无事,就想写点东西。然后听了下歌,就打算写个播放器。 于是乎用h5 audio的加上js简单的播放器完工了。 欢迎 改进 留言。 演示地点跳到演示地点 html代码如下`&lt;!DOCTYPE html&gt; &lt;html&gt; &lt;head&gt; &lt;title&gt;music&lt;/title&gt; &lt;meta charset="utf-8"&gt
Python十大装B语法
Python 是一种代表简单思想的语言,其语法相对简单,很容易上手。不过,如果就此小视 Python 语法的精妙和深邃,那就大错特错了。本文精心筛选了最能展现 Python 语法之精妙的十个知识点,并附上详细的实例代码。如能在实战中融会贯通、灵活使用,必将使代码更为精炼、高效,同时也会极大提升代码B格,使之看上去更老练,读起来更优雅。 1. for - else 什么?不是 if 和 else 才
数据库优化 - SQL优化
前面一篇文章从实例的角度进行数据库优化,通过配置一些参数让数据库性能达到最优。但是一些“不好”的SQL也会导致数据库查询变慢,影响业务流程。本文从SQL角度进行数据库优化,提升SQL运行效率。 判断问题SQL 判断SQL是否有问题时可以通过两个表象进行判断: 系统级别表象 CPU消耗严重 IO等待严重 页面响应时间过长
2019年11月中国大陆编程语言排行榜
2019年11月2日,我统计了某招聘网站,获得有效程序员招聘数据9万条。针对招聘信息,提取编程语言关键字,并统计如下: 编程语言比例 rank pl_ percentage 1 java 33.62% 2 c/c++ 16.42% 3 c_sharp 12.82% 4 javascript 12.31% 5 python 7.93% 6 go 7.25% 7
通俗易懂地给女朋友讲:线程池的内部原理
餐厅的约会 餐盘在灯光的照耀下格外晶莹洁白,女朋友拿起红酒杯轻轻地抿了一小口,对我说:“经常听你说线程池,到底线程池到底是个什么原理?”我楞了一下,心里想女朋友今天是怎么了,怎么突然问出这么专业的问题,但做为一个专业人士在女朋友面前也不能露怯啊,想了一下便说:“我先给你讲讲我前同事老王的故事吧!” 大龄程序员老王 老王是一个已经北漂十多年的程序员,岁数大了,加班加不动了,升迁也无望,于是拿着手里
经典算法(5)杨辉三角
写在前面: 我是 扬帆向海,这个昵称来源于我的名字以及女朋友的名字。我热爱技术、热爱开源、热爱编程。技术是开源的、知识是共享的。 这博客是对自己学习的一点点总结及记录,如果您对 Java、算法 感兴趣,可以关注我的动态,我们一起学习。 用知识改变命运,让我们的家人过上更好的生活。 目录一、杨辉三角的介绍二、杨辉三角的算法思想三、代码实现1.第一种写法2.第二种写法 一、杨辉三角的介绍 百度
腾讯算法面试题:64匹马8个跑道需要多少轮才能选出最快的四匹?
昨天,有网友私信我,说去阿里面试,彻底的被打击到了。问了为什么网上大量使用ThreadLocal的源码都会加上private static?他被难住了,因为他从来都没有考虑过这个问题。无独有偶,今天笔者又发现有网友吐槽了一道腾讯的面试题,我们一起来看看。 腾讯算法面试题:64匹马8个跑道需要多少轮才能选出最快的四匹? 在互联网职场论坛,一名程序员发帖求助到。二面腾讯,其中一个算法题:64匹
面试官:你连RESTful都不知道我怎么敢要你?
面试官:了解RESTful吗? 我:听说过。 面试官:那什么是RESTful? 我:就是用起来很规范,挺好的 面试官:是RESTful挺好的,还是自我感觉挺好的 我:都挺好的。 面试官:… 把门关上。 我:… 要干嘛?先关上再说。 面试官:我说出去把门关上。 我:what ?,夺门而去 文章目录01 前言02 RESTful的来源03 RESTful6大原则1. C-S架构2. 无状态3.统一的接
SQL-小白最佳入门sql查询一
一 说明 如果是初学者,建议去网上寻找安装Mysql的文章安装,以及使用navicat连接数据库,以后的示例基本是使用mysql数据库管理系统; 二 准备前提 需要建立一张学生表,列分别是id,名称,年龄,学生信息;本示例中文章篇幅原因SQL注释略; 建表语句: CREATE TABLE `student` ( `id` int(11) NOT NULL AUTO_INCREMENT, `
项目中的if else太多了,该怎么重构?
介绍 最近跟着公司的大佬开发了一款IM系统,类似QQ和微信哈,就是聊天软件。我们有一部分业务逻辑是这样的 if (msgType = "文本") { // dosomething } else if(msgType = "图片") { // doshomething } else if(msgType = "视频") { // doshomething } else { // dosho
漫话:什么是平衡(AVL)树?这应该是把AVL树讲的最好的文章了
这篇文章通过对话的形式,由浅入深带你读懂 AVL 树,看完让你保证理解 AVL 树的各种操作,如果觉得不错,别吝啬你的赞哦。 1、若它的左子树不为空,则左子树上所有的节点值都小于它的根节点值。 2、若它的右子树不为空,则右子树上所有的节点值均大于它的根节点值。 3、它的左右子树也分别可以充当为二叉查找树。 例如: 例如,我现在想要查找数值为14的节点。由于二叉查找树的特性,我们可...
“狗屁不通文章生成器”登顶GitHub热榜,分分钟写出万字形式主义大作
一、垃圾文字生成器介绍 最近在浏览GitHub的时候,发现了这样一个骨骼清奇的雷人项目,而且热度还特别高。 项目中文名:狗屁不通文章生成器 项目英文名:BullshitGenerator 根据作者的介绍,他是偶尔需要一些中文文字用于GUI开发时测试文本渲染,因此开发了这个废话生成器。但由于生成的废话实在是太过富于哲理,所以最近已经被小伙伴们给玩坏了。 他的文风可能是这样的: 你发现,
程序员:我终于知道post和get的区别
IT界知名的程序员曾说:对于那些月薪三万以下,自称IT工程师的码农们,其实我们从来没有把他们归为我们IT工程师的队伍。他们虽然总是以IT工程师自居,但只是他们一厢情愿罢了。 此话一出,不知激起了多少(码农)程序员的愤怒,却又无可奈何,于是码农问程序员。 码农:你知道get和post请求到底有什么区别? 程序员:你看这篇就知道了。 码农:你月薪三万了? 程序员:嗯。 码农:你是怎么做到的? 程序员:
《程序人生》系列-这个程序员只用了20行代码就拿了冠军
你知道的越多,你不知道的越多 点赞再看,养成习惯GitHub上已经开源https://github.com/JavaFamily,有一线大厂面试点脑图,欢迎Star和完善 前言 这一期不算《吊打面试官》系列的,所有没前言我直接开始。 絮叨 本来应该是没有这期的,看过我上期的小伙伴应该是知道的嘛,双十一比较忙嘛,要值班又要去帮忙拍摄年会的视频素材,还得搞个程序员一天的Vlog,还要写BU
开源并不是你认为的那些事
点击上方蓝字 关注我们开源之道导读所以 ————想要理清开源是什么?先要厘清开源不是什么,名正言顺是句中国的古代成语,概念本身的理解非常之重要。大部分生物多样性的起源,...
加快推动区块链技术和产业创新发展,2019可信区块链峰会在京召开
      11月8日,由中国信息通信研究院、中国通信标准化协会、中国互联网协会、可信区块链推进计划联合主办,科技行者协办的2019可信区块链峰会将在北京悠唐皇冠假日酒店开幕。   区块链技术被认为是继蒸汽机、电力、互联网之后,下一代颠覆性的核心技术。如果说蒸汽机释放了人类的生产力,电力解决了人类基本的生活需求,互联网彻底改变了信息传递的方式,区块链作为构造信任的技术有重要的价值。   1
程序员把地府后台管理系统做出来了,还有3.0版本!12月7号最新消息:已在开发中有github地址
第一幕:缘起 听说阎王爷要做个生死簿后台管理系统,我们派去了一个程序员…… 996程序员做的梦: 第一场:团队招募 为了应对地府管理危机,阎王打算找“人”开发一套地府后台管理系统,于是就在地府总经办群中发了项目需求。 话说还是中国电信的信号好,地府都是满格,哈哈!!! 经常会有外行朋友问:看某网站做的不错,功能也简单,你帮忙做一下? 而这次,面对这样的需求,这个程序员
网易云6亿用户音乐推荐算法
网易云音乐是音乐爱好者的集聚地,云音乐推荐系统致力于通过 AI 算法的落地,实现用户千人千面的个性化推荐,为用户带来不一样的听歌体验。 本次分享重点介绍 AI 算法在音乐推荐中的应用实践,以及在算法落地过程中遇到的挑战和解决方案。 将从如下两个部分展开: AI 算法在音乐推荐中的应用 音乐场景下的 AI 思考 从 2013 年 4 月正式上线至今,网易云音乐平台持续提供着:乐屏社区、UGC
【技巧总结】位运算装逼指南
位算法的效率有多快我就不说,不信你可以去用 10 亿个数据模拟一下,今天给大家讲一讲位运算的一些经典例子。不过,最重要的不是看懂了这些例子就好,而是要在以后多去运用位运算这些技巧,当然,采用位运算,也是可以装逼的,不信,你往下看。我会从最简单的讲起,一道比一道难度递增,不过居然是讲技巧,那么也不会太难,相信你分分钟看懂。 判断奇偶数 判断一个数是基于还是偶数,相信很多人都做过,一般的做法的代码如下
《C++ Primer》学习笔记(六):C++模块设计——函数
专栏C++学习笔记 《C++ Primer》学习笔记/习题答案 总目录 https://blog.csdn.net/TeFuirnever/article/details/100700212 —————————————————————————————————————————————————————— 《C++ Primer》习题参考答案:第6章 - C++模块设计——函数 文章目录专栏C+...
8年经验面试官详解 Java 面试秘诀
    作者 | 胡书敏 责编 | 刘静 出品 | CSDN(ID:CSDNnews) 本人目前在一家知名外企担任架构师,而且最近八年来,在多家外企和互联网公司担任Java技术面试官,前后累计面试了有两三百位候选人。在本文里,就将结合本人的面试经验,针对Java初学者、Java初级开发和Java开发,给出若干准备简历和准备面试的建议。   Java程序员准备和投递简历的实
面试官如何考察你的思维方式?
1.两种思维方式在求职面试中,经常会考察这种问题:北京有多少量特斯拉汽车? 某胡同口的煎饼摊一年能卖出多少个煎饼? 深圳有多少个产品经理? 一辆公交车里能装下多少个乒乓球? 一
so easy! 10行代码写个"狗屁不通"文章生成器
前几天,GitHub 有个开源项目特别火,只要输入标题就可以生成一篇长长的文章。背后实现代码一定很复杂吧,里面一定有很多高深莫测的机器学习等复杂算法不过,当我看了源代码之后这程序不到50
知乎高赞:中国有什么拿得出手的开源软件产品?(整理自本人原创回答)
知乎高赞:中国有什么拿得出手的开源软件产品? 在知乎上,有个问题问“中国有什么拿得出手的开源软件产品(在 GitHub 等社区受欢迎度较好的)?” 事实上,还不少呢~ 本人于2019.7.6进行了较为全面的 回答 - Bravo Yeung,获得该问题下回答中得最高赞(236赞和1枚专业勋章),对这些受欢迎的 Github 开源项目分类整理如下: 分布式计算、云平台相关工具类 1.SkyWalk
相关热词 c# 图片上传 c# gdi 占用内存 c#中遍历字典 c#控制台模拟dos c# 斜率 最小二乘法 c#进程延迟 c# mysql完整项目 c# grid 总行数 c# web浏览器插件 c# xml 生成xsd
立即提问