m0_37683338
jlink.x
2018-10-05 05:29
采纳率: 0%
浏览 574

在Ubuntu14.04安装skyeye,make的时候出现这个错误怎么解决,各位大佬帮帮忙:

在Ubuntu14.04安装skyeye,make的时候出现这个错误怎么解决,各位大佬帮帮忙:

compilation terminated.
make[2]: *** [translate_singlestep.lo] Error 1
make[2]: Leaving directory /home/jlink/arm/skyeye-1.3.5_rc1/common'
make[1]: *** [all-recursive] Error 1
make[1]: Leaving directory
/home/jlink/arm/skyeye-1.3.5_rc1'
make: *** [all] Error 2

而且安装后的skyeye后,打开opt/skyeye文件下只有 include info lib ,缺少了bin testsuite,这该怎么解决呀,
我是从skyeye官网上下载的skyeye-1.3.5_rc1.tar.bz2来的

  • 点赞
  • 写回答
  • 关注问题
  • 收藏
  • 邀请回答

1条回答 默认 最新

  • caozhy

    /home/jlink/arm/skyeye-1.3.5_rc1/common'
    arm?你在pc上装,应该找x86 x64 i686 amd64之类的,而不是arm

    点赞 评论

相关推荐