更改build.gradle导致出现此问题,苦求大佬路过瞄一眼

当我在模拟器运行apk的时后,提示apk 只是支持 armeabi 看到网上的说法更改这里的配置
改完之后 apk可以正常安装了 但是一安装加载了启屏页之后就崩溃了

图片说明

请问有大佬知道么!

2个回答

我猜测这可能是你最近添加的一个包不对导致的,比如这个jar打包不正确就会出现这种问题,建议删掉最近添加的包然后重试一次,定位到是哪个包导致的以后重新打包。

qq_41914317
大菠萝贼8 没错 就是这样 感谢大佬
6 个月之前 回复
Csdn user default icon
上传中...
上传图片
插入图片
抄袭、复制答案,以达到刷声望分或其他目的的行为,在CSDN问答是严格禁止的,一经发现立刻封号。是时候展现真正的技术了!
其他相关推荐
build.gradle怎么得到其他文件夹下的文件
build.gradle怎么得到其他文件夹下的文件,我要遍历那个文件夹得到文件的名字
在Eclipse中如何建立build.gradle文件?
还有如何建立build.gradle文件,然后再cmd中编译。 希望给出图文教程 ![图片说明](https://img-ask.csdn.net/upload/201704/05/1491398758_797996.png) 项目点击反键后,应该新建一个什么样的文件? 如何编写程序,输出helloworld
Gradle构建的JavsWeb应用,如何在代码中获取build.gradle的version
如题。需求要求在登录页面显示web项目的版本号。 百度了很久没找到类似的问题,所以就来提问了~ build.gradle里面 ``` group = 'Tomcat_Server' version = '0.6.0-Debug' sourceCompatibility = 1.8 ``` 想要在java代码(Controller层)中获取到“0.6.0-Debug”这个东西
Android studio加载项目出现Could not find com.android.tools.build:gradle:4.10.1
Android studio加载项目出现Could not find com.android.tools.build:gradle:4.10.1 ![图片说明](https://img-ask.csdn.net/upload/201911/05/1572944856_31543.jpg) 实在是不知道怎么解决了,这个问题已经困扰我好久了,哪位大神可以帮忙解决一下,万分感谢。 repositories中的代码库是jcenter{ url'http://jcenter.bintray.com'},已经把项目build.gradle,将其中的classpath 'com.android.tools.build:gradle:4.10.1'改为classpath 'com.android.tools.build:gradle:2.3.2'了,但是还是报错 ![图片说明](https://img-ask.csdn.net/upload/201911/06/1573034916_778380.png) 用浏览器打开代码库地址,可以找到2.3.2版本信息,但是地址会自动变为https ![图片说明](https://img-ask.csdn.net/upload/201911/06/1573035170_400923.png) 将代码库的地址改为https以后,又会报别的错 ![图片说明](https://img-ask.csdn.net/upload/201911/06/1573035255_577090.png)
ionic3打包出错,求大佬帮忙!!
今天打包的时候cordova build android就出现下面这个错误,以前都没有问题的,请问是哪的问题?该如何解决了,求具体如何操作。。。 C:\Users\Administrator\.gradle\caches\transforms-1\files-1.1\appcompat-v7-26.1.0.aar\ac54a0ace3996090bdb7ad492e3b5bcd\res\values\values.xml:246:5-69: AAPT: error: resource android:attr/fontVariationSettings not found. C:\Users\Administrator\.gradle\caches\transforms-1\files-1.1\appcompat-v7-26.1.0.aar\ac54a0ace3996090bdb7ad492e3b5bcd\res\values\values.xml:246:5-69: AAPT: error: resource android:attr/ttcIndex not found. D:\Code\YSDA\ysda\platforms\android\app\build\intermediates\incremental\mergeDebugResources\merged.dir\values\values.xml:248: error: resource android:attr/fontVariationSettings not found. D:\Code\YSDA\ysda\platforms\android\app\build\intermediates\incremental\mergeDebugResources\merged.dir\values\values.xml:248: error: resource android:attr/ttcIndex not found. error: failed linking references. =============== 全部的: PS D:\code\ysda\ysda> cordova build android cordova-android-support-gradle-release: Android platform: V7+ cordova-android-support-gradle-release: Wrote custom version '26.+' to D:\code\ysda\ysda\platforms\android\app\build.gra dle cordova-android-support-gradle-release: Wrote custom version '26.+' to D:\code\ysda\ysda\platforms\android\cordova-andro id-support-gradle-release\zxh-cordova-android-support-gradle-release.gradle Android Studio project detected cordova-android-support-gradle-release: Android platform: V7+ cordova-android-support-gradle-release: Wrote custom version '26.+' to D:\code\ysda\ysda\platforms\android\app\build.gra dle cordova-android-support-gradle-release: Wrote custom version '26.+' to D:\code\ysda\ysda\platforms\android\cordova-andro id-support-gradle-release\zxh-cordova-android-support-gradle-release.gradle ANDROID_HOME=C:\Users\Administrator\AppData\Local\Android\sdk JAVA_HOME=E:\Java\jdk1.8.0_91 studio Starting a Gradle Daemon (subsequent builds will be faster) BUILD SUCCESSFUL in 5s 1 actionable task: 1 executed Subproject Path: CordovaLib Subproject Path: app publishNonDefault is deprecated and has no effect anymore. All variants are now published. +----------------------------------------------------------------- | cordova-android-support-gradle-release: 26.+ +----------------------------------------------------------------- Configuration 'compile' in project ':app' is deprecated. Use 'implementation' instead. The Task.leftShift(Closure) method has been deprecated and is scheduled to be removed in Gradle 5.0. Please use Task.doL ast(Action) instead. at build_dxxuwns2wpt3q41rnhqfnnu3n.run(D:\Code\YSDA\ysda\platforms\android\app\build.gradle:152) :CordovaLib:preBuild UP-TO-DATE :CordovaLib:preDebugBuild UP-TO-DATE :CordovaLib:compileDebugAidl :CordovaLib:compileDebugRenderscript :CordovaLib:checkDebugManifest :CordovaLib:generateDebugBuildConfig :CordovaLib:prepareLintJar :CordovaLib:generateDebugResValues :CordovaLib:generateDebugResources :CordovaLib:packageDebugResources :CordovaLib:platformAttrExtractor :CordovaLib:processDebugManifest :CordovaLib:javaPreCompileDebug :CordovaLib:processDebugJavaRes NO-SOURCE :app:preBuild UP-TO-DATE :app:preDebugBuild :app:compileDebugAidl :CordovaLib:packageDebugRenderscript NO-SOURCE :app:compileDebugRenderscript :app:checkDebugManifest :app:generateDebugBuildConfig :app:prepareLintJar :app:generateDebugResValues :app:generateDebugResources :app:mergeDebugResources :app:createDebugCompatibleScreenManifests :app:processDebugManifest :app:splitsDiscoveryTaskDebug :app:compileDebugNdk NO-SOURCE :CordovaLib:mergeDebugShaders :CordovaLib:compileDebugShaders :CordovaLib:generateDebugAssets :CordovaLib:mergeDebugAssets :app:mergeDebugShaders :app:compileDebugShaders :app:generateDebugAssets :app:mergeDebugAssets :CordovaLib:compileDebugNdk NO-SOURCE :CordovaLib:mergeDebugJniLibFolders :CordovaLib:transformNativeLibsWithMergeJniLibsForDebug :CordovaLib:transformNativeLibsWithIntermediateJniLibsForDebug :app:mergeDebugJniLibFolders :app:processDebugJavaRes NO-SOURCE :app:validateSigningDebug :CordovaLib:processDebugResources :CordovaLib:generateDebugSources :CordovaLib:compileDebugJavaWithJavacע: ijЩ�����ļ�ʹ�û�����ѹ�ʱ�� API�� ע: �й���ϸ��Ϣ, ��ʹ�� -Xlint:deprecation ���±��롣 :CordovaLib:transformClassesAndResourcesWithPrepareIntermediateJarsForDebug :app:processDebugResourcesC:\Users\Administrator\.gradle\caches\transforms-1\files-1.1\appcompat-v7-26.1.0.aar\ac54a0ace 3996090bdb7ad492e3b5bcd\res\values\values.xml:246:5-69: AAPT: error: resource android:attr/fontVariationSettings not fou nd. C:\Users\Administrator\.gradle\caches\transforms-1\files-1.1\appcompat-v7-26.1.0.aar\ac54a0ace3996090bdb7ad492e3b5bcd\re s\values\values.xml:246:5-69: AAPT: error: resource android:attr/ttcIndex not found. D:\Code\YSDA\ysda\platforms\android\app\build\intermediates\incremental\mergeDebugResources\merged.dir\values\values.xml :248: error: resource android:attr/fontVariationSettings not found. D:\Code\YSDA\ysda\platforms\android\app\build\intermediates\incremental\mergeDebugResources\merged.dir\values\values.xml :248: error: resource android:attr/ttcIndex not found. error: failed linking references. Failed to execute aapt com.android.ide.common.process.ProcessException: Failed to execute aapt at com.android.builder.core.AndroidBuilder.processResources(AndroidBuilder.java:796) at com.android.build.gradle.tasks.ProcessAndroidResources.invokeAaptForSplit(ProcessAndroidResources.java:551) at com.android.build.gradle.tasks.ProcessAndroidResources.doFullTaskAction(ProcessAndroidResources.java:285) at com.android.build.gradle.internal.tasks.IncrementalTask.taskAction(IncrementalTask.java:109) at sun.reflect.GeneratedMethodAccessor182.invoke(Unknown Source) at sun.reflect.DelegatingMethodAccessorImpl.invoke(DelegatingMethodAccessorImpl.java:43) at java.lang.reflect.Method.invoke(Method.java:498) at org.gradle.internal.reflect.JavaMethod.invoke(JavaMethod.java:73) at org.gradle.api.internal.project.taskfactory.DefaultTaskClassInfoStore$IncrementalTaskAction.doExecute(Default TaskClassInfoStore.java:173) at org.gradle.api.internal.project.taskfactory.DefaultTaskClassInfoStore$StandardTaskAction.execute(DefaultTaskC lassInfoStore.java:134) at org.gradle.api.internal.project.taskfactory.DefaultTaskClassInfoStore$StandardTaskAction.execute(DefaultTaskC lassInfoStore.java:121) at org.gradle.api.internal.tasks.execution.ExecuteActionsTaskExecuter$1.run(ExecuteActionsTaskExecuter.java:122) at org.gradle.internal.progress.DefaultBuildOperationExecutor$RunnableBuildOperationWorker.execute(DefaultBuildO perationExecutor.java:336) at org.gradle.internal.progress.DefaultBuildOperationExecutor$RunnableBuildOperationWorker.execute(DefaultBuildO perationExecutor.java:328) at org.gradle.internal.progress.DefaultBuildOperationExecutor.execute(DefaultBuildOperationExecutor.java:197) at org.gradle.internal.progress.DefaultBuildOperationExecutor.run(DefaultBuildOperationExecutor.java:107) at org.gradle.api.internal.tasks.execution.ExecuteActionsTaskExecuter.executeAction(ExecuteActionsTaskExecuter.j ava:111) at org.gradle.api.internal.tasks.execution.ExecuteActionsTaskExecuter.executeActions(ExecuteActionsTaskExecuter. java:92) at org.gradle.api.internal.tasks.execution.ExecuteActionsTaskExecuter.execute(ExecuteActionsTaskExecuter.java:70 ) at org.gradle.api.internal.tasks.execution.SkipUpToDateTaskExecuter.execute(SkipUpToDateTaskExecuter.java:63) at org.gradle.api.internal.tasks.execution.ResolveTaskOutputCachingStateExecuter.execute(ResolveTaskOutputCachin gStateExecuter.java:54) at org.gradle.api.internal.tasks.execution.ValidatingTaskExecuter.execute(ValidatingTaskExecuter.java:58) at org.gradle.api.internal.tasks.execution.SkipEmptySourceFilesTaskExecuter.execute(SkipEmptySourceFilesTaskExec uter.java:88) at org.gradle.api.internal.tasks.execution.ResolveTaskArtifactStateTaskExecuter.execute(ResolveTaskArtifactState TaskExecuter.java:52) at org.gradle.api.internal.tasks.execution.SkipTaskWithNoActionsExecuter.execute(SkipTaskWithNoActionsExecuter.j ava:52) at org.gradle.api.internal.tasks.execution.SkipOnlyIfTaskExecuter.execute(SkipOnlyIfTaskExecuter.java:54) at org.gradle.api.internal.tasks.execution.ExecuteAtMostOnceTaskExecuter.execute(ExecuteAtMostOnceTaskExecuter.j ava:43) at org.gradle.api.internal.tasks.execution.CatchExceptionTaskExecuter.execute(CatchExceptionTaskExecuter.java:34 ) at org.gradle.execution.taskgraph.DefaultTaskGraphExecuter$EventFiringTaskWorker$1.run(DefaultTaskGraphExecuter. java:248) at org.gradle.internal.progress.DefaultBuildOperationExecutor$RunnableBuildOperationWorker.execute(DefaultBuildO perationExecutor.java:336) at org.gradle.internal.progress.DefaultBuildOperationExecutor$RunnableBuildOperationWorker.execute(DefaultBuildO perationExecutor.java:328) at org.gradle.internal.progress.DefaultBuildOperationExecutor.execute(DefaultBuildOperationExecutor.java:197) at org.gradle.internal.progress.DefaultBuildOperationExecutor.run(DefaultBuildOperationExecutor.java:107) at org.gradle.execution.taskgraph.DefaultTaskGraphExecuter$EventFiringTaskWorker.execute(DefaultTaskGraphExecute r.java:241) at org.gradle.execution.taskgraph.DefaultTaskGraphExecuter$EventFiringTaskWorker.execute(DefaultTaskGraphExecute r.java:230) at org.gradle.execution.taskgraph.DefaultTaskPlanExecutor$TaskExecutorWorker.processTask(DefaultTaskPlanExecutor .java:124) at org.gradle.execution.taskgraph.DefaultTaskPlanExecutor$TaskExecutorWorker.access$200(DefaultTaskPlanExecutor. java:80) at org.gradle.execution.taskgraph.DefaultTaskPlanExecutor$TaskExecutorWorker$1.execute(DefaultTaskPlanExecutor.j ava:105) at org.gradle.execution.taskgraph.DefaultTaskPlanExecutor$TaskExecutorWorker$1.execute(DefaultTaskPlanExecutor.j ava:99) at org.gradle.execution.taskgraph.DefaultTaskExecutionPlan.execute(DefaultTaskExecutionPlan.java:625) at org.gradle.execution.taskgraph.DefaultTaskExecutionPlan.executeWithTask(DefaultTaskExecutionPlan.java:580) at org.gradle.execution.taskgraph.DefaultTaskPlanExecutor$TaskExecutorWorker.run(DefaultTaskPlanExecutor.java:99 ) at org.gradle.execution.taskgraph.DefaultTaskPlanExecutor.process(DefaultTaskPlanExecutor.java:60) at org.gradle.execution.taskgraph.DefaultTaskGraphExecuter.execute(DefaultTaskGraphExecuter.java:128) at org.gradle.execution.SelectedTaskExecutionAction.execute(SelectedTaskExecutionAction.java:37) at org.gradle.execution.DefaultBuildExecuter.execute(DefaultBuildExecuter.java:37) at org.gradle.execution.DefaultBuildExecuter.access$000(DefaultBuildExecuter.java:23) at org.gradle.execution.DefaultBuildExecuter$1.proceed(DefaultBuildExecuter.java:43) at org.gradle.execution.DryRunBuildExecutionAction.execute(DryRunBuildExecutionAction.java:46) at org.gradle.execution.DefaultBuildExecuter.execute(DefaultBuildExecuter.java:37) at org.gradle.execution.DefaultBuildExecuter.execute(DefaultBuildExecuter.java:30) at org.gradle.initialization.DefaultGradleLauncher$ExecuteTasks.run(DefaultGradleLauncher.java:311) at org.gradle.internal.progress.DefaultBuildOperationExecutor$RunnableBuildOperationWorker.execute(DefaultBuildO perationExecutor.java:336) at org.gradle.internal.progress.DefaultBuildOperationExecutor$RunnableBuildOperationWorker.execute(DefaultBuildO perationExecutor.java:328) at org.gradle.internal.progress.DefaultBuildOperationExecutor.execute(DefaultBuildOperationExecutor.java:197) at org.gradle.internal.progress.DefaultBuildOperationExecutor.run(DefaultBuildOperationExecutor.java:107) at org.gradle.initialization.DefaultGradleLauncher.runTasks(DefaultGradleLauncher.java:202) at org.gradle.initialization.DefaultGradleLauncher.doBuildStages(DefaultGradleLauncher.java:132) at org.gradle.initialization.DefaultGradleLauncher.executeTasks(DefaultGradleLauncher.java:107) at org.gradle.internal.invocation.GradleBuildController$1.call(GradleBuildController.java:78) at org.gradle.internal.invocation.GradleBuildController$1.call(GradleBuildController.java:75) at org.gradle.internal.work.DefaultWorkerLeaseService.withLocks(DefaultWorkerLeaseService.java:152) at org.gradle.internal.invocation.GradleBuildController.doBuild(GradleBuildController.java:100) at org.gradle.internal.invocation.GradleBuildController.run(GradleBuildController.java:75) at org.gradle.tooling.internal.provider.ExecuteBuildActionRunner.run(ExecuteBuildActionRunner.java:28) at org.gradle.launcher.exec.ChainingBuildActionRunner.run(ChainingBuildActionRunner.java:35) at org.gradle.tooling.internal.provider.ValidatingBuildActionRunner.run(ValidatingBuildActionRunner.java:32) at org.gradle.launcher.exec.RunAsBuildOperationBuildActionRunner$1.run(RunAsBuildOperationBuildActionRunner.java :43) at org.gradle.internal.progress.DefaultBuildOperationExecutor$RunnableBuildOperationWorker.execute(DefaultBuildO perationExecutor.java:336) at org.gradle.internal.progress.DefaultBuildOperationExecutor$RunnableBuildOperationWorker.execute(DefaultBuildO perationExecutor.java:328) at org.gradle.internal.progress.DefaultBuildOperationExecutor.execute(DefaultBuildOperationExecutor.java:197) at org.gradle.internal.progress.DefaultBuildOperationExecutor.run(DefaultBuildOperationExecutor.java:107) at org.gradle.launcher.exec.RunAsBuildOperationBuildActionRunner.run(RunAsBuildOperationBuildActionRunner.java:4 0) at org.gradle.tooling.internal.provider.SubscribableBuildActionRunner.run(SubscribableBuildActionRunner.java:51) at org.gradle.launcher.exec.InProcessBuildActionExecuter.execute(InProcessBuildActionExecuter.java:45) at org.gradle.launcher.exec.InProcessBuildActionExecuter.execute(InProcessBuildActionExecuter.java:29) at org.gradle.launcher.exec.BuildTreeScopeBuildActionExecuter.execute(BuildTreeScopeBuildActionExecuter.java:39) at org.gradle.launcher.exec.BuildTreeScopeBuildActionExecuter.execute(BuildTreeScopeBuildActionExecuter.java:25) at org.gradle.tooling.internal.provider.ContinuousBuildActionExecuter.execute(ContinuousBuildActionExecuter.java :71) at org.gradle.tooling.internal.provider.ContinuousBuildActionExecuter.execute(ContinuousBuildActionExecuter.java :45) at org.gradle.tooling.internal.provider.ServicesSetupBuildActionExecuter.execute(ServicesSetupBuildActionExecute r.java:51) at org.gradle.tooling.internal.provider.ServicesSetupBuildActionExecuter.execute(ServicesSetupBuildActionExecute r.java:32) at org.gradle.tooling.internal.provider.GradleThreadBuildActionExecuter.execute(GradleThreadBuildActionExecuter. java:36) at org.gradle.tooling.internal.provider.GradleThreadBuildActionExecuter.execute(GradleThreadBuildActionExecuter. java:25) at org.gradle.tooling.internal.provider.ParallelismConfigurationBuildActionExecuter.execute(ParallelismConfigura tionBuildActionExecuter.java:43) at org.gradle.tooling.internal.provider.ParallelismConfigurationBuildActionExecuter.execute(ParallelismConfigura tionBuildActionExecuter.java:29) at org.gradle.tooling.internal.provider.StartParamsValidatingActionExecuter.execute(StartParamsValidatingActionE xecuter.java:64) at org.gradle.tooling.internal.provider.StartParamsValidatingActionExecuter.execute(StartParamsValidatingActionE xecuter.java:29) at org.gradle.tooling.internal.provider.SessionFailureReportingActionExecuter.execute(SessionFailureReportingAct ionExecuter.java:55) at org.gradle.tooling.internal.provider.SessionFailureReportingActionExecuter.execute(SessionFailureReportingAct ionExecuter.java:42) at org.gradle.tooling.internal.provider.SetupLoggingActionExecuter.execute(SetupLoggingActionExecuter.java:58) at org.gradle.tooling.internal.provider.SetupLoggingActionExecuter.execute(SetupLoggingActionExecuter.java:33) at org.gradle.launcher.daemon.server.exec.ExecuteBuild.doBuild(ExecuteBuild.java:67) at org.gradle.launcher.daemon.server.exec.BuildCommandOnly.execute(BuildCommandOnly.java:36) at org.gradle.launcher.daemon.server.api.DaemonCommandExecution.proceed(DaemonCommandExecution.java:120) at org.gradle.launcher.daemon.server.exec.WatchForDisconnection.execute(WatchForDisconnection.java:37) at org.gradle.launcher.daemon.server.api.DaemonCommandExecution.proceed(DaemonCommandExecution.java:120) at org.gradle.launcher.daemon.server.exec.ResetDeprecationLogger.execute(ResetDeprecationLogger.java:26) at org.gradle.launcher.daemon.server.api.DaemonCommandExecution.proceed(DaemonCommandExecution.java:120) at org.gradle.launcher.daemon.server.exec.RequestStopIfSingleUsedDaemon.execute(RequestStopIfSingleUsedDaemon.ja va:34) at org.gradle.launcher.daemon.server.api.DaemonCommandExecution.proceed(DaemonCommandExecution.java:120) at org.gradle.launcher.daemon.server.exec.ForwardClientInput$2.call(ForwardClientInput.java:74) at org.gradle.launcher.daemon.server.exec.ForwardClientInput$2.call(ForwardClientInput.java:72) at org.gradle.util.Swapper.swap(Swapper.java:38) at org.gradle.launcher.daemon.server.exec.ForwardClientInput.execute(ForwardClientInput.java:72) at org.gradle.launcher.daemon.server.api.DaemonCommandExecution.proceed(DaemonCommandExecution.java:120) at org.gradle.launcher.daemon.server.exec.LogAndCheckHealth.execute(LogAndCheckHealth.java:55) at org.gradle.launcher.daemon.server.api.DaemonCommandExecution.proceed(DaemonCommandExecution.java:120) at org.gradle.launcher.daemon.server.exec.LogToClient.doBuild(LogToClient.java:62) at org.gradle.launcher.daemon.server.exec.BuildCommandOnly.execute(BuildCommandOnly.java:36) at org.gradle.launcher.daemon.server.api.DaemonCommandExecution.proceed(DaemonCommandExecution.java:120) at org.gradle.launcher.daemon.server.exec.EstablishBuildEnvironment.doBuild(EstablishBuildEnvironment.java:82) at org.gradle.launcher.daemon.server.exec.BuildCommandOnly.execute(BuildCommandOnly.java:36) at org.gradle.launcher.daemon.server.api.DaemonCommandExecution.proceed(DaemonCommandExecution.java:120) at org.gradle.launcher.daemon.server.exec.StartBuildOrRespondWithBusy$1.run(StartBuildOrRespondWithBusy.java:50) at org.gradle.launcher.daemon.server.DaemonStateCoordinator$1.run(DaemonStateCoordinator.java:297) at org.gradle.internal.concurrent.ExecutorPolicy$CatchAndRecordFailures.onExecute(ExecutorPolicy.java:63) at org.gradle.internal.concurrent.ManagedExecutorImpl$1.run(ManagedExecutorImpl.java:46) at java.util.concurrent.ThreadPoolExecutor.runWorker(ThreadPoolExecutor.java:1142) at java.util.concurrent.ThreadPoolExecutor$Worker.run(ThreadPoolExecutor.java:617) at org.gradle.internal.concurrent.ThreadFactoryImpl$ManagedThreadRunnable.run(ThreadFactoryImpl.java:55) at java.lang.Thread.run(Thread.java:745) Caused by: java.util.concurrent.ExecutionException: java.util.concurrent.ExecutionException: com.android.tools.aapt2.Aap t2Exception: AAPT2 error: check logs for details at com.google.common.util.concurrent.AbstractFuture.getDoneValue(AbstractFuture.java:503) at com.google.common.util.concurrent.AbstractFuture.get(AbstractFuture.java:482) at com.google.common.util.concurrent.AbstractFuture$TrustedFuture.get(AbstractFuture.java:79) at com.android.builder.core.AndroidBuilder.processResources(AndroidBuilder.java:794) ... 121 more Caused by: java.util.concurrent.ExecutionException: com.android.tools.aapt2.Aapt2Exception: AAPT2 error: check logs for details at com.google.common.util.concurrent.AbstractFuture.getDoneValue(AbstractFuture.java:503) at com.google.common.util.concurrent.AbstractFuture.get(AbstractFuture.java:462) at com.google.common.util.concurrent.AbstractFuture$TrustedFuture.get(AbstractFuture.java:79) at com.android.builder.internal.aapt.v2.QueueableAapt2.lambda$makeValidatedPackage$1(QueueableAapt2.java:179) at java.util.concurrent.ThreadPoolExecutor.runWorker(ThreadPoolExecutor.java:1142) at java.util.concurrent.ThreadPoolExecutor$Worker.run(ThreadPoolExecutor.java:617) ... 1 more Caused by: com.android.tools.aapt2.Aapt2Exception: AAPT2 error: check logs for details at com.android.builder.png.AaptProcess$NotifierProcessOutput.handleOutput(AaptProcess.java:463) at com.android.builder.png.AaptProcess$NotifierProcessOutput.err(AaptProcess.java:415) at com.android.builder.png.AaptProcess$ProcessOutputFacade.err(AaptProcess.java:332) at com.android.utils.GrabProcessOutput$1.run(GrabProcessOutput.java:104) FAILED 36 actionable tasks: 36 executed FAILURE: Build failed with an exception. * What went wrong: Execution failed for task ':app:processDebugResources'. > Failed to execute aapt * Try: Run with --stacktrace option to get the stack trace. Run with --info or --debug option to get more log output. * Get more help at https://help.gradle.org BUILD FAILED in 31s cmd: Command failed with exit code 1 Error output: ע: ijЩ�����ļ�ʹ�û�����ѹ�ʱ�� API�� ע: �й���ϸ��Ϣ, ��ʹ�� -Xlint:deprecation ���±��롣 C:\Users\Administrator\.gradle\caches\transforms-1\files-1.1\appcompat-v7-26.1.0.aar\ac54a0ace3996090bdb7ad492e3b5bcd\re s\values\values.xml:246:5-69: AAPT: error: resource android:attr/fontVariationSettings not found. C:\Users\Administrator\.gradle\caches\transforms-1\files-1.1\appcompat-v7-26.1.0.aar\ac54a0ace3996090bdb7ad492e3b5bcd\re s\values\values.xml:246:5-69: AAPT: error: resource android:attr/ttcIndex not found. D:\Code\YSDA\ysda\platforms\android\app\build\intermediates\incremental\mergeDebugResources\merged.dir\values\values.xml :248: error: resource android:attr/fontVariationSettings not found. D:\Code\YSDA\ysda\platforms\android\app\build\intermediates\incremental\mergeDebugResources\merged.dir\values\values.xml :248: error: resource android:attr/ttcIndex not found. error: failed linking references. Failed to execute aapt com.android.ide.common.process.ProcessException: Failed to execute aapt at com.android.builder.core.AndroidBuilder.processResources(AndroidBuilder.java:796) at com.android.build.gradle.tasks.ProcessAndroidResources.invokeAaptForSplit(ProcessAndroidResources.java:551) at com.android.build.gradle.tasks.ProcessAndroidResources.doFullTaskAction(ProcessAndroidResources.java:285) at com.android.build.gradle.internal.tasks.IncrementalTask.taskAction(IncrementalTask.java:109) at sun.reflect.GeneratedMethodAccessor182.invoke(Unknown Source) at sun.reflect.DelegatingMethodAccessorImpl.invoke(DelegatingMethodAccessorImpl.java:43) at java.lang.reflect.Method.invoke(Method.java:498) at org.gradle.internal.reflect.JavaMethod.invoke(JavaMethod.java:73) at org.gradle.api.internal.project.taskfactory.DefaultTaskClassInfoStore$IncrementalTaskAction.doExecute(Default TaskClassInfoStore.java:173) at org.gradle.api.internal.project.taskfactory.DefaultTaskClassInfoStore$StandardTaskAction.execute(DefaultTaskC lassInfoStore.java:134) at org.gradle.api.internal.project.taskfactory.DefaultTaskClassInfoStore$StandardTaskAction.execute(DefaultTaskC lassInfoStore.java:121) at org.gradle.api.internal.tasks.execution.ExecuteActionsTaskExecuter$1.run(ExecuteActionsTaskExecuter.java:122) at org.gradle.internal.progress.DefaultBuildOperationExecutor$RunnableBuildOperationWorker.execute(DefaultBuildO perationExecutor.java:336) at org.gradle.internal.progress.DefaultBuildOperationExecutor$RunnableBuildOperationWorker.execute(DefaultBuildO perationExecutor.java:328) at org.gradle.internal.progress.DefaultBuildOperationExecutor.execute(DefaultBuildOperationExecutor.java:197) at org.gradle.internal.progress.DefaultBuildOperationExecutor.run(DefaultBuildOperationExecutor.java:107) at org.gradle.api.internal.tasks.execution.ExecuteActionsTaskExecuter.executeAction(ExecuteActionsTaskExecuter.j ava:111) at org.gradle.api.internal.tasks.execution.ExecuteActionsTaskExecuter.executeActions(ExecuteActionsTaskExecuter. java:92) at org.gradle.api.internal.tasks.execution.ExecuteActionsTaskExecuter.execute(ExecuteActionsTaskExecuter.java:70 ) at org.gradle.api.internal.tasks.execution.SkipUpToDateTaskExecuter.execute(SkipUpToDateTaskExecuter.java:63) at org.gradle.api.internal.tasks.execution.ResolveTaskOutputCachingStateExecuter.execute(ResolveTaskOutputCachin gStateExecuter.java:54) at org.gradle.api.internal.tasks.execution.ValidatingTaskExecuter.execute(ValidatingTaskExecuter.java:58) at org.gradle.api.internal.tasks.execution.SkipEmptySourceFilesTaskExecuter.execute(SkipEmptySourceFilesTaskExec uter.java:88) at org.gradle.api.internal.tasks.execution.ResolveTaskArtifactStateTaskExecuter.execute(ResolveTaskArtifactState TaskExecuter.java:52) at org.gradle.api.internal.tasks.execution.SkipTaskWithNoActionsExecuter.execute(SkipTaskWithNoActionsExecuter.j ava:52) at org.gradle.api.internal.tasks.execution.SkipOnlyIfTaskExecuter.execute(SkipOnlyIfTaskExecuter.java:54) at org.gradle.api.internal.tasks.execution.ExecuteAtMostOnceTaskExecuter.execute(ExecuteAtMostOnceTaskExecuter.j ava:43) at org.gradle.api.internal.tasks.execution.CatchExceptionTaskExecuter.execute(CatchExceptionTaskExecuter.java:34 ) at org.gradle.execution.taskgraph.DefaultTaskGraphExecuter$EventFiringTaskWorker$1.run(DefaultTaskGraphExecuter. java:248) at org.gradle.internal.progress.DefaultBuildOperationExecutor$RunnableBuildOperationWorker.execute(DefaultBuildO perationExecutor.java:336) at org.gradle.internal.progress.DefaultBuildOperationExecutor$RunnableBuildOperationWorker.execute(DefaultBuildO perationExecutor.java:328) at org.gradle.internal.progress.DefaultBuildOperationExecutor.execute(DefaultBuildOperationExecutor.java:197) at org.gradle.internal.progress.DefaultBuildOperationExecutor.run(DefaultBuildOperationExecutor.java:107) at org.gradle.execution.taskgraph.DefaultTaskGraphExecuter$EventFiringTaskWorker.execute(DefaultTaskGraphExecute r.java:241) at org.gradle.execution.taskgraph.DefaultTaskGraphExecuter$EventFiringTaskWorker.execute(DefaultTaskGraphExecute r.java:230) at org.gradle.execution.taskgraph.DefaultTaskPlanExecutor$TaskExecutorWorker.processTask(DefaultTaskPlanExecutor .java:124) at org.gradle.execution.taskgraph.DefaultTaskPlanExecutor$TaskExecutorWorker.access$200(DefaultTaskPlanExecutor. java:80) at org.gradle.execution.taskgraph.DefaultTaskPlanExecutor$TaskExecutorWorker$1.execute(DefaultTaskPlanExecutor.j ava:105) at org.gradle.execution.taskgraph.DefaultTaskPlanExecutor$TaskExecutorWorker$1.execute(DefaultTaskPlanExecutor.j ava:99) at org.gradle.execution.taskgraph.DefaultTaskExecutionPlan.execute(DefaultTaskExecutionPlan.java:625) at org.gradle.execution.taskgraph.DefaultTaskExecutionPlan.executeWithTask(DefaultTaskExecutionPlan.java:580) at org.gradle.execution.taskgraph.DefaultTaskPlanExecutor$TaskExecutorWorker.run(DefaultTaskPlanExecutor.java:99 ) at org.gradle.execution.taskgraph.DefaultTaskPlanExecutor.process(DefaultTaskPlanExecutor.java:60) at org.gradle.execution.taskgraph.DefaultTaskGraphExecuter.execute(DefaultTaskGraphExecuter.java:128) at org.gradle.execution.SelectedTaskExecutionAction.execute(SelectedTaskExecutionAction.java:37) at org.gradle.execution.DefaultBuildExecuter.execute(DefaultBuildExecuter.java:37) at org.gradle.execution.DefaultBuildExecuter.access$000(DefaultBuildExecuter.java:23) at org.gradle.execution.DefaultBuildExecuter$1.proceed(DefaultBuildExecuter.java:43) at org.gradle.execution.DryRunBuildExecutionAction.execute(DryRunBuildExecutionAction.java:46) at org.gradle.execution.DefaultBuildExecuter.execute(DefaultBuildExecuter.java:37) at org.gradle.execution.DefaultBuildExecuter.execute(DefaultBuildExecuter.java:30) at org.gradle.initialization.DefaultGradleLauncher$ExecuteTasks.run(DefaultGradleLauncher.java:311) at org.gradle.internal.progress.DefaultBuildOperationExecutor$RunnableBuildOperationWorker.execute(DefaultBuildO perationExecutor.java:336) at org.gradle.internal.progress.DefaultBuildOperationExecutor$RunnableBuildOperationWorker.execute(DefaultBuildO perationExecutor.java:328) at org.gradle.internal.progress.DefaultBuildOperationExecutor.execute(DefaultBuildOperationExecutor.java:197) at org.gradle.internal.progress.DefaultBuildOperationExecutor.run(DefaultBuildOperationExecutor.java:107) at org.gradle.initialization.DefaultGradleLauncher.runTasks(DefaultGradleLauncher.java:202) at org.gradle.initialization.DefaultGradleLauncher.doBuildStages(DefaultGradleLauncher.java:132) at org.gradle.initialization.DefaultGradleLauncher.executeTasks(DefaultGradleLauncher.java:107) at org.gradle.internal.invocation.GradleBuildController$1.call(GradleBuildController.java:78) at org.gradle.internal.invocation.GradleBuildController$1.call(GradleBuildController.java:75) at org.gradle.internal.work.DefaultWorkerLeaseService.withLocks(DefaultWorkerLeaseService.java:152) at org.gradle.internal.invocation.GradleBuildController.doBuild(GradleBuildController.java:100) at org.gradle.internal.invocation.GradleBuildController.run(GradleBuildController.java:75) at org.gradle.tooling.internal.provider.ExecuteBuildActionRunner.run(ExecuteBuildActionRunner.java:28) at org.gradle.launcher.exec.ChainingBuildActionRunner.run(ChainingBuildActionRunner.java:35) at org.gradle.tooling.internal.provider.ValidatingBuildActionRunner.run(ValidatingBuildActionRunner.java:32) at org.gradle.launcher.exec.RunAsBuildOperationBuildActionRunner$1.run(RunAsBuildOperationBuildActionRunner.java :43) at org.gradle.internal.progress.DefaultBuildOperationExecutor$RunnableBuildOperationWorker.execute(DefaultBuildO perationExecutor.java:336) at org.gradle.internal.progress.DefaultBuildOperationExecutor$RunnableBuildOperationWorker.execute(DefaultBuildO perationExecutor.java:328) at org.gradle.internal.progress.DefaultBuildOperationExecutor.execute(DefaultBuildOperationExecutor.java:197) at org.gradle.internal.progress.DefaultBuildOperationExecutor.run(DefaultBuildOperationExecutor.java:107) at org.gradle.launcher.exec.RunAsBuildOperationBuildActionRunner.run(RunAsBuildOperationBuildActionRunner.java:4 0) at org.gradle.tooling.internal.provider.SubscribableBuildActionRunner.run(SubscribableBuildActionRunner.java:51) at org.gradle.launcher.exec.InProcessBuildActionExecuter.execute(InProcessBuildActionExecuter.java:45) at org.gradle.launcher.exec.InProcessBuildActionExecuter.execute(InProcessBuildActionExecuter.java:29) at org.gradle.launcher.exec.BuildTreeScopeBuildActionExecuter.execute(BuildTreeScopeBuildActionExecuter.java:39) at org.gradle.launcher.exec.BuildTreeScopeBuildActionExecuter.execute(BuildTreeScopeBuildActionExecuter.java:25) at org.gradle.tooling.internal.provider.ContinuousBuildActionExecuter.execute(ContinuousBuildActionExecuter.java :71) at org.gradle.tooling.internal.provider.ContinuousBuildActionExecuter.execute(ContinuousBuildActionExecuter.java :45) at org.gradle.tooling.internal.provider.ServicesSetupBuildActionExecuter.execute(ServicesSetupBuildActionExecute r.java:51) at org.gradle.tooling.internal.provider.ServicesSetupBuildActionExecuter.execute(ServicesSetupBuildActionExecute r.java:32) at org.gradle.tooling.internal.provider.GradleThreadBuildActionExecuter.execute(GradleThreadBuildActionExecuter. java:36) at org.gradle.tooling.internal.provider.GradleThreadBuildActionExecuter.execute(GradleThreadBuildActionExecuter. java:25) at org.gradle.tooling.internal.provider.ParallelismConfigurationBuildActionExecuter.execute(ParallelismConfigura tionBuildActionExecuter.java:43) at org.gradle.tooling.internal.provider.ParallelismConfigurationBuildActionExecuter.execute(ParallelismConfigura tionBuildActionExecuter.java:29) at org.gradle.tooling.internal.provider.StartParamsValidatingActionExecuter.execute(StartParamsValidatingActionE xecuter.java:64) at org.gradle.tooling.internal.provider.StartParamsValidatingActionExecuter.execute(StartParamsValidatingActionE xecuter.java:29) at org.gradle.tooling.internal.provider.SessionFailureReportingActionExecuter.execute(SessionFailureReportingAct ionExecuter.java:55) at org.gradle.tooling.internal.provider.SessionFailureReportingActionExecuter.execute(SessionFailureReportingAct ionExecuter.java:42) at org.gradle.tooling.internal.provider.SetupLoggingActionExecuter.execute(SetupLoggingActionExecuter.java:58) at org.gradle.tooling.internal.provider.SetupLoggingActionExecuter.execute(SetupLoggingActionExecuter.java:33) at org.gradle.launcher.daemon.server.exec.ExecuteBuild.doBuild(ExecuteBuild.java:67) at org.gradle.launcher.daemon.server.exec.BuildCommandOnly.execute(BuildCommandOnly.java:36) at org.gradle.launcher.daemon.server.api.DaemonCommandExecution.proceed(DaemonCommandExecution.java:120) at org.gradle.launcher.daemon.server.exec.WatchForDisconnection.execute(WatchForDisconnection.java:37) at org.gradle.launcher.daemon.server.api.DaemonCommandExecution.proceed(DaemonCommandExecution.java:120) at org.gradle.launcher.daemon.server.exec.ResetDeprecationLogger.execute(ResetDeprecationLogger.java:26) at org.gradle.launcher.daemon.server.api.DaemonCommandExecution.proceed(DaemonCommandExecution.java:120) at org.gradle.launcher.daemon.server.exec.RequestStopIfSingleUsedDaemon.execute(RequestStopIfSingleUsedDaemon.ja va:34) at org.gradle.launcher.daemon.server.api.DaemonCommandExecution.proceed(DaemonCommandExecution.java:120) at org.gradle.launcher.daemon.server.exec.ForwardClientInput$2.call(ForwardClientInput.java:74) at org.gradle.launcher.daemon.server.exec.ForwardClientInput$2.call(ForwardClientInput.java:72) at org.gradle.util.Swapper.swap(Swapper.java:38) at org.gradle.launcher.daemon.server.exec.ForwardClientInput.execute(ForwardClientInput.java:72) at org.gradle.launcher.daemon.server.api.DaemonCommandExecution.proceed(DaemonCommandExecution.java:120) at org.gradle.launcher.daemon.server.exec.LogAndCheckHealth.execute(LogAndCheckHealth.java:55) at org.gradle.launcher.daemon.server.api.DaemonCommandExecution.proceed(DaemonCommandExecution.java:120) at org.gradle.launcher.daemon.server.exec.LogToClient.doBuild(LogToClient.java:62) at org.gradle.launcher.daemon.server.exec.BuildCommandOnly.execute(BuildCommandOnly.java:36) at org.gradle.launcher.daemon.server.api.DaemonCommandExecution.proceed(DaemonCommandExecution.java:120) at org.gradle.launcher.daemon.server.exec.EstablishBuildEnvironment.doBuild(EstablishBuildEnvironment.java:82) at org.gradle.launcher.daemon.server.exec.BuildCommandOnly.execute(BuildCommandOnly.java:36) at org.gradle.launcher.daemon.server.api.DaemonCommandExecution.proceed(DaemonCommandExecution.java:120) at org.gradle.launcher.daemon.server.exec.StartBuildOrRespondWithBusy$1.run(StartBuildOrRespondWithBusy.java:50) at org.gradle.launcher.daemon.server.DaemonStateCoordinator$1.run(DaemonStateCoordinator.java:297) at org.gradle.internal.concurrent.ExecutorPolicy$CatchAndRecordFailures.onExecute(ExecutorPolicy.java:63) at org.gradle.internal.concurrent.ManagedExecutorImpl$1.run(ManagedExecutorImpl.java:46) at java.util.concurrent.ThreadPoolExecutor.runWorker(ThreadPoolExecutor.java:1142) at java.util.concurrent.ThreadPoolExecutor$Worker.run(ThreadPoolExecutor.java:617) at org.gradle.internal.concurrent.ThreadFactoryImpl$ManagedThreadRunnable.run(ThreadFactoryImpl.java:55) at java.lang.Thread.run(Thread.java:745) Caused by: java.util.concurrent.ExecutionException: java.util.concurrent.ExecutionException: com.android.tools.aapt2.Aap t2Exception: AAPT2 error: check logs for details at com.google.common.util.concurrent.AbstractFuture.getDoneValue(AbstractFuture.java:503) at com.google.common.util.concurrent.AbstractFuture.get(AbstractFuture.java:482) at com.google.common.util.concurrent.AbstractFuture$TrustedFuture.get(AbstractFuture.java:79) at com.android.builder.core.AndroidBuilder.processResources(AndroidBuilder.java:794) ... 121 more Caused by: java.util.concurrent.ExecutionException: com.android.tools.aapt2.Aapt2Exception: AAPT2 error: check logs for details at com.google.common.util.concurrent.AbstractFuture.getDoneValue(AbstractFuture.java:503) at com.google.common.util.concurrent.AbstractFuture.get(AbstractFuture.java:462) at com.google.common.util.concurrent.AbstractFuture$TrustedFuture.get(AbstractFuture.java:79) at com.android.builder.internal.aapt.v2.QueueableAapt2.lambda$makeValidatedPackage$1(QueueableAapt2.java:179) at java.util.concurrent.ThreadPoolExecutor.runWorker(ThreadPoolExecutor.java:1142) at java.util.concurrent.ThreadPoolExecutor$Worker.run(ThreadPoolExecutor.java:617) ... 1 more Caused by: com.android.tools.aapt2.Aapt2Exception: AAPT2 error: check logs for details at com.android.builder.png.AaptProcess$NotifierProcessOutput.handleOutput(AaptProcess.java:463) at com.android.builder.png.AaptProcess$NotifierProcessOutput.err(AaptProcess.java:415) at com.android.builder.png.AaptProcess$ProcessOutputFacade.err(AaptProcess.java:332) at com.android.utils.GrabProcessOutput$1.run(GrabProcessOutput.java:104) FAILURE: Build failed with an exception. * What went wrong: Execution failed for task ':app:processDebugResources'. > Failed to execute aapt
android studio怎么在build.gradle的脚本中使用自带的task
在接入一个开源项目fat-aar时,由于这个项目长时间没有人维护, 使用的android gradle插件版本太低,有一些语法发生变化,同时有的自带任务 也消失了。想要在gradle的groovy脚本内饮用android studio右侧gradle窗口中的 assembleDebug任务 ```Groovy task hello { doLast{ println "hello" } } hello.dependsOn assembleDebug ``` ![图片说明](https://img-ask.csdn.net/upload/201906/30/1561862613_357584.png) 却提示 ```Groovy Could not get unknown property 'validateSigningDebug' for project ':app' of type org.gradle.api.Project ``` 但是assemble任务就可以 ``` task hello { doLast{ println "hello" } } hello.dependsOn assemble ``` ![图片说明](https://img-ask.csdn.net/upload/201906/30/1561862666_889293.png) 另外,我执行```./gradlew tasks --all```是能够看到所有列出来的自带任务的。我怎么才能在脚本中使用这些自带的变量呢? PS: ``` tasks.findByName("assembleDebug") tasks.findByName("app:assembleDebug") tasks.getByPath("apop:validateSigningDebug") tasks.getByName("validateSigningDebug") ``` 这些接口都试过了,得到的都是null,打印tasks中的所有task,也没有assembleDebug和other目录下面的其他task。 求助~~~不胜感激
Android Studio Gradle project sync failed,Configure project:app 前出现红叹号
Android Studio Gradle project sync failed,Configure project:app 前出现红叹号 ![图片说明](https://img-ask.csdn.net/upload/201905/13/1557746272_155433.jpg) 提示为 ``` org.gradle.api.ProjectConfigurationException: A problem occurred configuring project ':app' at java.util.concurrent.ThreadPoolExecutor.runWorker(ThreadPoolExecutor.java:1142) at java.util.concurrent.ThreadPoolExecutor$Worker.run(ThreadPoolExecutor.java:617) at org.gradle.internal.concurrent.ThreadFactoryImpl$ManagedThreadRunnable.run(ThreadFactoryImpl.java:55) at java.lang.Thread.run(Thread.java:745) Caused by: com.android.builder.errors.EvalIssueException: Failed to install the following Android SDK packages as some licences have not been accepted. build-tools;28.0.2 Android SDK Build-Tools 28.0.2 To build this project, accept the SDK license agreements and install the missing components using the Android Studio SDK Manager. Alternatively, to transfer the license agreements from one workstation to another, see http://d.android.com/r/studio-ui/export-licenses.html Using Android SDK: D:\Android\SDK at com.android.build.gradle.internal.SdkHandler.initTarget(SdkHandler.java:194) at com.android.build.gradle.BasePlugin.ensureTargetSetup(BasePlugin.java:980) at com.android.build.gradle.BasePlugin.createAndroidTasks(BasePlugin.java:752) at com.android.build.gradle.BasePlugin.lambda$null$4(BasePlugin.java:690) at com.android.builder.profile.ThreadRecorder.record(ThreadRecorder.java:81) at com.android.build.gradle.BasePlugin.lambda$createTasks$5(BasePlugin.java:686) at org.gradle.internal.event.BroadcastDispatch$ActionInvocationHandler.dispatch(BroadcastDispatch.java:91) at org.gradle.internal.event.BroadcastDispatch$ActionInvocationHandler.dispatch(BroadcastDispatch.java:80) at org.gradle.internal.event.AbstractBroadcastDispatch.dispatch(AbstractBroadcastDispatch.java:42) at org.gradle.internal.event.BroadcastDispatch$SingletonDispatch.dispatch(BroadcastDispatch.java:230) at org.gradle.internal.event.BroadcastDispatch$SingletonDispatch.dispatch(BroadcastDispatch.java:149) at org.gradle.internal.event.AbstractBroadcastDispatch.dispatch(AbstractBroadcastDispatch.java:58) at org.gradle.internal.event.BroadcastDispatch$CompositeDispatch.dispatch(BroadcastDispatch.java:324) at org.gradle.internal.event.BroadcastDispatch$CompositeDispatch.dispatch(BroadcastDispatch.java:234) at org.gradle.internal.event.ListenerBroadcast.dispatch(ListenerBroadcast.java:140) at org.gradle.internal.event.ListenerBroadcast.dispatch(ListenerBroadcast.java:37) at org.gradle.internal.dispatch.ProxyDispatchAdapter$DispatchingInvocationHandler.invoke(ProxyDispatchAdapter.java:93) at com.sun.proxy.$Proxy27.afterEvaluate(Unknown Source) at org.gradle.configuration.project.LifecycleProjectEvaluator.notifyAfterEvaluate(LifecycleProjectEvaluator.java:76) ... 85 more ```
下载的Android项目缺少一个bulid.gradle模块而无法运行
这是我自己新建的项目,bulid.gradle有两个模块,其中一个是Project,另外一个是Module](https://img-ask.csdn.net/upload/201803/17/1521271357_914439.jpg) 这是我下载的项目,build.gradle只有一个模块,是project,但是他的内容却和我自己新建项目的module模块一样,并且AS一直提示Plugin with id"com.android.applicatuion"not found,要怎么样改才能正确运行啊](https://img-ask.csdn.net/upload/201803/17/1521271496_533881.jpg)
Gradle 报错,怎么解决?在网上找了很多方法,都不能解决
代码如下: Error:Internal error: org.gradle.tooling.BuildException: Could not execute build using Gradle installation 'D:\Program Files\gradle-4.8-rc-1'. at org.gradle.tooling.internal.consumer.ExceptionTransformer.transform(ExceptionTransformer.java:51) at org.gradle.tooling.internal.consumer.ExceptionTransformer.transform(ExceptionTransformer.java:29) at org.gradle.tooling.internal.consumer.ResultHandlerAdapter.onFailure(ResultHandlerAdapter.java:41) at org.gradle.tooling.internal.consumer.async.DefaultAsyncConsumerActionExecutor$1$1.run(DefaultAsyncConsumerActionExecutor.java:57) at org.gradle.internal.concurrent.ExecutorPolicy$CatchAndRecordFailures.onExecute(ExecutorPolicy.java:63) at org.gradle.internal.concurrent.StoppableExecutorImpl$1.run(StoppableExecutorImpl.java:46) at java.util.concurrent.ThreadPoolExecutor.runWorker(ThreadPoolExecutor.java:1142) at java.util.concurrent.ThreadPoolExecutor$Worker.run(ThreadPoolExecutor.java:617) at java.lang.Thread.run(Thread.java:745) at org.gradle.tooling.internal.consumer.BlockingResultHandler.getResult(BlockingResultHandler.java:46) at org.gradle.tooling.internal.consumer.DefaultBuildLauncher.run(DefaultBuildLauncher.java:77) at com.android.tools.idea.gradle.project.build.invoker.GradleTasksExecutor$GradleTasksExecutorImpl.lambda$invokeGradleTasks$2(GradleTasksExecutor.java:418) at org.jetbrains.plugins.gradle.service.execution.GradleExecutionHelper.execute(GradleExecutionHelper.java:222) at com.android.tools.idea.gradle.project.build.invoker.GradleTasksExecutor$GradleTasksExecutorImpl.invokeGradleTasks(GradleTasksExecutor.java:458) at com.android.tools.idea.gradle.project.build.invoker.GradleTasksExecutor$GradleTasksExecutorImpl.run(GradleTasksExecutor.java:271) at com.intellij.openapi.progress.impl.CoreProgressManager$TaskRunnable.run(CoreProgressManager.java:718) at com.intellij.openapi.progress.impl.CoreProgressManager.a(CoreProgressManager.java:170) at com.intellij.openapi.progress.impl.CoreProgressManager.a(CoreProgressManager.java:548) at com.intellij.openapi.progress.impl.CoreProgressManager.executeProcessUnderProgress(CoreProgressManager.java:493) at com.intellij.openapi.progress.impl.ProgressManagerImpl.executeProcessUnderProgress(ProgressManagerImpl.java:94) at com.intellij.openapi.progress.impl.CoreProgressManager.runProcess(CoreProgressManager.java:157) at com.intellij.openapi.progress.impl.ProgressManagerImpl$2.run(ProgressManagerImpl.java:165) at com.intellij.openapi.application.impl.ApplicationImpl$1.run(ApplicationImpl.java:330) at java.util.concurrent.Executors$RunnableAdapter.call(Executors.java:511) at java.util.concurrent.FutureTask.run(FutureTask.java:266) at java.util.concurrent.ThreadPoolExecutor.runWorker(ThreadPoolExecutor.java:1142) at java.util.concurrent.ThreadPoolExecutor$Worker.run(ThreadPoolExecutor.java:617) at java.lang.Thread.run(Thread.java:745) Caused by: org.gradle.internal.exceptions.LocationAwareException: Execution failed for task ':app:processDebugManifest'. at org.gradle.initialization.DefaultExceptionAnalyser.transform(DefaultExceptionAnalyser.java:74) at org.gradle.initialization.MultipleBuildFailuresExceptionAnalyser.transform(MultipleBuildFailuresExceptionAnalyser.java:47) at org.gradle.initialization.StackTraceSanitizingExceptionAnalyser.transform(StackTraceSanitizingExceptionAnalyser.java:30) at org.gradle.initialization.DefaultGradleLauncher.doBuildStages(DefaultGradleLauncher.java:143) at org.gradle.initialization.DefaultGradleLauncher.executeTasks(DefaultGradleLauncher.java:115) at org.gradle.internal.invocation.GradleBuildController$1.call(GradleBuildController.java:77) at org.gradle.internal.invocation.GradleBuildController$1.call(GradleBuildController.java:74) at org.gradle.internal.work.DefaultWorkerLeaseService.withLocks(DefaultWorkerLeaseService.java:152) at org.gradle.internal.work.StopShieldingWorkerLeaseService.withLocks(StopShieldingWorkerLeaseService.java:38) at org.gradle.internal.invocation.GradleBuildController.doBuild(GradleBuildController.java:96) at org.gradle.internal.invocation.GradleBuildController.run(GradleBuildController.java:74) at org.gradle.tooling.internal.provider.runner.BuildModelActionRunner.run(BuildModelActionRunner.java:55) at org.gradle.launcher.exec.ChainingBuildActionRunner.run(ChainingBuildActionRunner.java:35) at org.gradle.launcher.exec.ChainingBuildActionRunner.run(ChainingBuildActionRunner.java:35) at org.gradle.tooling.internal.provider.ValidatingBuildActionRunner.run(ValidatingBuildActionRunner.java:32) at org.gradle.launcher.exec.RunAsBuildOperationBuildActionRunner$3.run(RunAsBuildOperationBuildActionRunner.java:47) at org.gradle.internal.operations.DefaultBuildOperationExecutor$RunnableBuildOperationWorker.execute(DefaultBuildOperationExecutor.java:317) at org.gradle.internal.operations.DefaultBuildOperationExecutor$RunnableBuildOperationWorker.execute(DefaultBuildOperationExecutor.java:309) at org.gradle.internal.operations.DefaultBuildOperationExecutor.execute(DefaultBuildOperationExecutor.java:185) at org.gradle.internal.operations.DefaultBuildOperationExecutor.run(DefaultBuildOperationExecutor.java:97) at org.gradle.internal.operations.DelegatingBuildOperationExecutor.run(DelegatingBuildOperationExecutor.java:31) at org.gradle.launcher.exec.RunAsBuildOperationBuildActionRunner.run(RunAsBuildOperationBuildActionRunner.java:43) at org.gradle.tooling.internal.provider.SubscribableBuildActionRunner.run(SubscribableBuildActionRunner.java:51) at org.gradle.launcher.exec.InProcessBuildActionExecuter$1.transform(InProcessBuildActionExecuter.java:45) at org.gradle.launcher.exec.InProcessBuildActionExecuter$1.transform(InProcessBuildActionExecuter.java:41) at org.gradle.composite.internal.DefaultRootBuildState.run(DefaultRootBuildState.java:65) at org.gradle.launcher.exec.InProcessBuildActionExecuter.execute(InProcessBuildActionExecuter.java:41) at org.gradle.launcher.exec.InProcessBuildActionExecuter.execute(InProcessBuildActionExecuter.java:31) at org.gradle.launcher.exec.BuildTreeScopeBuildActionExecuter.execute(BuildTreeScopeBuildActionExecuter.java:39) at org.gradle.launcher.exec.BuildTreeScopeBuildActionExecuter.execute(BuildTreeScopeBuildActionExecuter.java:25) at org.gradle.tooling.internal.provider.ContinuousBuildActionExecuter.execute(ContinuousBuildActionExecuter.java:80) at org.gradle.tooling.internal.provider.ContinuousBuildActionExecuter.execute(ContinuousBuildActionExecuter.java:53) at org.gradle.tooling.internal.provider.ServicesSetupBuildActionExecuter.execute(ServicesSetupBuildActionExecuter.java:62) at org.gradle.tooling.internal.provider.ServicesSetupBuildActionExecuter.execute(ServicesSetupBuildActionExecuter.java:34) at org.gradle.tooling.internal.provider.GradleThreadBuildActionExecuter.execute(GradleThreadBuildActionExecuter.java:36) at org.gradle.tooling.internal.provider.GradleThreadBuildActionExecuter.execute(GradleThreadBuildActionExecuter.java:25) at org.gradle.tooling.internal.provider.ParallelismConfigurationBuildActionExecuter.execute(ParallelismConfigurationBuildActionExecuter.java:43) at org.gradle.tooling.internal.provider.ParallelismConfigurationBuildActionExecuter.execute(ParallelismConfigurationBuildActionExecuter.java:29) at org.gradle.tooling.internal.provider.StartParamsValidatingActionExecuter.execute(StartParamsValidatingActionExecuter.java:59) at org.gradle.tooling.internal.provider.StartParamsValidatingActionExecuter.execute(StartParamsValidatingActionExecuter.java:31) at org.gradle.tooling.internal.provider.SessionFailureReportingActionExecuter.execute(SessionFailureReportingActionExecuter.java:59) at org.gradle.tooling.internal.provider.SessionFailureReportingActionExecuter.execute(SessionFailureReportingActionExecuter.java:44) at org.gradle.tooling.internal.provider.SetupLoggingActionExecuter.execute(SetupLoggingActionExecuter.java:46) at org.gradle.tooling.internal.provider.SetupLoggingActionExecuter.execute(SetupLoggingActionExecuter.java:30) at org.gradle.launcher.daemon.server.exec.ExecuteBuild.doBuild(ExecuteBuild.java:67) at org.gradle.launcher.daemon.server.exec.BuildCommandOnly.execute(BuildCommandOnly.java:36) at org.gradle.launcher.daemon.server.api.DaemonCommandExecution.proceed(DaemonCommandExecution.java:122) at org.gradle.launcher.daemon.server.exec.WatchForDisconnection.execute(WatchForDisconnection.java:37) at org.gradle.launcher.daemon.server.api.DaemonCommandExecution.proceed(DaemonCommandExecution.java:122) at org.gradle.launcher.daemon.server.exec.ResetDeprecationLogger.execute(ResetDeprecationLogger.java:26) at org.gradle.launcher.daemon.server.api.DaemonCommandExecution.proceed(DaemonCommandExecution.java:122) at org.gradle.launcher.daemon.server.exec.RequestStopIfSingleUsedDaemon.execute(RequestStopIfSingleUsedDaemon.java:34) at org.gradle.launcher.daemon.server.api.DaemonCommandExecution.proceed(DaemonCommandExecution.java:122) at org.gradle.launcher.daemon.server.exec.ForwardClientInput$2.call(ForwardClientInput.java:74) at org.gradle.launcher.daemon.server.exec.ForwardClientInput$2.call(ForwardClientInput.java:72) at org.gradle.util.Swapper.swap(Swapper.java:38) at org.gradle.launcher.daemon.server.exec.ForwardClientInput.execute(ForwardClientInput.java:72) at org.gradle.launcher.daemon.server.api.DaemonCommandExecution.proceed(DaemonCommandExecution.java:122) at org.gradle.launcher.daemon.server.exec.LogAndCheckHealth.execute(LogAndCheckHealth.java:55) at org.gradle.launcher.daemon.server.api.DaemonCommandExecution.proceed(DaemonCommandExecution.java:122) at org.gradle.launcher.daemon.server.exec.LogToClient.doBuild(LogToClient.java:62) at org.gradle.launcher.daemon.server.exec.BuildCommandOnly.execute(BuildCommandOnly.java:36) at org.gradle.launcher.daemon.server.api.DaemonCommandExecution.proceed(DaemonCommandExecution.java:122) at org.gradle.launcher.daemon.server.exec.EstablishBuildEnvironment.doBuild(EstablishBuildEnvironment.java:82) at org.gradle.launcher.daemon.server.exec.BuildCommandOnly.execute(BuildCommandOnly.java:36) at org.gradle.launcher.daemon.server.api.DaemonCommandExecution.proceed(DaemonCommandExecution.java:122) at org.gradle.launcher.daemon.server.exec.StartBuildOrRespondWithBusy$1.run(StartBuildOrRespondWithBusy.java:50) at org.gradle.launcher.daemon.server.DaemonStateCoordinator$1.run(DaemonStateCoordinator.java:295) at org.gradle.internal.concurrent.ExecutorPolicy$CatchAndRecordFailures.onExecute(ExecutorPolicy.java:63) at org.gradle.internal.concurrent.ManagedExecutorImpl$1.run(ManagedExecutorImpl.java:46) at org.gradle.internal.concurrent.ThreadFactoryImpl$ManagedThreadRunnable.run(ThreadFactoryImpl.java:55) Caused by: org.gradle.api.tasks.TaskExecutionException: Execution failed for task ':app:processDebugManifest'. at org.gradle.api.internal.tasks.execution.ExecuteActionsTaskExecuter.executeActions(ExecuteActionsTaskExecuter.java:110) at org.gradle.api.internal.tasks.execution.ExecuteActionsTaskExecuter.execute(ExecuteActionsTaskExecuter.java:77) at org.gradle.api.internal.tasks.execution.OutputDirectoryCreatingTaskExecuter.execute(OutputDirectoryCreatingTaskExecuter.java:51) at org.gradle.api.internal.tasks.execution.SkipUpToDateTaskExecuter.execute(SkipUpToDateTaskExecuter.java:59) at org.gradle.api.internal.tasks.execution.ResolveTaskOutputCachingStateExecuter.execute(ResolveTaskOutputCachingStateExecuter.java:54) at org.gradle.api.internal.tasks.execution.ValidatingTaskExecuter.execute(ValidatingTaskExecuter.java:59) at org.gradle.api.internal.tasks.execution.SkipEmptySourceFilesTaskExecuter.execute(SkipEmptySourceFilesTaskExecuter.java:101) at org.gradle.api.internal.tasks.execution.FinalizeInputFilePropertiesTaskExecuter.execute(FinalizeInputFilePropertiesTaskExecuter.java:44) at org.gradle.api.internal.tasks.execution.CleanupStaleOutputsExecuter.execute(CleanupStaleOutputsExecuter.java:91) at org.gradle.api.internal.tasks.execution.ResolveTaskArtifactStateTaskExecuter.execute(ResolveTaskArtifactStateTaskExecuter.java:62) at org.gradle.api.internal.tasks.execution.SkipTaskWithNoActionsExecuter.execute(SkipTaskWithNoActionsExecuter.java:59) at org.gradle.api.internal.tasks.execution.SkipOnlyIfTaskExecuter.execute(SkipOnlyIfTaskExecuter.java:54) at org.gradle.api.internal.tasks.execution.ExecuteAtMostOnceTaskExecuter.execute(ExecuteAtMostOnceTaskExecuter.java:43) at org.gradle.api.internal.tasks.execution.CatchExceptionTaskExecuter.execute(CatchExceptionTaskExecuter.java:34) at org.gradle.api.internal.tasks.execution.EventFiringTaskExecuter$1.run(EventFiringTaskExecuter.java:51) at org.gradle.internal.operations.DefaultBuildOperationExecutor$RunnableBuildOperationWorker.execute(DefaultBuildOperationExecutor.java:317) at org.gradle.internal.operations.DefaultBuildOperationExecutor$RunnableBuildOperationWorker.execute(DefaultBuildOperationExecutor.java:309) at org.gradle.internal.operations.DefaultBuildOperationExecutor.execute(DefaultBuildOperationExecutor.java:185) at org.gradle.internal.operations.DefaultBuildOperationExecutor.run(DefaultBuildOperationExecutor.java:97) at org.gradle.internal.operations.DelegatingBuildOperationExecutor.run(DelegatingBuildOperationExecutor.java:31) at org.gradle.api.internal.tasks.execution.EventFiringTaskExecuter.execute(EventFiringTaskExecuter.java:46) at org.gradle.execution.taskgraph.DefaultTaskExecutionGraph$ExecuteTaskAction.execute(DefaultTaskExecutionGraph.java:262) at org.gradle.execution.taskgraph.DefaultTaskExecutionGraph$ExecuteTaskAction.execute(DefaultTaskExecutionGraph.java:246) at org.gradle.execution.taskgraph.DefaultTaskPlanExecutor$TaskExecutorWorker$1.execute(DefaultTaskPlanExecutor.java:136) at org.gradle.execution.taskgraph.DefaultTaskPlanExecutor$TaskExecutorWorker$1.execute(DefaultTaskPlanExecutor.java:130) at org.gradle.execution.taskgraph.DefaultTaskPlanExecutor$TaskExecutorWorker.execute(DefaultTaskPlanExecutor.java:201) at org.gradle.execution.taskgraph.DefaultTaskPlanExecutor$TaskExecutorWorker.executeWithTask(DefaultTaskPlanExecutor.java:192) at org.gradle.execution.taskgraph.DefaultTaskPlanExecutor$TaskExecutorWorker.run(DefaultTaskPlanExecutor.java:130) ... 3 more Caused by: java.lang.RuntimeException: Manifest merger failed : uses-sdk:minSdkVersion 15 cannot be smaller than version 17 declared in library [com.github.xuexiangjys:XUI:1.0.4] C:\Users\Administrator\.android\build-cache\0e85c716275ee970052537f7d72f491aaf0a4a05\output\AndroidManifest.xml Suggestion: use tools:overrideLibrary="com.xuexiang.xui" to force usage at com.android.builder.core.AndroidBuilder.mergeManifestsForApplication(AndroidBuilder.java:576) at com.android.build.gradle.tasks.MergeManifests.doFullTaskAction(MergeManifests.java:74) at com.android.build.gradle.internal.tasks.IncrementalTask.taskAction(IncrementalTask.java:82) at org.gradle.internal.reflect.JavaMethod.invoke(JavaMethod.java:73) at org.gradle.api.internal.project.taskfactory.IncrementalTaskAction.doExecute(IncrementalTaskAction.java:50) at org.gradle.api.internal.project.taskfactory.StandardTaskAction.execute(StandardTaskAction.java:39) at org.gradle.api.internal.project.taskfactory.StandardTaskAction.execute(StandardTaskAction.java:26) at org.gradle.api.internal.tasks.execution.ExecuteActionsTaskExecuter$1.run(ExecuteActionsTaskExecuter.java:131) at org.gradle.internal.operations.DefaultBuildOperationExecutor$RunnableBuildOperationWorker.execute(DefaultBuildOperationExecutor.java:317) at org.gradle.internal.operations.DefaultBuildOperationExecutor$RunnableBuildOperationWorker.execute(DefaultBuildOperationExecutor.java:309) at org.gradle.internal.operations.DefaultBuildOperationExecutor.execute(DefaultBuildOperationExecutor.java:185) at org.gradle.internal.operations.DefaultBuildOperationExecutor.run(DefaultBuildOperationExecutor.java:97) at org.gradle.internal.operations.DelegatingBuildOperationExecutor.run(DelegatingBuildOperationExecutor.java:31) at org.gradle.api.internal.tasks.execution.ExecuteActionsTaskExecuter.executeAction(ExecuteActionsTaskExecuter.java:120) at org.gradle.api.internal.tasks.execution.ExecuteActionsTaskExecuter.executeActions(ExecuteActionsTaskExecuter.java:99) ... 30 more
安卓开发:org.gradle.tooling.BuildException:
在真机上出现这个异常 org.gradle.tooling.BuildException: Exception while generating InstantRun main resources APK ![在真机上运行出现这个异常](https://img-ask.csdn.net/upload/201804/25/1524669025_349170.png) 我的清单文件 <?xml version="1.0" encoding="utf-8"?> <manifest xmlns:android="http://schemas.android.com/apk/res/android" xmlns:tools="http://schemas.android.com/tools" package="com.example.lenovo.mynotebook"> <provider android:name="android.support.v4.content.FileProvider" android:authorities="com.example.lenovo.mynotebook.fileprovider" android:exported="false" android:grantUriPermissions="true"> <meta-data android:name="android.support.FILE_PROVIDER_PATHS" android:resource="@xml/provider_paths" /> </provider> <uses-permission android:name="android.permission.WRITE_EXTERNAL_STORAGE"/> <uses-permission android:name="android.permission.MOUNT_UNMOUNT_FILESYSTEMS" tools:ignore="ProtectedPermissions" /> <uses-permission android:name="android.permission.CAMERA" /> <application android:allowBackup="true" android:icon="@mipmap/ic_launcher" android:label="@string/app_name" android:roundIcon="@mipmap/ic_launcher_round" android:supportsRtl="true" android:theme="@style/AppTheme"> <activity android:name=".MainActivity" android:windowSoftInputMode="adjustUnspecified|stateHidden" > <intent-filter> <action android:name="android.intent.action.MAIN" /> <category android:name="android.intent.category.LAUNCHER" /> </intent-filter> </activity> <activity android:name=".edit_activity" android:windowSoftInputMode="adjustUnspecified|stateHidden" > </activity> </application> </manifest> ``` 我的build.gradle(Project) // Top-level build file where you can add configuration options common to all sub-projects/modules. buildscript { repositories { google() jcenter() } dependencies { classpath 'com.android.tools.build:gradle:3.1.0' // NOTE: Do not place your application dependencies here; they belong // in the individual module build.gradle files } } allprojects { repositories { google() jcenter() } } task clean(type: Delete) { delete rootProject.buildDir } ``` ``` 我的build.gradle(app) ```apply plugin: 'com.android.application' android { compileSdkVersion 27 defaultConfig { applicationId "com.example.lenovo.mynotebook" minSdkVersion 15 targetSdkVersion 27 versionCode 1 versionName "1.0" testInstrumentationRunner "android.support.test.runner.AndroidJUnitRunner" } buildTypes { release { minifyEnabled false proguardFiles getDefaultProguardFile('proguard-android.txt'), 'proguard-rules.pro' } } } dependencies { implementation fileTree(include: ['*.jar'], dir: 'libs') implementation 'com.android.support.constraint:constraint-layout:1.0.2' testImplementation 'junit:junit:4.12' androidTestImplementation 'com.android.support.test:runner:1.0.1' androidTestImplementation 'com.android.support.test.espresso:espresso-core:3.0.1' implementation 'com.android.support:support-v4:27.1.1' } ``` ``` ``` ```
Adroid Studio无法找到maven_push.gradle文件
Error:(32, 0) Could not read script 'C:\Study\smarthome+\SmartHome+\maven_push.gradle' as it does not exist. Adroid Studio将GitHub上的开源项目导入时无法找到maven_push.gradle文件
android studio编译项目时遇到这个问题。
Caused by: java.lang.NoClassDefFoundError: Could not initialize class com.google.wireless.android.sdk.stats.AndroidStudioStats$GradleBuildProfile at com.android.builder.profile.ProcessRecorder.<init>(ProcessRecorder.java:96) at com.android.builder.profile.ProcessRecorderFactory.get(ProcessRecorderFactory.java:222) at com.android.builder.profile.ProcessRecorderFactory.initialize(ProcessRecorderFactory.java:122) at com.android.build.gradle.internal.profile.ProfilerInitializer.init(ProfilerInitializer.java:66) at com.android.build.gradle.BasePlugin.apply(BasePlugin.java:310) at com.android.build.gradle.LibraryPlugin.apply(LibraryPlugin.java:85) at com.android.build.gradle.LibraryPlugin.apply(LibraryPlugin.java:40) at org.gradle.api.internal.plugins.ImperativeOnlyPluginApplicator.applyImperative(ImperativeOnlyPluginApplicator.java:35) at org.gradle.api.internal.plugins.RuleBasedPluginApplicator.applyImperative(RuleBasedPluginApplicator.java:43) at org.gradle.api.internal.plugins.DefaultPluginManager.doApply(DefaultPluginManager.java:139) at org.gradle.api.internal.plugins.DefaultPluginManager.apply(DefaultPluginManager.java:112) at org.gradle.api.internal.plugins.DefaultObjectConfigurationAction.applyType(DefaultObjectConfigurationAction.java:113) at org.gradle.api.internal.plugins.DefaultObjectConfigurationAction.access$200(DefaultObjectConfigurationAction.java:36) at org.gradle.api.internal.plugins.DefaultObjectConfigurationAction$3.run(DefaultObjectConfigurationAction.java:80) at org.gradle.api.internal.plugins.DefaultObjectConfigurationAction.execute(DefaultObjectConfigurationAction.java:136) at org.gradle.api.internal.project.AbstractPluginAware.apply(AbstractPluginAware.java:44) at org.gradle.api.internal.project.ProjectScript.apply(ProjectScript.java:34) at org.gradle.api.Script$apply$0.callCurrent(Unknown Source) at build_1ztzbib3h4rketyrpodndoubp.run(F:\yjyl_android_studio_work_space\teacher_svn\pIMlibs\build.gradle:1) at org.gradle.groovy.scripts.internal.DefaultScriptRunnerFactory$ScriptRunnerImpl.run(DefaultScriptRunnerFactory.java:90)
AndroidStudio 编程中出现java.lang.RuntimeException错误
在网上找了很长时间没有看到跟我的报错完全一样的情况,不知道是怎么回事。 Caused by: java.lang.RuntimeException只有这一句话 org.gradle.api.tasks.TaskExecutionException: Execution failed for task ':app:transformClassesWithDexBuilderForDebug'. at org.gradle.api.internal.tasks.execution.ExecuteActionsTaskExecuter.executeActions(ExecuteActionsTaskExecuter.java:103) at org.gradle.api.internal.tasks.execution.ExecuteActionsTaskExecuter.execute(ExecuteActionsTaskExecuter.java:73) at org.gradle.api.internal.tasks.execution.OutputDirectoryCreatingTaskExecuter.execute(OutputDirectoryCreatingTaskExecuter.java:51) at org.gradle.api.internal.tasks.execution.SkipUpToDateTaskExecuter.execute(SkipUpToDateTaskExecuter.java:59) at org.gradle.api.internal.tasks.execution.ResolveTaskOutputCachingStateExecuter.execute(ResolveTaskOutputCachingStateExecuter.java:54) at org.gradle.api.internal.tasks.execution.ValidatingTaskExecuter.execute(ValidatingTaskExecuter.java:59) at org.gradle.api.internal.tasks.execution.SkipEmptySourceFilesTaskExecuter.execute(SkipEmptySourceFilesTaskExecuter.java:101) at org.gradle.api.internal.tasks.execution.FinalizeInputFilePropertiesTaskExecuter.execute(FinalizeInputFilePropertiesTaskExecuter.java:44) at org.gradle.api.internal.tasks.execution.CleanupStaleOutputsExecuter.execute(CleanupStaleOutputsExecuter.java:91) at org.gradle.api.internal.tasks.execution.ResolveTaskArtifactStateTaskExecuter.execute(ResolveTaskArtifactStateTaskExecuter.java:62) at org.gradle.api.internal.tasks.execution.SkipTaskWithNoActionsExecuter.execute(SkipTaskWithNoActionsExecuter.java:59) at org.gradle.api.internal.tasks.execution.SkipOnlyIfTaskExecuter.execute(SkipOnlyIfTaskExecuter.java:54) at org.gradle.api.internal.tasks.execution.ExecuteAtMostOnceTaskExecuter.execute(ExecuteAtMostOnceTaskExecuter.java:43) at org.gradle.api.internal.tasks.execution.CatchExceptionTaskExecuter.execute(CatchExceptionTaskExecuter.java:34) at org.gradle.execution.taskgraph.DefaultTaskGraphExecuter$EventFiringTaskWorker$1.run(DefaultTaskGraphExecuter.java:256) at org.gradle.internal.progress.DefaultBuildOperationExecutor$RunnableBuildOperationWorker.execute(DefaultBuildOperationExecutor.java:336) at org.gradle.internal.progress.DefaultBuildOperationExecutor$RunnableBuildOperationWorker.execute(DefaultBuildOperationExecutor.java:328) at org.gradle.internal.progress.DefaultBuildOperationExecutor.execute(DefaultBuildOperationExecutor.java:199) at org.gradle.internal.progress.DefaultBuildOperationExecutor.run(DefaultBuildOperationExecutor.java:110) at org.gradle.execution.taskgraph.DefaultTaskGraphExecuter$EventFiringTaskWorker.execute(DefaultTaskGraphExecuter.java:249) at org.gradle.execution.taskgraph.DefaultTaskGraphExecuter$EventFiringTaskWorker.execute(DefaultTaskGraphExecuter.java:238) at org.gradle.execution.taskgraph.DefaultTaskPlanExecutor$TaskExecutorWorker.processTask(DefaultTaskPlanExecutor.java:123) at org.gradle.execution.taskgraph.DefaultTaskPlanExecutor$TaskExecutorWorker.access$200(DefaultTaskPlanExecutor.java:79) at org.gradle.execution.taskgraph.DefaultTaskPlanExecutor$TaskExecutorWorker$1.execute(DefaultTaskPlanExecutor.java:104) at org.gradle.execution.taskgraph.DefaultTaskPlanExecutor$TaskExecutorWorker$1.execute(DefaultTaskPlanExecutor.java:98) at org.gradle.execution.taskgraph.DefaultTaskExecutionPlan.execute(DefaultTaskExecutionPlan.java:663) at org.gradle.execution.taskgraph.DefaultTaskExecutionPlan.executeWithTask(DefaultTaskExecutionPlan.java:597) at org.gradle.execution.taskgraph.DefaultTaskPlanExecutor$TaskExecutorWorker.run(DefaultTaskPlanExecutor.java:98) at org.gradle.internal.concurrent.ExecutorPolicy$CatchAndRecordFailures.onExecute(ExecutorPolicy.java:63) at org.gradle.internal.concurrent.ManagedExecutorImpl$1.run(ManagedExecutorImpl.java:46) at java.util.concurrent.ThreadPoolExecutor.runWorker(ThreadPoolExecutor.java:1142) at java.util.concurrent.ThreadPoolExecutor$Worker.run(ThreadPoolExecutor.java:617) at org.gradle.internal.concurrent.ThreadFactoryImpl$ManagedThreadRunnable.run(ThreadFactoryImpl.java:55) at java.lang.Thread.run(Thread.java:745) Caused by: java.lang.RuntimeException: com.android.build.api.transform.TransformException: java.lang.RuntimeException: java.lang.RuntimeException at com.android.builder.profile.Recorder$Block.handleException(Recorder.java:55) at com.android.builder.profile.ThreadRecorder.record(ThreadRecorder.java:104) at com.android.build.gradle.internal.pipeline.TransformTask.transform(TransformTask.java:230) at sun.reflect.NativeMethodAccessorImpl.invoke0(Native Method) at sun.reflect.NativeMethodAccessorImpl.invoke(NativeMethodAccessorImpl.java:62) at sun.reflect.DelegatingMethodAccessorImpl.invoke(DelegatingMethodAccessorImpl.java:43) at java.lang.reflect.Method.invoke(Method.java:498) at org.gradle.internal.reflect.JavaMethod.invoke(JavaMethod.java:73) at org.gradle.api.internal.project.taskfactory.IncrementalTaskAction.doExecute(IncrementalTaskAction.java:50) at org.gradle.api.internal.project.taskfactory.StandardTaskAction.execute(StandardTaskAction.java:39) at org.gradle.api.internal.project.taskfactory.StandardTaskAction.execute(StandardTaskAction.java:26) at org.gradle.api.internal.tasks.execution.ExecuteActionsTaskExecuter$1.run(ExecuteActionsTaskExecuter.java:124) at org.gradle.internal.progress.DefaultBuildOperationExecutor$RunnableBuildOperationWorker.execute(DefaultBuildOperationExecutor.java:336) at org.gradle.internal.progress.DefaultBuildOperationExecutor$RunnableBuildOperationWorker.execute(DefaultBuildOperationExecutor.java:328) at org.gradle.internal.progress.DefaultBuildOperationExecutor.execute(DefaultBuildOperationExecutor.java:199) at org.gradle.internal.progress.DefaultBuildOperationExecutor.run(DefaultBuildOperationExecutor.java:110) at org.gradle.api.internal.tasks.execution.ExecuteActionsTaskExecuter.executeAction(ExecuteActionsTaskExecuter.java:113) at org.gradle.api.internal.tasks.execution.ExecuteActionsTaskExecuter.executeActions(ExecuteActionsTaskExecuter.java:95) ... 33 more Caused by: com.android.build.api.transform.TransformException: java.lang.RuntimeException: java.lang.RuntimeException at com.android.build.gradle.internal.transforms.DexArchiveBuilderTransform.transform(DexArchiveBuilderTransform.java:427) at com.android.build.gradle.internal.pipeline.TransformTask$2.call(TransformTask.java:239) at com.android.build.gradle.internal.pipeline.TransformTask$2.call(TransformTask.java:235) at com.android.builder.profile.ThreadRecorder.record(ThreadRecorder.java:102) ... 49 more Caused by: java.lang.RuntimeException: java.lang.RuntimeException at sun.reflect.NativeConstructorAccessorImpl.newInstance0(Native Method) at sun.reflect.NativeConstructorAccessorImpl.newInstance(NativeConstructorAccessorImpl.java:62) at sun.reflect.DelegatingConstructorAccessorImpl.newInstance(DelegatingConstructorAccessorImpl.java:45) at java.lang.reflect.Constructor.newInstance(Constructor.java:423) at java.util.concurrent.ForkJoinTask.getThrowableException(ForkJoinTask.java:593) at java.util.concurrent.ForkJoinTask.reportException(ForkJoinTask.java:677) at java.util.concurrent.ForkJoinTask.join(ForkJoinTask.java:720) at com.android.ide.common.internal.WaitableExecutor.waitForTasksWithQuickFail(WaitableExecutor.java:146) at com.android.build.gradle.internal.transforms.DesugarIncrementalTransformHelper.getInitalGraphData(DesugarIncrementalTransformHelper.java:162) at com.android.build.gradle.internal.transforms.DesugarIncrementalTransformHelper.makeDesugaringGraph(DesugarIncrementalTransformHelper.java:130) at com.google.common.base.Suppliers$NonSerializableMemoizingSupplier.get(Suppliers.java:160) at com.android.build.gradle.internal.transforms.DesugarIncrementalTransformHelper.getDependenciesPaths(DesugarIncrementalTransformHelper.java:231) at com.android.build.gradle.internal.transforms.DexArchiveBuilderTransform.getD8DesugaringCacheInfo(DexArchiveBuilderTransform.java:461) at com.android.build.gradle.internal.transforms.DexArchiveBuilderTransform.transform(DexArchiveBuilderTransform.java:375) ... 52 more Caused by: java.lang.RuntimeException at org.objectweb.asm.ClassVisitor.visitModule(ClassVisitor.java:148) at org.objectweb.asm.ClassReader.readModule(ClassReader.java:731) at org.objectweb.asm.ClassReader.accept(ClassReader.java:632) at org.objectweb.asm.ClassReader.accept(ClassReader.java:500) at com.android.builder.desugaring.DesugaringClassAnalyzer.analyze(DesugaringClassAnalyzer.java:144) at com.android.builder.desugaring.DesugaringClassAnalyzer.analyzeJar(DesugaringClassAnalyzer.java:92) at com.android.builder.desugaring.DesugaringClassAnalyzer.analyze(DesugaringClassAnalyzer.java:63) at com.android.build.gradle.internal.transforms.DesugarIncrementalTransformHelper.lambda$getInitalGraphData$4(DesugarIncrementalTransformHelper.java:150) at java.util.concurrent.ForkJoinTask$AdaptedCallable.exec(ForkJoinTask.java:1424) at java.util.concurrent.ForkJoinTask.doExec(ForkJoinTask.java:289) at java.util.concurrent.ForkJoinPool$WorkQueue.runTask(ForkJoinPool.java:1056) at java.util.concurrent.ForkJoinPool.runWorker(ForkJoinPool.java:1692) at java.util.concurrent.ForkJoinWorkerThread.run(ForkJoinWorkerThread.java:157) 具体情况
Error:Could not find com.android.tools.build:gradle-core:2.3.3. Searched in the following locations:
新导入项目报这个错误: Error:Could not find com.android.tools.build:gradle-core:2.3.3. Searched in the following locations: https://repo1.maven.org/maven2/com/android/tools/build/gradle-core/2.3.3/gradle-core-2.3.3.pom https://repo1.maven.org/maven2/com/android/tools/build/gradle-core/2.3.3/gradle-core-2.3.3.jar Required by: project :library > com.android.tools.build:gradle:2.3.3。 图片: ![图片说明](https://img-ask.csdn.net/upload/201908/30/1567134273_698972.png) ![图片说明](https://img-ask.csdn.net/upload/201908/30/1567134287_697402.png)
idea导入安卓项目时出现错误
Process 'command 'C:\Users\daiyuhe\AppData\Local\Android\Sdk\build-tools\28.0.3\aapt.exe'' finished with non-zero exit value 1 org.gradle.initialization.ReportedException: org.gradle.internal.exceptions.LocationAwareException: Execution failed for task ':processDebugResources'. at org.gradle.initialization.DefaultGradleLauncher.doBuildStages(DefaultGradleLauncher.java:137) at org.gradle.initialization.DefaultGradleLauncher.executeTasks(DefaultGradleLauncher.java:107) at org.gradle.internal.invocation.GradleBuildController$1.call(GradleBuildController.java:78) at org.gradle.internal.invocation.GradleBuildController$1.call(GradleBuildController.java:75) at org.gradle.internal.work.DefaultWorkerLeaseService.withLocks(DefaultWorkerLeaseService.java:152) at org.gradle.internal.invocation.GradleBuildController.doBuild(GradleBuildController.java:100) at org.gradle.internal.invocation.GradleBuildController.run(GradleBuildController.java:75) at org.gradle.tooling.internal.provider.runner.BuildModelActionRunner.run(BuildModelActionRunner.java:53) at org.gradle.launcher.exec.ChainingBuildActionRunner.run(ChainingBuildActionRunner.java:35) at org.gradle.launcher.exec.ChainingBuildActionRunner.run(ChainingBuildActionRunner.java:35) at org.gradle.tooling.internal.provider.ValidatingBuildActionRunner.run(ValidatingBuildActionRunner.java:32) at org.gradle.launcher.exec.RunAsBuildOperationBuildActionRunner$1.run(RunAsBuildOperationBuildActionRunner.java:43) at org.gradle.internal.progress.DefaultBuildOperationExecutor$RunnableBuildOperationWorker.execute(DefaultBuildOperationExecutor.java:336) at org.gradle.internal.progress.DefaultBuildOperationExecutor$RunnableBuildOperationWorker.execute(DefaultBuildOperationExecutor.java:328) at org.gradle.internal.progress.DefaultBuildOperationExecutor.execute(DefaultBuildOperationExecutor.java:197) at org.gradle.internal.progress.DefaultBuildOperationExecutor.run(DefaultBuildOperationExecutor.java:107) at org.gradle.launcher.exec.RunAsBuildOperationBuildActionRunner.run(RunAsBuildOperationBuildActionRunner.java:40) at org.gradle.tooling.internal.provider.SubscribableBuildActionRunner.run(SubscribableBuildActionRunner.java:51) at org.gradle.launcher.exec.InProcessBuildActionExecuter.execute(InProcessBuildActionExecuter.java:45) at org.gradle.launcher.exec.InProcessBuildActionExecuter.execute(InProcessBuildActionExecuter.java:29) at org.gradle.launcher.exec.BuildTreeScopeBuildActionExecuter.execute(BuildTreeScopeBuildActionExecuter.java:39) at org.gradle.launcher.exec.BuildTreeScopeBuildActionExecuter.execute(BuildTreeScopeBuildActionExecuter.java:25) at org.gradle.tooling.internal.provider.ContinuousBuildActionExecuter.execute(ContinuousBuildActionExecuter.java:71) at org.gradle.tooling.internal.provider.ContinuousBuildActionExecuter.execute(ContinuousBuildActionExecuter.java:45) at org.gradle.tooling.internal.provider.ServicesSetupBuildActionExecuter.execute(ServicesSetupBuildActionExecuter.java:51) at org.gradle.tooling.internal.provider.ServicesSetupBuildActionExecuter.execute(ServicesSetupBuildActionExecuter.java:32) at org.gradle.tooling.internal.provider.GradleThreadBuildActionExecuter.execute(GradleThreadBuildActionExecuter.java:36) at org.gradle.tooling.internal.provider.GradleThreadBuildActionExecuter.execute(GradleThreadBuildActionExecuter.java:25) at org.gradle.tooling.internal.provider.ParallelismConfigurationBuildActionExecuter.execute(ParallelismConfigurationBuildActionExecuter.java:43) at org.gradle.tooling.internal.provider.ParallelismConfigurationBuildActionExecuter.execute(ParallelismConfigurationBuildActionExecuter.java:29) at org.gradle.tooling.internal.provider.StartParamsValidatingActionExecuter.execute(StartParamsValidatingActionExecuter.java:64) at org.gradle.tooling.internal.provider.StartParamsValidatingActionExecuter.execute(StartParamsValidatingActionExecuter.java:29) at org.gradle.tooling.internal.provider.SessionFailureReportingActionExecuter.execute(SessionFailureReportingActionExecuter.java:55) at org.gradle.tooling.internal.provider.SessionFailureReportingActionExecuter.execute(SessionFailureReportingActionExecuter.java:42) at org.gradle.tooling.internal.provider.SetupLoggingActionExecuter.execute(SetupLoggingActionExecuter.java:58) at org.gradle.tooling.internal.provider.SetupLoggingActionExecuter.execute(SetupLoggingActionExecuter.java:33) at org.gradle.launcher.daemon.server.exec.ExecuteBuild.doBuild(ExecuteBuild.java:67) at org.gradle.launcher.daemon.server.exec.BuildCommandOnly.execute(BuildCommandOnly.java:36) at org.gradle.launcher.daemon.server.api.DaemonCommandExecution.proceed(DaemonCommandExecution.java:120) at org.gradle.launcher.daemon.server.exec.WatchForDisconnection.execute(WatchForDisconnection.java:37) at org.gradle.launcher.daemon.server.api.DaemonCommandExecution.proceed(DaemonCommandExecution.java:120) at org.gradle.launcher.daemon.server.exec.ResetDeprecationLogger.execute(ResetDeprecationLogger.java:26) at org.gradle.launcher.daemon.server.api.DaemonCommandExecution.proceed(DaemonCommandExecution.java:120) at org.gradle.launcher.daemon.server.exec.RequestStopIfSingleUsedDaemon.execute(RequestStopIfSingleUsedDaemon.java:34) at org.gradle.launcher.daemon.server.api.DaemonCommandExecution.proceed(DaemonCommandExecution.java:120) at org.gradle.launcher.daemon.server.exec.ForwardClientInput$2.call(ForwardClientInput.java:74) at org.gradle.launcher.daemon.server.exec.ForwardClientInput$2.call(ForwardClientInput.java:72) at org.gradle.util.Swapper.swap(Swapper.java:38) at org.gradle.launcher.daemon.server.exec.ForwardClientInput.execute(ForwardClientInput.java:72) at org.gradle.launcher.daemon.server.api.DaemonCommandExecution.proceed(DaemonCommandExecution.java:120) at org.gradle.launcher.daemon.server.exec.LogAndCheckHealth.execute(LogAndCheckHealth.java:55) at org.gradle.launcher.daemon.server.api.DaemonCommandExecution.proceed(DaemonCommandExecution.java:120) at org.gradle.launcher.daemon.server.exec.LogToClient.doBuild(LogToClient.java:62) at org.gradle.launcher.daemon.server.exec.BuildCommandOnly.execute(BuildCommandOnly.java:36) at org.gradle.launcher.daemon.server.api.DaemonCommandExecution.proceed(DaemonCommandExecution.java:120) at org.gradle.launcher.daemon.server.exec.EstablishBuildEnvironment.doBuild(EstablishBuildEnvironment.java:82) at org.gradle.launcher.daemon.server.exec.BuildCommandOnly.execute(BuildCommandOnly.java:36) at org.gradle.launcher.daemon.server.api.DaemonCommandExecution.proceed(DaemonCommandExecution.java:120) at org.gradle.launcher.daemon.server.exec.StartBuildOrRespondWithBusy$1.run(StartBuildOrRespondWithBusy.java:50) at org.gradle.launcher.daemon.server.DaemonStateCoordinator$1.run(DaemonStateCoordinator.java:297) at org.gradle.internal.concurrent.ExecutorPolicy$CatchAndRecordFailures.onExecute(ExecutorPolicy.java:63) at org.gradle.internal.concurrent.ManagedExecutorImpl$1.run(ManagedExecutorImpl.java:46) at java.util.concurrent.ThreadPoolExecutor.runWorker(ThreadPoolExecutor.java:1149) at java.util.concurrent.ThreadPoolExecutor$Worker.run(ThreadPoolExecutor.java:624) at org.gradle.internal.concurrent.ThreadFactoryImpl$ManagedThreadRunnable.run(ThreadFactoryImpl.java:55) at java.lang.Thread.run(Thread.java:748) Caused by: org.gradle.internal.exceptions.LocationAwareException: Execution failed for task ':processDebugResources'. at org.gradle.initialization.DefaultExceptionAnalyser.transform(DefaultExceptionAnalyser.java:74) at org.gradle.initialization.MultipleBuildFailuresExceptionAnalyser.transform(MultipleBuildFailuresExceptionAnalyser.java:47) at org.gradle.initialization.StackTraceSanitizingExceptionAnalyser.transform(StackTraceSanitizingExceptionAnalyser.java:30) at org.gradle.initialization.DefaultGradleLauncher.doBuildStages(DefaultGradleLauncher.java:135) at org.gradle.initialization.DefaultGradleLauncher.executeTasks(DefaultGradleLauncher.java:107) at org.gradle.internal.invocation.GradleBuildController$1.call(GradleBuildController.java:78) at org.gradle.internal.invocation.GradleBuildController$1.call(GradleBuildController.java:75) at org.gradle.internal.work.DefaultWorkerLeaseService.withLocks(DefaultWorkerLeaseService.java:152) at org.gradle.internal.invocation.GradleBuildController.doBuild(GradleBuildController.java:100) at org.gradle.internal.invocation.GradleBuildController.run(GradleBuildController.java:75) at org.gradle.tooling.internal.provider.runner.BuildModelActionRunner.run(BuildModelActionRunner.java:53) at org.gradle.launcher.exec.ChainingBuildActionRunner.run(ChainingBuildActionRunner.java:35) at org.gradle.launcher.exec.ChainingBuildActionRunner.run(ChainingBuildActionRunner.java:35) at org.gradle.tooling.internal.provider.ValidatingBuildActionRunner.run(ValidatingBuildActionRunner.java:32) at org.gradle.launcher.exec.RunAsBuildOperationBuildActionRunner$1.run(RunAsBuildOperationBuildActionRunner.java:43) at org.gradle.internal.progress.DefaultBuildOperationExecutor$RunnableBuildOperationWorker.execute(DefaultBuildOperationExecutor.java:336) at org.gradle.internal.progress.DefaultBuildOperationExecutor$RunnableBuildOperationWorker.execute(DefaultBuildOperationExecutor.java:328) at org.gradle.internal.progress.DefaultBuildOperationExecutor.execute(DefaultBuildOperationExecutor.java:197) at org.gradle.internal.progress.DefaultBuildOperationExecutor.run(DefaultBuildOperationExecutor.java:107) at org.gradle.launcher.exec.RunAsBuildOperationBuildActionRunner.run(RunAsBuildOperationBuildActionRunner.java:40) at org.gradle.tooling.internal.provider.SubscribableBuildActionRunner.run(SubscribableBuildActionRunner.java:51) at org.gradle.launcher.exec.InProcessBuildActionExecuter.execute(InProcessBuildActionExecuter.java:45) at org.gradle.launcher.exec.InProcessBuildActionExecuter.execute(InProcessBuildActionExecuter.java:29) at org.gradle.launcher.exec.BuildTreeScopeBuildActionExecuter.execute(BuildTreeScopeBuildActionExecuter.java:39) at org.gradle.launcher.exec.BuildTreeScopeBuildActionExecuter.execute(BuildTreeScopeBuildActionExecuter.java:25) at org.gradle.tooling.internal.provider.ContinuousBuildActionExecuter.execute(ContinuousBuildActionExecuter.java:71) at org.gradle.tooling.internal.provider.ContinuousBuildActionExecuter.execute(ContinuousBuildActionExecuter.java:45) at org.gradle.tooling.internal.provider.ServicesSetupBuildActionExecuter.execute(ServicesSetupBuildActionExecuter.java:51) at org.gradle.tooling.internal.provider.ServicesSetupBuildActionExecuter.execute(ServicesSetupBuildActionExecuter.java:32) at org.gradle.tooling.internal.provider.GradleThreadBuildActionExecuter.execute(GradleThreadBuildActionExecuter.java:36) at org.gradle.tooling.internal.provider.GradleThreadBuildActionExecuter.execute(GradleThreadBuildActionExecuter.java:25) at org.gradle.tooling.internal.provider.ParallelismConfigurationBuildActionExecuter.execute(ParallelismConfigurationBuildActionExecuter.java:43) at org.gradle.tooling.internal.provider.ParallelismConfigurationBuildActionExecuter.execute(ParallelismConfigurationBuildActionExecuter.java:29) at org.gradle.tooling.internal.provider.StartParamsValidatingActionExecuter.execute(StartParamsValidatingActionExecuter.java:64) at org.gradle.tooling.internal.provider.StartParamsValidatingActionExecuter.execute(StartParamsValidatingActionExecuter.java:29) at org.gradle.tooling.internal.provider.SessionFailureReportingActionExecuter.execute(SessionFailureReportingActionExecuter.java:55) at org.gradle.tooling.internal.provider.SessionFailureReportingActionExecuter.execute(SessionFailureReportingActionExecuter.java:42) at org.gradle.tooling.internal.provider.SetupLoggingActionExecuter.execute(SetupLoggingActionExecuter.java:58) at org.gradle.tooling.internal.provider.SetupLoggingActionExecuter.execute(SetupLoggingActionExecuter.java:33) at org.gradle.launcher.daemon.server.exec.ExecuteBuild.doBuild(ExecuteBuild.java:67) at org.gradle.launcher.daemon.server.exec.BuildCommandOnly.execute(BuildCommandOnly.java:36) at org.gradle.launcher.daemon.server.api.DaemonCommandExecution.proceed(DaemonCommandExecution.java:120) at org.gradle.launcher.daemon.server.exec.WatchForDisconnection.execute(WatchForDisconnection.java:37) at org.gradle.launcher.daemon.server.api.DaemonCommandExecution.proceed(DaemonCommandExecution.java:120) at org.gradle.launcher.daemon.server.exec.ResetDeprecationLogger.execute(ResetDeprecationLogger.java:26) at org.gradle.launcher.daemon.server.api.DaemonCommandExecution.proceed(DaemonCommandExecution.java:120) at org.gradle.launcher.daemon.server.exec.RequestStopIfSingleUsedDaemon.execute(RequestStopIfSingleUsedDaemon.java:34) at org.gradle.launcher.daemon.server.api.DaemonCommandExecution.proceed(DaemonCommandExecution.java:120) at org.gradle.launcher.daemon.server.exec.ForwardClientInput$2.call(ForwardClientInput.java:74) at org.gradle.launcher.daemon.server.exec.ForwardClientInput$2.call(ForwardClientInput.java:72) at org.gradle.util.Swapper.swap(Swapper.java:38) at org.gradle.launcher.daemon.server.exec.ForwardClientInput.execute(ForwardClientInput.java:72) at org.gradle.launcher.daemon.server.api.DaemonCommandExecution.proceed(DaemonCommandExecution.java:120) at org.gradle.launcher.daemon.server.exec.LogAndCheckHealth.execute(LogAndCheckHealth.java:55) at org.gradle.launcher.daemon.server.api.DaemonCommandExecution.proceed(DaemonCommandExecution.java:120) at org.gradle.launcher.daemon.server.exec.LogToClient.doBuild(LogToClient.java:62) at org.gradle.launcher.daemon.server.exec.BuildCommandOnly.execute(BuildCommandOnly.java:36) at org.gradle.launcher.daemon.server.api.DaemonCommandExecution.proceed(DaemonCommandExecution.java:120) at org.gradle.launcher.daemon.server.exec.EstablishBuildEnvironment.doBuild(EstablishBuildEnvironment.java:82) at org.gradle.launcher.daemon.server.exec.BuildCommandOnly.execute(BuildCommandOnly.java:36) at org.gradle.launcher.daemon.server.api.DaemonCommandExecution.proceed(DaemonCommandExecution.java:120) at org.gradle.launcher.daemon.server.exec.StartBuildOrRespondWithBusy$1.run(StartBuildOrRespondWithBusy.java:50) at org.gradle.launcher.daemon.server.DaemonStateCoordinator$1.run(DaemonStateCoordinator.java:297) at org.gradle.internal.concurrent.ExecutorPolicy$CatchAndRecordFailures.onExecute(ExecutorPolicy.java:63) at org.gradle.internal.concurrent.ManagedExecutorImpl$1.run(ManagedExecutorImpl.java:46) at org.gradle.internal.concurrent.ThreadFactoryImpl$ManagedThreadRunnable.run(ThreadFactoryImpl.java:55) Caused by: org.gradle.api.tasks.TaskExecutionException: Execution failed for task ':processDebugResources'. at org.gradle.api.internal.tasks.execution.ExecuteActionsTaskExecuter.executeActions(ExecuteActionsTaskExecuter.java:100) at org.gradle.api.internal.tasks.execution.ExecuteActionsTaskExecuter.execute(ExecuteActionsTaskExecuter.java:70) at org.gradle.api.internal.tasks.execution.SkipUpToDateTaskExecuter.execute(SkipUpToDateTaskExecuter.java:63) at org.gradle.api.internal.tasks.execution.ResolveTaskOutputCachingStateExecuter.execute(ResolveTaskOutputCachingStateExecuter.java:54) at org.gradle.api.internal.tasks.execution.ValidatingTaskExecuter.execute(ValidatingTaskExecuter.java:58) at org.gradle.api.internal.tasks.execution.SkipEmptySourceFilesTaskExecuter.execute(SkipEmptySourceFilesTaskExecuter.java:88) at org.gradle.api.internal.tasks.execution.ResolveTaskArtifactStateTaskExecuter.execute(ResolveTaskArtifactStateTaskExecuter.java:52) at org.gradle.api.internal.tasks.execution.SkipTaskWithNoActionsExecuter.execute(SkipTaskWithNoActionsExecuter.java:52) at org.gradle.api.internal.tasks.execution.SkipOnlyIfTaskExecuter.execute(SkipOnlyIfTaskExecuter.java:54) at org.gradle.api.internal.tasks.execution.ExecuteAtMostOnceTaskExecuter.execute(ExecuteAtMostOnceTaskExecuter.java:43) at org.gradle.api.internal.tasks.execution.CatchExceptionTaskExecuter.execute(CatchExceptionTaskExecuter.java:34) at org.gradle.execution.taskgraph.DefaultTaskGraphExecuter$EventFiringTaskWorker$1.run(DefaultTaskGraphExecuter.java:248) at org.gradle.internal.progress.DefaultBuildOperationExecutor$RunnableBuildOperationWorker.execute(DefaultBuildOperationExecutor.java:336) at org.gradle.internal.progress.DefaultBuildOperationExecutor$RunnableBuildOperationWorker.execute(DefaultBuildOperationExecutor.java:328) at org.gradle.internal.progress.DefaultBuildOperationExecutor.execute(DefaultBuildOperationExecutor.java:197) at org.gradle.internal.progress.DefaultBuildOperationExecutor.run(DefaultBuildOperationExecutor.java:107) at org.gradle.execution.taskgraph.DefaultTaskGraphExecuter$EventFiringTaskWorker.execute(DefaultTaskGraphExecuter.java:241) at org.gradle.execution.taskgraph.DefaultTaskGraphExecuter$EventFiringTaskWorker.execute(DefaultTaskGraphExecuter.java:230) at org.gradle.execution.taskgraph.DefaultTaskPlanExecutor$TaskExecutorWorker.processTask(DefaultTaskPlanExecutor.java:124) at org.gradle.execution.taskgraph.DefaultTaskPlanExecutor$TaskExecutorWorker.access$200(DefaultTaskPlanExecutor.java:80) at org.gradle.execution.taskgraph.DefaultTaskPlanExecutor$TaskExecutorWorker$1.execute(DefaultTaskPlanExecutor.java:105) at org.gradle.execution.taskgraph.DefaultTaskPlanExecutor$TaskExecutorWorker$1.execute(DefaultTaskPlanExecutor.java:99) at org.gradle.execution.taskgraph.DefaultTaskExecutionPlan.execute(DefaultTaskExecutionPlan.java:625) at org.gradle.execution.taskgraph.DefaultTaskExecutionPlan.executeWithTask(DefaultTaskExecutionPlan.java:580) at org.gradle.execution.taskgraph.DefaultTaskPlanExecutor$TaskExecutorWorker.run(DefaultTaskPlanExecutor.java:99) ... 3 more Caused by: java.lang.RuntimeException: com.android.ide.common.process.ProcessException: Failed to execute aapt at com.android.build.gradle.tasks.ProcessAndroidResources.doFullTaskAction(ProcessAndroidResources.java:201) at com.android.build.gradle.internal.tasks.IncrementalTask.taskAction(IncrementalTask.java:82) at org.gradle.internal.reflect.JavaMethod.invoke(JavaMethod.java:73) at org.gradle.api.internal.project.taskfactory.DefaultTaskClassInfoStore$IncrementalTaskAction.doExecute(DefaultTaskClassInfoStore.java:173) at org.gradle.api.internal.project.taskfactory.DefaultTaskClassInfoStore$StandardTaskAction.execute(DefaultTaskClassInfoStore.java:134) at org.gradle.api.internal.project.taskfactory.DefaultTaskClassInfoStore$StandardTaskAction.execute(DefaultTaskClassInfoStore.java:121) at org.gradle.api.internal.tasks.execution.ExecuteActionsTaskExecuter$1.run(ExecuteActionsTaskExecuter.java:122) at org.gradle.internal.progress.DefaultBuildOperationExecutor$RunnableBuildOperationWorker.execute(DefaultBuildOperationExecutor.java:336) at org.gradle.internal.progress.DefaultBuildOperationExecutor$RunnableBuildOperationWorker.execute(DefaultBuildOperationExecutor.java:328) at org.gradle.internal.progress.DefaultBuildOperationExecutor.execute(DefaultBuildOperationExecutor.java:197) at org.gradle.internal.progress.DefaultBuildOperationExecutor.run(DefaultBuildOperationExecutor.java:107) at org.gradle.api.internal.tasks.execution.ExecuteActionsTaskExecuter.executeAction(ExecuteActionsTaskExecuter.java:111) at org.gradle.api.internal.tasks.execution.ExecuteActionsTaskExecuter.executeActions(ExecuteActionsTaskExecuter.java:92) ... 27 more Caused by: com.android.ide.common.process.ProcessException: Failed to execute aapt at com.android.builder.core.AndroidBuilder.processResources(AndroidBuilder.java:867) at com.android.build.gradle.tasks.ProcessAndroidResources.doFullTaskAction(ProcessAndroidResources.java:194) ... 39 more Caused by: java.util.concurrent.ExecutionException: com.android.ide.common.process.ProcessException: Error while executing process C:\Users\daiyuhe\AppData\Local\Android\Sdk\build-tools\28.0.3\aapt.exe with arguments {package -f --no-crunch -I C:\Users\daiyuhe\AppData\Local\Android\Sdk\platforms\android-28\android.jar -M \\?\C:\Users\daiyuhe\Documents\Java_workspace\Calculator\build\intermediates\manifests\full\debug\AndroidManifest.xml -S C:\Users\daiyuhe\Documents\Java_workspace\Calculator\build\intermediates\res\merged\debug -m -J \\?\C:\Users\daiyuhe\Documents\Java_workspace\Calculator\build\generated\source\r\debug -F C:\Users\daiyuhe\Documents\Java_workspace\Calculator\build\intermediates\res\resources-debug.ap_ --debug-mode --custom-package com.daiyuhe.app.calculator -0 apk --output-text-symbols \\?\C:\Users\daiyuhe\Documents\Java_workspace\Calculator\build\intermediates\symbols\debug --no-version-vectors} at com.google.common.util.concurrent.AbstractFuture$Sync.getValue(AbstractFuture.java:299) at com.google.common.util.concurrent.AbstractFuture$Sync.get(AbstractFuture.java:286) at com.google.common.util.concurrent.AbstractFuture.get(AbstractFuture.java:116) at com.android.builder.core.AndroidBuilder.processResources(AndroidBuilder.java:865) ... 40 more Caused by: com.android.ide.common.process.ProcessException: Error while executing process C:\Users\daiyuhe\AppData\Local\Android\Sdk\build-tools\28.0.3\aapt.exe with arguments {package -f --no-crunch -I C:\Users\daiyuhe\AppData\Local\Android\Sdk\platforms\android-28\android.jar -M \\?\C:\Users\daiyuhe\Documents\Java_workspace\Calculator\build\intermediates\manifests\full\debug\AndroidManifest.xml -S C:\Users\daiyuhe\Documents\Java_workspace\Calculator\build\intermediates\res\merged\debug -m -J \\?\C:\Users\daiyuhe\Documents\Java_workspace\Calculator\build\generated\source\r\debug -F C:\Users\daiyuhe\Documents\Java_workspace\Calculator\build\intermediates\res\resources-debug.ap_ --debug-mode --custom-package com.daiyuhe.app.calculator -0 apk --output-text-symbols \\?\C:\Users\daiyuhe\Documents\Java_workspace\Calculator\build\intermediates\symbols\debug --no-version-vectors} at com.android.build.gradle.internal.process.GradleProcessResult.buildProcessException(GradleProcessResult.java:74) at com.android.build.gradle.internal.process.GradleProcessResult.assertNormalExitValue(GradleProcessResult.java:49) at com.android.builder.internal.aapt.AbstractProcessExecutionAapt$1.onSuccess(AbstractProcessExecutionAapt.java:78) at com.android.builder.internal.aapt.AbstractProcessExecutionAapt$1.onSuccess(AbstractProcessExecutionAapt.java:74) at com.google.common.util.concurrent.Futures$6.run(Futures.java:1319) at com.google.common.util.concurrent.MoreExecutors$DirectExecutor.execute(MoreExecutors.java:457) at com.google.common.util.concurrent.ExecutionList.executeListener(ExecutionList.java:156) at com.google.common.util.concurrent.ExecutionList.execute(ExecutionList.java:145) at com.google.common.util.concurrent.AbstractFuture.set(AbstractFuture.java:185) at com.google.common.util.concurrent.SettableFuture.set(SettableFuture.java:53) at com.android.build.gradle.internal.process.GradleProcessExecutor$1.run(GradleProcessExecutor.java:60) Caused by: org.gradle.process.internal.ExecException: Process 'command 'C:\Users\daiyuhe\AppData\Local\Android\Sdk\build-tools\28.0.3\aapt.exe'' finished with non-zero exit value 1 at org.gradle.process.internal.DefaultExecHandle$ExecResultImpl.assertNormalExitValue(DefaultExecHandle.java:380) at com.android.build.gradle.internal.process.GradleProcessResult.assertNormalExitValue(GradleProcessResult.java:47) ... 9 more
android gradle工程,引用annotation包,构建javadoc报错
我在android 工程引入了android官方的注解support-annotation,然后用gradle构建时增加了一个javadoc的task,就是提取javadoc时失败,不知道怎么修改。so求助各位大神们,怎么解决? 我现在用的插件是‘com.android.tools.build:gradle:1.3.0’,gradle版本2.7 代码如下: ``` task androidJavadoc(type: Javadoc) { source = android.sourceSets.main.java.srcDirs exclude '**/pom.xml' exclude '**/proguard_annotations.pro' classpath += files(android.bootClasspath.join(File.pathSeparator)) destinationDir = file("../javadoc/") } task androidJavadocJar(type: Jar, dependsOn: androidJavadoc) { classifier = 'javadoc' from androidJavadoc.destinationDir } artifacts { archives androidSourcesJar archives androidJavadocJar } ``` 错误如下: Execution failed for task ':IPullToRefreshRecycler:androidJavadoc'. > Javadoc generation failed. Generated Javadoc options file (useful for troubleshooting): '/Users/heart19901126/zhouli/codes/50AH-code-master/IPullToRefreshRecyclerSample/IPullToRefreshRecycler/build/tmp/androidJavadoc/javadoc.options' * Try: Run with --info or --debug option to get more log output. * Exception is: org.gradle.api.tasks.TaskExecutionException: Execution failed for task ':IPullToRefreshRecycler:androidJavadoc'. at org.gradle.api.internal.tasks.execution.ExecuteActionsTaskExecuter.executeActions(ExecuteActionsTaskExecuter.java:69) at org.gradle.api.internal.tasks.execution.ExecuteActionsTaskExecuter.execute(ExecuteActionsTaskExecuter.java:46) at org.gradle.api.internal.tasks.execution.PostExecutionAnalysisTaskExecuter.execute(PostExecutionAnalysisTaskExecuter.java:35) at org.gradle.api.internal.tasks.execution.SkipUpToDateTaskExecuter.execute(SkipUpToDateTaskExecuter.java:64) at org.gradle.api.internal.tasks.execution.ValidatingTaskExecuter.execute(ValidatingTaskExecuter.java:58) at org.gradle.api.internal.tasks.execution.SkipEmptySourceFilesTaskExecuter.execute(SkipEmptySourceFilesTaskExecuter.java:42) at org.gradle.api.internal.tasks.execution.SkipTaskWithNoActionsExecuter.execute(SkipTaskWithNoActionsExecuter.java:52) at org.gradle.api.internal.tasks.execution.SkipOnlyIfTaskExecuter.execute(SkipOnlyIfTaskExecuter.java:53) at org.gradle.api.internal.tasks.execution.ExecuteAtMostOnceTaskExecuter.execute(ExecuteAtMostOnceTaskExecuter.java:43) at org.gradle.api.internal.AbstractTask.executeWithoutThrowingTaskFailure(AbstractTask.java:305) at org.gradle.execution.taskgraph.AbstractTaskPlanExecutor$TaskExecutorWorker.executeTask(AbstractTaskPlanExecutor.java:79) at org.gradle.execution.taskgraph.AbstractTaskPlanExecutor$TaskExecutorWorker.processTask(AbstractTaskPlanExecutor.java:63) at org.gradle.execution.taskgraph.AbstractTaskPlanExecutor$TaskExecutorWorker.run(AbstractTaskPlanExecutor.java:51) at org.gradle.execution.taskgraph.ParallelTaskPlanExecutor.process(ParallelTaskPlanExecutor.java:51) at org.gradle.execution.taskgraph.DefaultTaskGraphExecuter.execute(DefaultTaskGraphExecuter.java:88) at org.gradle.execution.SelectedTaskExecutionAction.execute(SelectedTaskExecutionAction.java:29) at org.gradle.execution.DefaultBuildExecuter.execute(DefaultBuildExecuter.java:62) at org.gradle.execution.DefaultBuildExecuter.access$200(DefaultBuildExecuter.java:23) at org.gradle.execution.DefaultBuildExecuter$2.proceed(DefaultBuildExecuter.java:68) at org.gradle.execution.DryRunBuildExecutionAction.execute(DryRunBuildExecutionAction.java:32) at org.gradle.execution.DefaultBuildExecuter.execute(DefaultBuildExecuter.java:62) at org.gradle.execution.DefaultBuildExecuter.execute(DefaultBuildExecuter.java:55) at org.gradle.initialization.DefaultGradleLauncher.doBuildStages(DefaultGradleLauncher.java:149) at org.gradle.initialization.DefaultGradleLauncher.doBuild(DefaultGradleLauncher.java:106) at org.gradle.initialization.DefaultGradleLauncher.run(DefaultGradleLauncher.java:86) at org.gradle.launcher.exec.InProcessBuildActionExecuter$DefaultBuildController.run(InProcessBuildActionExecuter.java:80) at org.gradle.launcher.cli.ExecuteBuildAction.run(ExecuteBuildAction.java:33) at org.gradle.launcher.cli.ExecuteBuildAction.run(ExecuteBuildAction.java:24) at org.gradle.launcher.exec.InProcessBuildActionExecuter.execute(InProcessBuildActionExecuter.java:36) at org.gradle.launcher.exec.InProcessBuildActionExecuter.execute(InProcessBuildActionExecuter.java:26) at org.gradle.launcher.cli.RunBuildAction.run(RunBuildAction.java:51) at org.gradle.internal.Actions$RunnableActionAdapter.execute(Actions.java:171) at org.gradle.launcher.cli.CommandLineActionFactory$ParseAndBuildAction.execute(CommandLineActionFactory.java:237) at org.gradle.launcher.cli.CommandLineActionFactory$ParseAndBuildAction.execute(CommandLineActionFactory.java:210) at org.gradle.launcher.cli.JavaRuntimeValidationAction.execute(JavaRuntimeValidationAction.java:35) at org.gradle.launcher.cli.JavaRuntimeValidationAction.execute(JavaRuntimeValidationAction.java:24) at org.gradle.launcher.cli.CommandLineActionFactory$WithLogging.execute(CommandLineActionFactory.java:206) at org.gradle.launcher.cli.CommandLineActionFactory$WithLogging.execute(CommandLineActionFactory.java:169) at org.gradle.launcher.cli.ExceptionReportingAction.execute(ExceptionReportingAction.java:33) at org.gradle.launcher.cli.ExceptionReportingAction.execute(ExceptionReportingAction.java:22) at org.gradle.launcher.Main.doAction(Main.java:33) at org.gradle.launcher.bootstrap.EntryPoint.run(EntryPoint.java:45) at org.gradle.launcher.bootstrap.ProcessBootstrap.runNoExit(ProcessBootstrap.java:54) at org.gradle.launcher.bootstrap.ProcessBootstrap.run(ProcessBootstrap.java:35) at org.gradle.launcher.GradleMain.main(GradleMain.java:23) Caused by: org.gradle.api.GradleException: Javadoc generation failed. Generated Javadoc options file (useful for troubleshooting): '/Users/heart19901126/zhouli/codes/50AH-code-master/IPullToRefreshRecyclerSample/IPullToRefreshRecycler/build/tmp/androidJavadoc/javadoc.options' at org.gradle.api.tasks.javadoc.internal.JavadocGenerator.execute(JavadocGenerator.java:55) at org.gradle.api.tasks.javadoc.internal.JavadocGenerator.execute(JavadocGenerator.java:31) at org.gradle.api.tasks.javadoc.Javadoc.executeExternalJavadoc(Javadoc.java:140) at org.gradle.api.tasks.javadoc.Javadoc.generate(Javadoc.java:128) at org.gradle.internal.reflect.JavaMethod.invoke(JavaMethod.java:63) at org.gradle.api.internal.project.taskfactory.AnnotationProcessingTaskFactory$StandardTaskAction.doExecute(AnnotationProcessingTaskFactory.java:218) at org.gradle.api.internal.project.taskfactory.AnnotationProcessingTaskFactory$StandardTaskAction.execute(AnnotationProcessingTaskFactory.java:211) at org.gradle.api.internal.project.taskfactory.AnnotationProcessingTaskFactory$StandardTaskAction.execute(AnnotationProcessingTaskFactory.java:200) at org.gradle.api.internal.AbstractTask$TaskActionWrapper.execute(AbstractTask.java:579) at org.gradle.api.internal.AbstractTask$TaskActionWrapper.execute(AbstractTask.java:562) at org.gradle.api.internal.tasks.execution.ExecuteActionsTaskExecuter.executeAction(ExecuteActionsTaskExecuter.java:80) at org.gradle.api.internal.tasks.execution.ExecuteActionsTaskExecuter.executeActions(ExecuteActionsTaskExecuter.java:61) ... 44 more Caused by: org.gradle.process.internal.ExecException: Process 'command '/Library/Java/JavaVirtualMachines/jdk1.8.0_31.jdk/Contents/Home/bin/javadoc'' finished with non-zero exit value 1 at org.gradle.process.internal.DefaultExecHandle$ExecResultImpl.assertNormalExitValue(DefaultExecHandle.java:365) at org.gradle.process.internal.DefaultExecAction.execute(DefaultExecAction.java:31) at org.gradle.api.tasks.javadoc.internal.JavadocGenerator.execute(JavadocGenerator.java:52) ... 55 more
adnroid 开发编译mqtt报错
android studio 下载并打开paho.mqtt.android 编译报错,我的gradle版本4.4 as版本3.1.3 下载地址https://github.com/eclipse/paho.mqtt.android 直接git到的原始的项目,打开编译就报错,我本地新建空内容项目都能编译成功,adnroid 开发编译mqtt报错× 报错如下: Cannot create variant 'android-lint' after configuration ':org.eclipse.paho.android.service:debugRuntimeElements' has been resolved ![图片说明](https://img-ask.csdn.net/upload/201808/10/1533894738_767361.png) org.gradle.initialization.ReportedException: org.gradle.internal.exceptions.LocationAwareException: A problem occurred configuring project ':org.eclipse.paho.android.service'. at org.gradle.initialization.DefaultGradleLauncher.doBuildStages(DefaultGradleLauncher.java:139) at org.gradle.initialization.DefaultGradleLauncher.executeTasks(DefaultGradleLauncher.java:109) at org.gradle.internal.invocation.GradleBuildController$1.call(GradleBuildController.java:78) at org.gradle.internal.invocation.GradleBuildController$1.call(GradleBuildController.java:75) at org.gradle.internal.work.DefaultWorkerLeaseService.withLocks(DefaultWorkerLeaseService.java:152) at org.gradle.internal.invocation.GradleBuildController.doBuild(GradleBuildController.java:100) at org.gradle.internal.invocation.GradleBuildController.run(GradleBuildController.java:75) at org.gradle.tooling.internal.provider.runner.BuildModelActionRunner.run(BuildModelActionRunner.java:53) at org.gradle.launcher.exec.ChainingBuildActionRunner.run(ChainingBuildActionRunner.java:35) at org.gradle.launcher.exec.ChainingBuildActionRunner.run(ChainingBuildActionRunner.java:35) 。。。 at java.util.concurrent.ThreadPoolExecutor.runWorker(ThreadPoolExecutor.java:1142) at java.util.concurrent.ThreadPoolExecutor$Worker.run(ThreadPoolExecutor.java:617) at org.gradle.internal.concurrent.ThreadFactoryImpl$ManagedThreadRunnable.run(ThreadFactoryImpl.java:55) at java.lang.Thread.run(Thread.java:745) Caused by: org.gradle.internal.exceptions.LocationAwareException: A problem occurred configuring project ':org.eclipse.paho.android.service'. at org.gradle.initialization.DefaultExceptionAnalyser.transform(DefaultExceptionAnalyser.java:74) at org.gradle.initialization.MultipleBuildFailuresExceptionAnalyser.transform(MultipleBuildFailuresExceptionAnalyser.java:47) at org.gradle.initialization.StackTraceSanitizingExceptionAnalyser.transform(StackTraceSanitizingExceptionAnalyser.java:30) at org.gradle.initialization.DefaultGradleLauncher.doBuildStages(DefaultGradleLauncher.java:137) at org.gradle.initialization.DefaultGradleLauncher.executeTasks(DefaultGradleLauncher.java:109) at org.gradle.internal.invocation.GradleBuildController$1.call(GradleBuildController.java:78) at org.gradle.internal.invocation.GradleBuildController$1.call(GradleBuildController.java:75) at org.gradle.internal.work.DefaultWorkerLeaseService.withLocks(DefaultWorkerLeaseService.java:152) at org.gradle.internal.invocation.GradleBuildController.doBuild(GradleBuildController.java:100) at org.gradle.internal.invocation.GradleBuildController.run(GradleBuildController.java:75) at org.gradle.tooling.internal.provider.runner.BuildModelActionRunner.run(BuildModelActionRunner.java:53) at org.gradle.launcher.exec.ChainingBuildActionRunner.run(ChainingBuildActionRunner.java:35) at org.gradle.launcher.exec.ChainingBuildActionRunner.run(ChainingBuildActionRunner.java:35) at org.gradle.tooling.internal.provider.ValidatingBuildActionRunner.run(ValidatingBuildActionRunner.java:32) at org.gradle.launcher.exec.RunAsBuildOperationBuildActionRunner$1.run(RunAsBuildOperationBuildActionRunner.java:43) at org.gradle.internal.progress.DefaultBuildOperationExecutor$RunnableBuildOperationWorker.execute(DefaultBuildOperationExecutor.java:336) at org.gradle.internal.progress.DefaultBuildOperationExecutor$RunnableBuildOperationWorker.execute(DefaultBuildOperationExecutor.java:328) at org.gradle.internal.progress.DefaultBuildOperationExecutor.execute(DefaultBuildOperationExecutor.java:199) at org.gradle.internal.progress.DefaultBuildOperationExecutor.run(DefaultBuildOperationExecutor.java:110) at org.gradle.launcher.exec.RunAsBuildOperationBuildActionRunner.run(RunAsBuildOperationBuildActionRunner.java:40) 。。。 at org.gradle.launcher.daemon.server.exec.BuildCommandOnly.execute(BuildCommandOnly.java:36) at org.gradle.launcher.daemon.server.api.DaemonCommandExecution.proceed(DaemonCommandExecution.java:122) at org.gradle.launcher.daemon.server.exec.EstablishBuildEnvironment.doBuild(EstablishBuildEnvironment.java:82) at org.gradle.launcher.daemon.server.exec.BuildCommandOnly.execute(BuildCommandOnly.java:36) at org.gradle.launcher.daemon.server.api.DaemonCommandExecution.proceed(DaemonCommandExecution.java:122) at org.gradle.launcher.daemon.server.exec.StartBuildOrRespondWithBusy$1.run(StartBuildOrRespondWithBusy.java:50) at org.gradle.launcher.daemon.server.DaemonStateCoordinator$1.run(DaemonStateCoordinator.java:295) at org.gradle.internal.concurrent.ExecutorPolicy$CatchAndRecordFailures.onExecute(ExecutorPolicy.java:63) at org.gradle.internal.concurrent.ManagedExecutorImpl$1.run(ManagedExecutorImpl.java:46) at org.gradle.internal.concurrent.ThreadFactoryImpl$ManagedThreadRunnable.run(ThreadFactoryImpl.java:55) Caused by: org.gradle.api.ProjectConfigurationException: A problem occurred configuring project ':org.eclipse.paho.android.service'. at org.gradle.configuration.project.LifecycleProjectEvaluator.addConfigurationFailure(LifecycleProjectEvaluator.java:94) at org.gradle.configuration.project.LifecycleProjectEvaluator.notifyAfterEvaluate(LifecycleProjectEvaluator.java:89) 。。。 ... 62 more Caused by: org.gradle.api.InvalidUserCodeException: Cannot create variant 'android-lint' after configuration ':org.eclipse.paho.android.service:debugRuntimeElements' has been resolved at org.gradle.api.internal.artifacts.configurations.DefaultConfigurationPublications$ConfigurationVariantFactory.create(DefaultConfigurationPublications.java:158) at org.gradle.api.internal.artifacts.configurations.DefaultConfigurationPublications$ConfigurationVariantFactory.create(DefaultConfigurationPublications.java:151) at org.gradle.api.internal.FactoryNamedDomainObjectContainer.doCreate(FactoryNamedDomainObjectContainer.java:100) at org.gradle.api.internal.AbstractNamedDomainObjectContainer.create(AbstractNamedDomainObjectContainer.java:67) at com.android.build.gradle.internal.scope.VariantScopeImpl.lambda$publishArtifactToConfiguration$2(VariantScopeImpl.java:378) at org.gradle.api.internal.artifacts.configurations.DefaultConfigurationPublications.variants(DefaultConfigurationPublications.java:139) at com.android.build.gradle.internal.scope.VariantScopeImpl.publishArtifactToConfiguration(VariantScopeImpl.java:376) at com.android.build.gradle.internal.scope.VariantScopeImpl.publishIntermediateArtifact(VariantScopeImpl.java:347) at com.android.build.gradle.internal.scope.VariantScopeImpl.addTaskOutput(VariantScopeImpl.java:298) at com.android.build.gradle.internal.TaskManager.configureGlobalLintTask(TaskManager.java:536) at com.android.build.gradle.BasePlugin.createAndroidTasks(BasePlugin.java:7
android studio里配置C++报错?
org.gradle.api.tasks.TaskExecutionException: Execution failed for task ':app:transformNativeLibsWithMergeJniLibsForDebug'. at org.gradle.api.internal.tasks.execution.ExecuteActionsTaskExecuter.executeActions(ExecuteActionsTaskExecuter.java:103) at org.gradle.api.internal.tasks.execution.ExecuteActionsTaskExecuter.execute(ExecuteActionsTaskExecuter.java:73) at org.gradle.api.internal.tasks.execution.OutputDirectoryCreatingTaskExecuter.execute(OutputDirectoryCreatingTaskExecuter.java:51) at org.gradle.api.internal.tasks.execution.SkipUpToDateTaskExecuter.execute(SkipUpToDateTaskExecuter.java:59) at org.gradle.api.internal.tasks.execution.ResolveTaskOutputCachingStateExecuter.execute(ResolveTaskOutputCachingStateExecuter.java:54) at org.gradle.api.internal.tasks.execution.ValidatingTaskExecuter.execute(ValidatingTaskExecuter.java:59) at org.gradle.api.internal.tasks.execution.SkipEmptySourceFilesTaskExecuter.execute(SkipEmptySourceFilesTaskExecuter.java:101) at org.gradle.api.internal.tasks.execution.FinalizeInputFilePropertiesTaskExecuter.execute(FinalizeInputFilePropertiesTaskExecuter.java:44) at org.gradle.api.internal.tasks.execution.CleanupStaleOutputsExecuter.execute(CleanupStaleOutputsExecuter.java:91) at org.gradle.api.internal.tasks.execution.ResolveTaskArtifactStateTaskExecuter.execute(ResolveTaskArtifactStateTaskExecuter.java:62) at org.gradle.api.internal.tasks.execution.SkipTaskWithNoActionsExecuter.execute(SkipTaskWithNoActionsExecuter.java:59) at org.gradle.api.internal.tasks.execution.SkipOnlyIfTaskExecuter.execute(SkipOnlyIfTaskExecuter.java:54) at org.gradle.api.internal.tasks.execution.ExecuteAtMostOnceTaskExecuter.execute(ExecuteAtMostOnceTaskExecuter.java:43) at org.gradle.api.internal.tasks.execution.CatchExceptionTaskExecuter.execute(CatchExceptionTaskExecuter.java:34) at org.gradle.execution.taskgraph.DefaultTaskGraphExecuter$EventFiringTaskWorker$1.run(DefaultTaskGraphExecuter.java:256) at org.gradle.internal.progress.DefaultBuildOperationExecutor$RunnableBuildOperationWorker.execute(DefaultBuildOperationExecutor.java:336) at org.gradle.internal.progress.DefaultBuildOperationExecutor$RunnableBuildOperationWorker.execute(DefaultBuildOperationExecutor.java:328) at org.gradle.internal.progress.DefaultBuildOperationExecutor.execute(DefaultBuildOperationExecutor.java:199) at org.gradle.internal.progress.DefaultBuildOperationExecutor.run(DefaultBuildOperationExecutor.java:110) at org.gradle.execution.taskgraph.DefaultTaskGraphExecuter$EventFiringTaskWorker.execute(DefaultTaskGraphExecuter.java:249) at org.gradle.execution.taskgraph.DefaultTaskGraphExecuter$EventFiringTaskWorker.execute(DefaultTaskGraphExecuter.java:238) at org.gradle.execution.taskgraph.DefaultTaskPlanExecutor$TaskExecutorWorker.processTask(DefaultTaskPlanExecutor.java:123) at org.gradle.execution.taskgraph.DefaultTaskPlanExecutor$TaskExecutorWorker.access$200(DefaultTaskPlanExecutor.java:79) at org.gradle.execution.taskgraph.DefaultTaskPlanExecutor$TaskExecutorWorker$1.execute(DefaultTaskPlanExecutor.java:104) at org.gradle.execution.taskgraph.DefaultTaskPlanExecutor$TaskExecutorWorker$1.execute(DefaultTaskPlanExecutor.java:98) at org.gradle.execution.taskgraph.DefaultTaskExecutionPlan.execute(DefaultTaskExecutionPlan.java:663) at org.gradle.execution.taskgraph.DefaultTaskExecutionPlan.executeWithTask(DefaultTaskExecutionPlan.java:597) at org.gradle.execution.taskgraph.DefaultTaskPlanExecutor$TaskExecutorWorker.run(DefaultTaskPlanExecutor.java:98) at org.gradle.internal.concurrent.ExecutorPolicy$CatchAndRecordFailures.onExecute(ExecutorPolicy.java:63) at org.gradle.internal.concurrent.ManagedExecutorImpl$1.run(ManagedExecutorImpl.java:46) at java.util.concurrent.ThreadPoolExecutor.runWorker(ThreadPoolExecutor.java:1142) at java.util.concurrent.ThreadPoolExecutor$Worker.run(ThreadPoolExecutor.java:617) at org.gradle.internal.concurrent.ThreadFactoryImpl$ManagedThreadRunnable.run(ThreadFactoryImpl.java:55) at java.lang.Thread.run(Thread.java:745) Caused by: java.io.UncheckedIOException: java.nio.file.AccessDeniedException: C:\WINDOWS\Temp at com.android.builder.merge.LazyIncrementalFileMergerInputs.load(LazyIncrementalFileMergerInputs.java:88) at com.android.builder.merge.LazyIncrementalFileMergerInputs.lambda$fromNew$0(LazyIncrementalFileMergerInputs.java:59) at com.android.tools.build.apkzlib.utils.CachedSupplier.get(CachedSupplier.java:72) at com.android.builder.merge.LazyIncrementalFileMergerInput.lambda$new$2(LazyIncrementalFileMergerInput.java:138) at com.android.tools.build.apkzlib.utils.CachedSupplier.get(CachedSupplier.java:72) at com.android.builder.merge.LazyIncrementalFileMergerInput.open(LazyIncrementalFileMergerInput.java:225) at com.android.builder.merge.DelegateIncrementalFileMergerInput.open(DelegateIncrementalFileMergerInput.java:49) at com.google.common.collect.ImmutableList.forEach(ImmutableList.java:406) at com.android.builder.merge.IncrementalFileMerger.merge(IncrementalFileMerger.java:73) at com.android.build.gradle.internal.transforms.MergeJavaResourcesTransform.transform(MergeJavaResourcesTransform.java:411) at com.android.build.gradle.internal.pipeline.TransformTask$2.call(TransformTask.java:239) at com.android.build.gradle.internal.pipeline.TransformTask$2.call(TransformTask.java:235) at com.android.builder.profile.ThreadRecorder.record(ThreadRecorder.java:102) at com.android.build.gradle.internal.pipeline.TransformTask.transform(TransformTask.java:230) at sun.reflect.NativeMethodAccessorImpl.invoke0(Native Method) at sun.reflect.NativeMethodAccessorImpl.invoke(NativeMethodAccessorImpl.java:62) at sun.reflect.DelegatingMethodAccessorImpl.invoke(DelegatingMethodAccessorImpl.java:43) at java.lang.reflect.Method.invoke(Method.java:498) at org.gradle.internal.reflect.JavaMethod.invoke(JavaMethod.java:73) at org.gradle.api.internal.project.taskfactory.IncrementalTaskAction.doExecute(IncrementalTaskAction.java:50) at org.gradle.api.internal.project.taskfactory.StandardTaskAction.execute(StandardTaskAction.java:39) at org.gradle.api.internal.project.taskfactory.StandardTaskAction.execute(StandardTaskAction.java:26) at org.gradle.api.internal.tasks.execution.ExecuteActionsTaskExecuter$1.run(ExecuteActionsTaskExecuter.java:124) at org.gradle.internal.progress.DefaultBuildOperationExecutor$RunnableBuildOperationWorker.execute(DefaultBuildOperationExecutor.java:336) at org.gradle.internal.progress.DefaultBuildOperationExecutor$RunnableBuildOperationWorker.execute(DefaultBuildOperationExecutor.java:328) at org.gradle.internal.progress.DefaultBuildOperationExecutor.execute(DefaultBuildOperationExecutor.java:199) at org.gradle.internal.progress.DefaultBuildOperationExecutor.run(DefaultBuildOperationExecutor.java:110) at org.gradle.api.internal.tasks.execution.ExecuteActionsTaskExecuter.executeAction(ExecuteActionsTaskExecuter.java:113) at org.gradle.api.internal.tasks.execution.ExecuteActionsTaskExecuter.executeActions(ExecuteActionsTaskExecuter.java:95) ... 33 more Caused by: java.nio.file.AccessDeniedException: C:\WINDOWS\Temp at sun.nio.fs.WindowsException.translateToIOException(WindowsException.java:83) at sun.nio.fs.WindowsException.rethrowAsIOException(WindowsException.java:97) at sun.nio.fs.WindowsException.rethrowAsIOException(WindowsException.java:102) at sun.nio.fs.WindowsDirectoryStream.<init>(WindowsDirectoryStream.java:86) at sun.nio.fs.WindowsFileSystemProvider.newDirectoryStream(WindowsFileSystemProvider.java:518) at java.nio.file.Files.newDirectoryStream(Files.java:457) at com.google.common.io.MoreFiles.deleteRecursively(MoreFiles.java:516) at com.android.tools.build.apkzlib.bytestorage.TemporaryFile.deleteFile(TemporaryFile.java:57) at com.android.tools.build.apkzlib.bytestorage.TemporaryFile.close(TemporaryFile.java:48) at com.android.tools.build.apkzlib.bytestorage.TemporaryDirectory$1.close(TemporaryDirectory.java:50) at com.android.tools.build.apkzlib.bytestorage.TemporaryDirectoryStorage.close(TemporaryDirectoryStorage.java:101) at com.android.tools.build.apkzlib.bytestorage.OverflowToDiskByteStorage.close(OverflowToDiskByteStorage.java:167) at com.android.tools.build.apkzlib.bytestorage.ChunkBasedByteStorage.close(ChunkBasedByteStorage.java:142) at com.android.tools.build.apkzlib.zip.ZFile.close(ZFile.java:1210) at com.android.builder.files.RelativeFiles.fromZip(RelativeFiles.java:125) at com.android.builder.merge.LazyIncrementalFileMergerInputs.load(LazyIncrementalFileMergerInputs.java:86) ... 61 more
Android studio 报错 invalid LOC header (bad signature) ,log在下面付上
问题标签:Android studio 报错 invalid LOC header (bad signature) 无法正常运行project,已经重装过软件还是报一样的错误。希望有人帮忙看一下。 ``` org.gradle.api.ProjectConfigurationException: A problem occurred configuring project ':app'. at org.gradle.configuration.project.LifecycleProjectEvaluator.addConfigurationFailure(LifecycleProjectEvaluator.java:94) at org.gradle.configuration.project.LifecycleProjectEvaluator.doConfigure(LifecycleProjectEvaluator.java:66) at org.gradle.configuration.project.LifecycleProjectEvaluator.access$100(LifecycleProjectEvaluator.java:34) at org.gradle.configuration.project.LifecycleProjectEvaluator$ConfigureProject.run(LifecycleProjectEvaluator.java:110) at org.gradle.internal.progress.DefaultBuildOperationExecutor$RunnableBuildOperationWorker.execute(DefaultBuildOperationExecutor.java:336) at org.gradle.internal.progress.DefaultBuildOperationExecutor$RunnableBuildOperationWorker.execute(DefaultBuildOperationExecutor.java:328) at org.gradle.internal.progress.DefaultBuildOperationExecutor.execute(DefaultBuildOperationExecutor.java:199) at org.gradle.internal.progress.DefaultBuildOperationExecutor.run(DefaultBuildOperationExecutor.java:110) at org.gradle.configuration.project.LifecycleProjectEvaluator.evaluate(LifecycleProjectEvaluator.java:50) at org.gradle.api.internal.project.DefaultProject.evaluate(DefaultProject.java:667) at org.gradle.api.internal.project.DefaultProject.evaluate(DefaultProject.java:136) at org.gradle.execution.TaskPathProjectEvaluator.configure(TaskPathProjectEvaluator.java:35) at org.gradle.execution.TaskPathProjectEvaluator.configureHierarchy(TaskPathProjectEvaluator.java:62) at org.gradle.configuration.DefaultBuildConfigurer.configure(DefaultBuildConfigurer.java:38) at org.gradle.initialization.DefaultGradleLauncher$ConfigureBuild.run(DefaultGradleLauncher.java:261) at org.gradle.internal.progress.DefaultBuildOperationExecutor$RunnableBuildOperationWorker.execute(DefaultBuildOperationExecutor.java:336) at org.gradle.internal.progress.DefaultBuildOperationExecutor$RunnableBuildOperationWorker.execute(DefaultBuildOperationExecutor.java:328) at org.gradle.internal.progress.DefaultBuildOperationExecutor.execute(DefaultBuildOperationExecutor.java:199) at org.gradle.internal.progress.DefaultBuildOperationExecutor.run(DefaultBuildOperationExecutor.java:110) at org.gradle.initialization.DefaultGradleLauncher.configureBuild(DefaultGradleLauncher.java:173) at org.gradle.initialization.DefaultGradleLauncher.doBuildStages(DefaultGradleLauncher.java:132) at org.gradle.initialization.DefaultGradleLauncher.executeTasks(DefaultGradleLauncher.java:115) at org.gradle.internal.invocation.GradleBuildController$1.call(GradleBuildController.java:78) at org.gradle.internal.invocation.GradleBuildController$1.call(GradleBuildController.java:75) at org.gradle.internal.work.DefaultWorkerLeaseService.withLocks(DefaultWorkerLeaseService.java:152) at org.gradle.internal.invocation.GradleBuildController.doBuild(GradleBuildController.java:100) at org.gradle.internal.invocation.GradleBuildController.run(GradleBuildController.java:75) at org.gradle.tooling.internal.provider.runner.BuildModelActionRunner.run(BuildModelActionRunner.java:53) at org.gradle.launcher.exec.ChainingBuildActionRunner.run(ChainingBuildActionRunner.java:35) at org.gradle.launcher.exec.ChainingBuildActionRunner.run(ChainingBuildActionRunner.java:35) at org.gradle.tooling.internal.provider.ValidatingBuildActionRunner.run(ValidatingBuildActionRunner.java:32) at org.gradle.launcher.exec.RunAsBuildOperationBuildActionRunner$1.run(RunAsBuildOperationBuildActionRunner.java:43) at org.gradle.internal.progress.DefaultBuildOperationExecutor$RunnableBuildOperationWorker.execute(DefaultBuildOperationExecutor.java:336) at org.gradle.internal.progress.DefaultBuildOperationExecutor$RunnableBuildOperationWorker.execute(DefaultBuildOperationExecutor.java:328) at org.gradle.internal.progress.DefaultBuildOperationExecutor.execute(DefaultBuildOperationExecutor.java:199) at org.gradle.internal.progress.DefaultBuildOperationExecutor.run(DefaultBuildOperationExecutor.java:110) at org.gradle.launcher.exec.RunAsBuildOperationBuildActionRunner.run(RunAsBuildOperationBuildActionRunner.java:40) at org.gradle.tooling.internal.provider.SubscribableBuildActionRunner.run(SubscribableBuildActionRunner.java:51) at org.gradle.launcher.exec.InProcessBuildActionExecuter.execute(InProcessBuildActionExecuter.java:49) at org.gradle.launcher.exec.InProcessBuildActionExecuter.execute(InProcessBuildActionExecuter.java:32) at org.gradle.launcher.exec.BuildTreeScopeBuildActionExecuter.execute(BuildTreeScopeBuildActionExecuter.java:39) at org.gradle.launcher.exec.BuildTreeScopeBuildActionExecuter.execute(BuildTreeScopeBuildActionExecuter.java:25) at org.gradle.tooling.internal.provider.ContinuousBuildActionExecuter.execute(ContinuousBuildActionExecuter.java:80) at org.gradle.tooling.internal.provider.ContinuousBuildActionExecuter.execute(ContinuousBuildActionExecuter.java:53) at org.gradle.tooling.internal.provider.ServicesSetupBuildActionExecuter.execute(ServicesSetupBuildActionExecuter.java:57) at org.gradle.tooling.internal.provider.ServicesSetupBuildActionExecuter.execute(ServicesSetupBuildActionExecuter.java:32) at org.gradle.tooling.internal.provider.GradleThreadBuildActionExecuter.execute(GradleThreadBuildActionExecuter.java:36) at org.gradle.tooling.internal.provider.GradleThreadBuildActionExecuter.execute(GradleThreadBuildActionExecuter.java:25) at org.gradle.tooling.internal.provider.ParallelismConfigurationBuildActionExecuter.execute(ParallelismConfigurationBuildActionExecuter.java:43) at org.gradle.tooling.internal.provider.ParallelismConfigurationBuildActionExecuter.execute(ParallelismConfigurationBuildActionExecuter.java:29) at org.gradle.tooling.internal.provider.StartParamsValidatingActionExecuter.execute(StartParamsValidatingActionExecuter.java:64) at org.gradle.tooling.internal.provider.StartParamsValidatingActionExecuter.execute(StartParamsValidatingActionExecuter.java:29) at org.gradle.tooling.internal.provider.SessionFailureReportingActionExecuter.execute(SessionFailureReportingActionExecuter.java:59) at org.gradle.tooling.internal.provider.SessionFailureReportingActionExecuter.execute(SessionFailureReportingActionExecuter.java:44) at org.gradle.tooling.internal.provider.SetupLoggingActionExecuter.execute(SetupLoggingActionExecuter.java:45) at org.gradle.tooling.internal.provider.SetupLoggingActionExecuter.execute(SetupLoggingActionExecuter.java:30) at org.gradle.launcher.daemon.server.exec.ExecuteBuild.doBuild(ExecuteBuild.java:67) at org.gradle.launcher.daemon.server.exec.BuildCommandOnly.execute(BuildCommandOnly.java:36) at org.gradle.launcher.daemon.server.api.DaemonCommandExecution.proceed(DaemonCommandExecution.java:122) at org.gradle.launcher.daemon.server.exec.WatchForDisconnection.execute(WatchForDisconnection.java:37) at org.gradle.launcher.daemon.server.api.DaemonCommandExecution.proceed(DaemonCommandExecution.java:122) at org.gradle.launcher.daemon.server.exec.ResetDeprecationLogger.execute(ResetDeprecationLogger.java:26) at org.gradle.launcher.daemon.server.api.DaemonCommandExecution.proceed(DaemonCommandExecution.java:122) at org.gradle.launcher.daemon.server.exec.RequestStopIfSingleUsedDaemon.execute(RequestStopIfSingleUsedDaemon.java:34) at org.gradle.launcher.daemon.server.api.DaemonCommandExecution.proceed(DaemonCommandExecution.java:122) at org.gradle.launcher.daemon.server.exec.ForwardClientInput$2.call(ForwardClientInput.java:74) at org.gradle.launcher.daemon.server.exec.ForwardClientInput$2.call(ForwardClientInput.java:72) at org.gradle.util.Swapper.swap(Swapper.java:38) at org.gradle.launcher.daemon.server.exec.ForwardClientInput.execute(ForwardClientInput.java:72) at org.gradle.launcher.daemon.server.api.DaemonCommandExecution.proceed(DaemonCommandExecution.java:122) at org.gradle.launcher.daemon.server.exec.LogAndCheckHealth.execute(LogAndCheckHealth.java:55) at org.gradle.launcher.daemon.server.api.DaemonCommandExecution.proceed(DaemonCommandExecution.java:122) at org.gradle.launcher.daemon.server.exec.LogToClient.doBuild(LogToClient.java:62) at org.gradle.launcher.daemon.server.exec.BuildCommandOnly.execute(BuildCommandOnly.java:36) at org.gradle.launcher.daemon.server.api.DaemonCommandExecution.proceed(DaemonCommandExecution.java:122) at org.gradle.launcher.daemon.server.exec.EstablishBuildEnvironment.doBuild(EstablishBuildEnvironment.java:82) at org.gradle.launcher.daemon.server.exec.BuildCommandOnly.execute(BuildCommandOnly.java:36) at org.gradle.launcher.daemon.server.api.DaemonCommandExecution.proceed(DaemonCommandExecution.java:122) at org.gradle.launcher.daemon.server.exec.StartBuildOrRespondWithBusy$1.run(StartBuildOrRespondWithBusy.java:50) at org.gradle.launcher.daemon.server.DaemonStateCoordinator$1.run(DaemonStateCoordinator.java:295) at org.gradle.internal.concurrent.ExecutorPolicy$CatchAndRecordFailures.onExecute(ExecutorPolicy.java:63) at org.gradle.internal.concurrent.ManagedExecutorImpl$1.run(ManagedExecutorImpl.java:46) at java.util.concurrent.ThreadPoolExecutor.runWorker(ThreadPoolExecutor.java:1142) at java.util.concurrent.ThreadPoolExecutor$Worker.run(ThreadPoolExecutor.java:617) at org.gradle.internal.concurrent.ThreadFactoryImpl$ManagedThreadRunnable.run(ThreadFactoryImpl.java:55) at java.lang.Thread.run(Thread.java:745) Caused by: org.gradle.api.GradleScriptException: A problem occurred evaluating project ':app'. at org.gradle.groovy.scripts.internal.DefaultScriptRunnerFactory$ScriptRunnerImpl.run(DefaultScriptRunnerFactory.java:92) at org.gradle.configuration.DefaultScriptPluginFactory$ScriptPluginImpl$2.run(DefaultScriptPluginFactory.java:204) at org.gradle.configuration.ProjectScriptTarget.addConfiguration(ProjectScriptTarget.java:77) at org.gradle.configuration.DefaultScriptPluginFactory$ScriptPluginImpl.apply(DefaultScriptPluginFactory.java:209) at org.gradle.configuration.BuildOperationScriptPlugin$1.run(BuildOperationScriptPlugin.java:61) at org.gradle.internal.progress.DefaultBuildOperationExecutor$RunnableBuildOperationWorker.execute(DefaultBuildOperationExecutor.java:336) at org.gradle.internal.progress.DefaultBuildOperationExecutor$RunnableBuildOperationWorker.execute(DefaultBuildOperationExecutor.java:328) at org.gradle.internal.progress.DefaultBuildOperationExecutor.execute(DefaultBuildOperationExecutor.java:199) at org.gradle.internal.progress.DefaultBuildOperationExecutor.run(DefaultBuildOperationExecutor.java:110) at org.gradle.configuration.BuildOperationScriptPlugin.apply(BuildOperationScriptPlugin.java:58) at org.gradle.configuration.project.BuildScriptProcessor.execute(BuildScriptProcessor.java:41) at org.gradle.configuration.project.BuildScriptProcessor.execute(BuildScriptProcessor.java:26) at org.gradle.configuration.project.ConfigureActionsProjectEvaluator.evaluate(ConfigureActionsProjectEvaluator.java:34) at org.gradle.configuration.project.LifecycleProjectEvaluator.doConfigure(LifecycleProjectEvaluator.java:64) ... 84 more Caused by: org.gradle.api.internal.plugins.PluginApplicationException: Failed to apply plugin [id 'com.android.application'] at org.gradle.api.internal.plugins.DefaultPluginManager.doApply(DefaultPluginManager.java:150) at org.gradle.api.internal.plugins.DefaultPluginManager.apply(DefaultPluginManager.java:125) at org.gradle.api.internal.plugins.DefaultObjectConfigurationAction.applyType(DefaultObjectConfigurationAction.java:120) at org.gradle.api.internal.plugins.DefaultObjectConfigurationAction.access$200(DefaultObjectConfigurationAction.java:38) at org.gradle.api.internal.plugins.DefaultObjectConfigurationAction$3.run(DefaultObjectConfigurationAction.java:86) at org.gradle.api.internal.plugins.DefaultObjectConfigurationAction.execute(DefaultObjectConfigurationAction.java:143) at org.gradle.api.internal.project.AbstractPluginAware.apply(AbstractPluginAware.java:46) at org.gradle.api.internal.project.ProjectScript.apply(ProjectScript.java:34) at org.gradle.api.Script$apply.callCurrent(Unknown Source) at org.codehaus.groovy.runtime.callsite.CallSiteArray.defaultCallCurrent(CallSiteArray.java:52) at org.codehaus.groovy.runtime.callsite.AbstractCallSite.callCurrent(AbstractCallSite.java:154) at org.codehaus.groovy.runtime.callsite.AbstractCallSite.callCurrent(AbstractCallSite.java:166) at build_3sb4n9m0613adoejgct7nhgyt.run(C:\Users\XSM\AndroidStudioProjects\MyApplication7\app\build.gradle:1) at org.gradle.groovy.scripts.internal.DefaultScriptRunnerFactory$ScriptRunnerImpl.run(DefaultScriptRunnerFactory.java:90) ... 97 more Caused by: org.gradle.api.plugins.PluginInstantiationException: Could not create plugin of type 'AppPlugin'. at org.gradle.api.internal.plugins.DefaultPluginManager.instantiatePlugin(DefaultPluginManager.java:74) at org.gradle.api.internal.plugins.DefaultPluginManager.producePluginInstance(DefaultPluginManager.java:183) at org.gradle.api.internal.plugins.DefaultPluginManager.addPlugin(DefaultPluginManager.java:159) at org.gradle.api.internal.plugins.DefaultPluginManager.access$200(DefaultPluginManager.java:47) at org.gradle.api.internal.plugins.DefaultPluginManager$AddPluginBuildOperation.run(DefaultPluginManager.java:252) at org.gradle.internal.progress.DefaultBuildOperationExecutor$RunnableBuildOperationWorker.execute(DefaultBuildOperationExecutor.java:336) at org.gradle.internal.progress.DefaultBuildOperationExecutor$RunnableBuildOperationWorker.execute(DefaultBuildOperationExecutor.java:328) at org.gradle.internal.progress.DefaultBuildOperationExecutor.execute(DefaultBuildOperationExecutor.java:199) at org.gradle.internal.progress.DefaultBuildOperationExecutor.run(DefaultBuildOperationExecutor.java:110) at org.gradle.api.internal.plugins.DefaultPluginManager.doApply(DefaultPluginManager.java:144) ... 110 more Caused by: java.lang.NoClassDefFoundError: com/android/ide/common/blame/MessageReceiver at org.gradle.api.internal.DependencyInjectingInstantiator.selectConstructor(DependencyInjectingInstantiator.java:144) at org.gradle.api.internal.DependencyInjectingInstantiator.access$200(DependencyInjectingInstantiator.java:36) at org.gradle.api.internal.DependencyInjectingInstantiator$2.transform(DependencyInjectingInstantiator.java:67) at org.gradle.api.internal.DependencyInjectingInstantiator$2.transform(DependencyInjectingInstantiator.java:61) at org.gradle.cache.internal.CrossBuildInMemoryCacheFactory$DefaultCrossBuildInMemoryCache.get(CrossBuildInMemoryCacheFactory.java:121) at org.gradle.api.internal.DependencyInjectingInstantiator.newInstance(DependencyInjectingInstantiator.java:61) at org.gradle.api.internal.plugins.DefaultPluginManager.instantiatePlugin(DefaultPluginManager.java:72) at org.gradle.api.internal.plugins.DefaultPluginManager.producePluginInstance(DefaultPluginManager.java:183) at org.gradle.api.internal.plugins.DefaultPluginManager.addPlugin(DefaultPluginManager.java:159) at org.gradle.api.internal.plugins.DefaultPluginManager.access$200(DefaultPluginManager.java:47) at org.gradle.api.internal.plugins.DefaultPluginManager$AddPluginBuildOperation.run(DefaultPluginManager.java:252) at org.gradle.internal.progress.DefaultBuildOperationExecutor$RunnableBuildOperationWorker.execute(DefaultBuildOperationExecutor.java:336) at org.gradle.internal.progress.DefaultBuildOperationExecutor$RunnableBuildOperationWorker.execute(DefaultBuildOperationExecutor.java:328) at org.gradle.internal.progress.DefaultBuildOperationExecutor.execute(DefaultBuildOperationExecutor.java:199) at org.gradle.internal.progress.DefaultBuildOperationExecutor.run(DefaultBuildOperationExecutor.java:110) at org.gradle.api.internal.plugins.DefaultPluginManager.doApply(DefaultPluginManager.java:144) at org.gradle.api.internal.plugins.DefaultPluginManager.apply(DefaultPluginManager.java:125) at org.gradle.api.internal.plugins.DefaultObjectConfigurationAction.applyType(DefaultObjectConfigurationAction.java:120) at org.gradle.api.internal.plugins.DefaultObjectConfigurationAction.access$200(DefaultObjectConfigurationAction.java:38) at org.gradle.api.internal.plugins.DefaultObjectConfigurationAction$3.run(DefaultObjectConfigurationAction.java:86) at org.gradle.api.internal.plugins.DefaultObjectConfigurationAction.execute(DefaultObjectConfigurationAction.java:143) at org.gradle.api.internal.project.AbstractPluginAware.apply(AbstractPluginAware.java:46) at org.gradle.api.internal.project.ProjectScript.apply(ProjectScript.java:34) at org.gradle.api.Script$apply.callCurrent(Unknown Source) at build_3sb4n9m0613adoejgct7nhgyt.run(C:\Users\XSM\AndroidStudioProjects\MyApplication7\app\build.gradle:1) at org.gradle.groovy.scripts.internal.DefaultScriptRunnerFactory$ScriptRunnerImpl.run(DefaultScriptRunnerFactory.java:90) at org.gradle.configuration.DefaultScriptPluginFactory$ScriptPluginImpl$2.run(DefaultScriptPluginFactory.java:204) at org.gradle.configuration.ProjectScriptTarget.addConfiguration(ProjectScriptTarget.java:77) at org.gradle.configuration.DefaultScriptPluginFactory$ScriptPluginImpl.apply(DefaultScriptPluginFactory.java:209) at org.gradle.configuration.BuildOperationScriptPlugin$1.run(BuildOperationScriptPlugin.java:61) at org.gradle.internal.progress.DefaultBuildOperationExecutor$RunnableBuildOperationWorker.execute(DefaultBuildOperationExecutor.java:336) at org.gradle.internal.progress.DefaultBuildOperationExecutor$RunnableBuildOperationWorker.execute(DefaultBuildOperationExecutor.java:328) at org.gradle.internal.progress.DefaultBuildOperationExecutor.execute(DefaultBuildOperationExecutor.java:199) at org.gradle.internal.progress.DefaultBuildOperationExecutor.run(DefaultBuildOperationExecutor.java:110) at org.gradle.configuration.BuildOperationScriptPlugin.apply(BuildOperationScriptPlugin.java:58) at org.gradle.configuration.project.BuildScriptProcessor.execute(BuildScriptProcessor.java:41) at org.gradle.configuration.project.BuildScriptProcessor.execute(BuildScriptProcessor.java:26) at org.gradle.configuration.project.ConfigureActionsProjectEvaluator.evaluate(ConfigureActionsProjectEvaluator.java:34) at org.gradle.configuration.project.LifecycleProjectEvaluator.doConfigure(LifecycleProjectEvaluator.java:64) at org.gradle.configuration.project.LifecycleProjectEvaluator.access$100(LifecycleProjectEvaluator.java:34) at org.gradle.configuration.project.LifecycleProjectEvaluator$ConfigureProject.run(LifecycleProjectEvaluator.java:110) at org.gradle.internal.progress.DefaultBuildOperationExecutor$RunnableBuildOperationWorker.execute(DefaultBuildOperationExecutor.java:336) at org.gradle.internal.progress.DefaultBuildOperationExecutor$RunnableBuildOperationWorker.execute(DefaultBuildOperationExecutor.java:328) at org.gradle.internal.progress.DefaultBuildOperationExecutor.execute(DefaultBuildOperationExecutor.java:199) at org.gradle.internal.progress.DefaultBuildOperationExecutor.run(DefaultBuildOperationExecutor.java:110) at org.gradle.configuration.project.LifecycleProjectEvaluator.evaluate(LifecycleProjectEvaluator.java:50) at org.gradle.api.internal.project.DefaultProject.evaluate(DefaultProject.java:667) at org.gradle.api.internal.project.DefaultProject.evaluate(DefaultProject.java:136) at org.gradle.execution.TaskPathProjectEvaluator.configure(TaskPathProjectEvaluator.java:35) at org.gradle.execution.TaskPathProjectEvaluator.configureHierarchy(TaskPathProjectEvaluator.java:62) at org.gradle.configuration.DefaultBuildConfigurer.configure(DefaultBuildConfigurer.java:38) at org.gradle.initialization.DefaultGradleLauncher$ConfigureBuild.run(DefaultGradleLauncher.java:261) at org.gradle.internal.progress.DefaultBuildOperationExecutor$RunnableBuildOperationWorker.execute(DefaultBuildOperationExecutor.java:336) at org.gradle.internal.progress.DefaultBuildOperationExecutor$RunnableBuildOperationWorker.execute(DefaultBuildOperationExecutor.java:328) at org.gradle.internal.progress.DefaultBuildOperationExecutor.execute(DefaultBuildOperationExecutor.java:199) at org.gradle.internal.progress.DefaultBuildOperationExecutor.run(DefaultBuildOperationExecutor.java:110) at org.gradle.initialization.DefaultGradleLauncher.configureBuild(DefaultGradleLauncher.java:173) at org.gradle.initialization.DefaultGradleLauncher.doBuildStages(DefaultGradleLauncher.java:132) at org.gradle.initialization.DefaultGradleLauncher.getConfiguredBuild(DefaultGradleLauncher.java:110) at org.gradle.internal.invocation.GradleBuildController$2.call(GradleBuildController.java:87) at org.gradle.internal.invocation.GradleBuildController$2.call(GradleBuildController.java:84) at org.gradle.internal.work.DefaultWorkerLeaseService.withLocks(DefaultWorkerLeaseService.java:152) at org.gradle.internal.invocation.GradleBuildController.doBuild(GradleBuildController.java:100) at org.gradle.internal.invocation.GradleBuildController.configure(GradleBuildController.java:84) at org.gradle.tooling.internal.provider.runner.ClientProvidedBuildActionRunner.run(ClientProvidedBuildActionRunner.java:64) at org.gradle.launcher.exec.ChainingBuildActionRunner.run(ChainingBuildActionRunner.java:35) at org.gradle.launcher.exec.ChainingBuildActionRunner.run(ChainingBuildActionRunner.java:35) at org.gradle.tooling.internal.provider.ValidatingBuildActionRunner.run(ValidatingBuildActionRunner.java:32) at org.gradle.launcher.exec.RunAsBuildOperationBuildActionRunner$1.run(RunAsBuildOperationBuildActionRunner.java:43) at org.gradle.internal.progress.DefaultBuildOperationExecutor$RunnableBuildOperationWorker.execute(DefaultBuildOperationExecutor.java:336) at org.gradle.internal.progress.DefaultBuildOperationExecutor$RunnableBuildOperationWorker.execute(DefaultBuildOperationExecutor.java:328) at org.gradle.internal.progress.DefaultBuildOperationExecutor.execute(DefaultBuildOperationExecutor.java:199) at org.gradle.internal.progress.DefaultBuildOperationExecutor.run(DefaultBuildOperationExecutor.java:110) at org.gradle.launcher.exec.RunAsBuildOperationBuildActionRunner.run(RunAsBuildOperationBuildActionRunner.java:40) at org.gradle.tooling.internal.provider.SubscribableBuildActionRunner.run(SubscribableBuildActionRunner.java:51) at org.gradle.launcher.exec.InProcessBuildActionExecuter.execute(InProcessBuildActionExecuter.java:49) at org.gradle.launcher.exec.InProcessBuildActionExecuter.execute(InProcessBuildActionExecuter.java:32) at org.gradle.launcher.exec.BuildTreeScopeBuildActionExecuter.execute(BuildTreeScopeBuildActionExecuter.java:39) at org.gradle.launcher.exec.BuildTreeScopeBuildActionExecuter.execute(BuildTreeScopeBuildActionExecuter.java:25) at org.gradle.tooling.internal.provider.ContinuousBuildActionExecuter.execute(ContinuousBuildActionExecuter.java:80) at org.gradle.tooling.internal.provider.ContinuousBuildActionExecuter.execute(ContinuousBuildActionExecuter.java:53) at org.gradle.tooling.internal.provider.ServicesSetupBuildActionExecuter.execute(ServicesSetupBuildActionExecuter.java:57) at org.gradle.tooling.internal.provider.ServicesSetupBuildActionExecuter.execute(ServicesSetupBuildActionExecuter.java:32) at org.gradle.tooling.internal.provider.GradleThreadBuildActionExecuter.execute(GradleThreadBuildActionExecuter.java:36) at org.gradle.tooling.internal.provider.GradleThreadBuildActionExecuter.execute(GradleThreadBuildActionExecuter.java:25) at org.gradle.tooling.internal.provider.ParallelismConfigurationBuildActionExecuter.execute(ParallelismConfigurationBuildActionExecuter.java:43) at org.gradle.tooling.internal.provider.ParallelismConfigurationBuildActionExecuter.execute(ParallelismConfigurationBuildActionExecuter.java:29) at org.gradle.tooling.internal.provider.StartParamsValidatingActionExecuter.execute(StartParamsValidatingActionExecuter.java:64) at org.gradle.tooling.internal.provider.StartParamsValidatingActionExecuter.execute(StartParamsValidatingActionExecuter.java:29) at org.gradle.tooling.internal.provider.SessionFailureReportingActionExecuter.execute(SessionFailureReportingActionExecuter.java:59) at org.gradle.tooling.internal.provider.SessionFailureReportingActionExecuter.execute(SessionFailureReportingActionExecuter.java:44) at org.gradle.tooling.internal.provider.SetupLoggingActionExecuter.execute(SetupLoggingActionExecuter.java:45) at org.gradle.tooling.internal.provider.SetupLoggingActionExecuter.execute(SetupLoggingActionExecuter.java:30) at org.gradle.launcher.daemon.server.exec.ExecuteBuild.doBuild(ExecuteBuild.java:67) at org.gradle.launcher.daemon.server.exec.BuildCommandOnly.execute(BuildCommandOnly.java:36) at org.gradle.launcher.daemon.server.api.DaemonCommandExecution.proceed(DaemonCommandExecution.java:122) at org.gradle.launcher.daemon.server.exec.WatchForDisconnection.execute(WatchForDisconnection.java:37) at org.gradle.launcher.daemon.server.api.DaemonCommandExecution.proceed(DaemonCommandExecution.java:122) at org.gradle.launcher.daemon.server.exec.ResetDeprecationLogger.execute(ResetDeprecationLogger.java:26) at org.gradle.launcher.daemon.server.api.DaemonCommandExecution.proceed(DaemonCommandExecution.java:122) at org.gradle.launcher.daemon.server.exec.RequestStopIfSingleUsedDaemon.execute(RequestStopIfSingleUsedDaemon.java:34) at org.gradle.launcher.daemon.server.api.DaemonCommandExecution.proceed(DaemonCommandExecution.java:122) at org.gradle.launcher.daemon.server.exec.ForwardClientInput$2.call(ForwardClientInput.java:74) at org.gradle.launcher.daemon.server.exec.ForwardClientInput$2.call(ForwardClientInput.java:72) at org.gradle.util.Swapper.swap(Swapper.java:38) at org.gradle.launcher.daemon.server.exec.ForwardClientInput.execute(ForwardClientInput.java:72) at org.gradle.launcher.daemon.server.api.DaemonCommandExecution.proceed(DaemonCommandExecution.java:122) at org.gradle.launcher.daemon.server.exec.LogAndCheckHealth.execute(LogAndCheckHealth.java:55) at org.gradle.launcher.daemon.server.api.DaemonCommandExecution.proceed(DaemonCommandExecution.java:122) at org.gradle.launcher.daemon.server.exec.LogToClient.doBuild(LogToClient.java:62) at org.gradle.launcher.daemon.server.exec.BuildCommandOnly.execute(BuildCommandOnly.java:36) at org.gradle.launcher.daemon.server.api.DaemonCommandExecution.proceed(DaemonCommandExecution.java:122) at org.gradle.launcher.daemon.server.exec.EstablishBuildEnvironment.doBuild(EstablishBuildEnvironment.java:82) at org.gradle.launcher.daemon.server.exec.BuildCommandOnly.execute(BuildCommandOnly.java:36) at org.gradle.launcher.daemon.server.api.DaemonCommandExecution.proceed(DaemonCommandExecution.java:122) at org.gradle.launcher.daemon.server.exec.StartBuildOrRespondWithBusy$1.run(StartBuildOrRespondWithBusy.java:50) at org.gradle.launcher.daemon.server.DaemonStateCoordinator$1.run(DaemonStateCoordinator.java:295) at org.gradle.internal.concurrent.ExecutorPolicy$CatchAndRecordFailures.onExecute(ExecutorPolicy.java:63) at org.gradle.internal.concurrent.ManagedExecutorImpl$1.run(ManagedExecutorImpl.java:46) at org.gradle.internal.concurrent.ThreadFactoryImpl$ManagedThreadRunnable.run(ThreadFactoryImpl.java:55) Caused by: java.lang.ClassNotFoundException: com.android.ide.common.blame.MessageReceiver ... 120 more Caused by: java.util.zip.ZipException: invalid LOC header (bad signature) ... 120 more ``` build报告如上。希望有人帮忙看一下下。已查询,网上解决方法是在settings.grade中的app之前加’.‘但是没有作用。
130 个相见恨晚的超实用网站,一次性分享出来
相见恨晚的超实用网站 持续更新中。。。
终于明白阿里百度这样的大公司,为什么面试经常拿ThreadLocal考验求职者了
点击上面↑「爱开发」关注我们每晚10点,捕获技术思考和创业资源洞察什么是ThreadLocalThreadLocal是一个本地线程副本变量工具类,各个线程都拥有一份线程私...
win10系统安装教程(U盘PE+UEFI安装)
一、准备工作 u盘,电脑一台,win10原版镜像(msdn官网) 二、下载wepe工具箱 极力推荐微pe(微pe官方下载) 下载64位的win10 pe,使用工具箱制作启动U盘打开软件, 选择安装到U盘(按照操作无需更改) 三、重启进入pe系统 1、关机后,将U盘插入电脑 2、按下电源后,按住F12进入启动项选择(技嘉主板是F12) 选择需要启...
程序员必须掌握的核心算法有哪些?
由于我之前一直强调数据结构以及算法学习的重要性,所以就有一些读者经常问我,数据结构与算法应该要学习到哪个程度呢?,说实话,这个问题我不知道要怎么回答你,主要取决于你想学习到哪些程度,不过针对这个问题,我稍微总结一下我学过的算法知识点,以及我觉得值得学习的算法。这些算法与数据结构的学习大多数是零散的,并没有一本把他们全部覆盖的书籍。下面是我觉得值得学习的一些算法以及数据结构,当然,我也会整理一些看过...
大学四年自学走来,这些私藏的实用工具/学习网站我贡献出来了
大学四年,看课本是不可能一直看课本的了,对于学习,特别是自学,善于搜索网上的一些资源来辅助,还是非常有必要的,下面我就把这几年私藏的各种资源,网站贡献出来给你们。主要有:电子书搜索、实用工具、在线视频学习网站、非视频学习网站、软件下载、面试/求职必备网站。 注意:文中提到的所有资源,文末我都给你整理好了,你们只管拿去,如果觉得不错,转发、分享就是最大的支持了。 一、电子书搜索 对于大部分程序员...
C语言魔塔游戏
很早就很想写这个,今天终于写完了。 游戏截图: 编译环境: VS2017 游戏需要一些图片,如果有想要的或者对游戏有什么看法的可以加我的QQ 2985486630 讨论,如果暂时没有回应,可以在博客下方留言,到时候我会看到。 下面我来介绍一下游戏的主要功能和实现方式 首先是玩家的定义,使用结构体,这个名字是可以自己改变的 struct gamerole { char n...
java源码分析 Arrays.asList()与Collections.unmodifiableList()
ArrayList支持所有的可选操作(因为一个UnsupportedOperationException异常都没有捕获到),所以要想拥有完备的功能,还是得使用ArrayList啊。 Arrays$ArrayList除了set()操作外,都不支持。 Collections$UnmodifiableRandomAccessList都不支持,名副其实的Unmodifiable不可修改。
究竟你适不适合买Mac?
我清晰的记得,刚买的macbook pro回到家,开机后第一件事情,就是上了淘宝网,花了500元钱,找了一个上门维修电脑的师傅,上门给我装了一个windows系统。。。。。。 表砍我。。。 当时买mac的初衷,只是想要个固态硬盘的笔记本,用来运行一些复杂的扑克软件。而看了当时所有的SSD笔记本后,最终决定,还是买个好(xiong)看(da)的。 已经有好几个朋友问我mba怎么样了,所以今天尽量客观...
Python爬虫爬取淘宝,京东商品信息
小编是一个理科生,不善长说一些废话。简单介绍下原理然后直接上代码。 使用的工具(Python+pycharm2019.3+selenium+xpath+chromedriver)其中要使用pycharm也可以私聊我selenium是一个框架可以通过pip下载 pip installselenium -ihttps://pypi.tuna.tsinghua.edu.cn/simple/ ...
Java学习笔记(七十二)—— Cookie
概述 会话技术: 会话:一次会话中包含多次请求和响应 一次会话:浏览器第一次给服务器发送资源请求,会话建立,直到有一方断开为止 功能:在一次会话的范围内的多次请求间,共享数据 方式: 客户端会话技术:Cookie,把数据存储到客户端 服务器端会话技术:Session,把数据存储到服务器端 Cookie 概念:客户端会话技术,将数据存储到客户端 快速入门: 使用步骤: 创建C...
程序员写了一个新手都写不出的低级bug,被骂惨了。
这种新手都不会范的错,居然被一个工作好几年的小伙子写出来,差点被当场开除了。
Java工作4年来应聘要16K最后没要,细节如下。。。
前奏: 今天2B哥和大家分享一位前几天面试的一位应聘者,工作4年26岁,统招本科。 以下就是他的简历和面试情况。 基本情况: 专业技能: 1、&nbsp;熟悉Sping了解SpringMVC、SpringBoot、Mybatis等框架、了解SpringCloud微服务 2、&nbsp;熟悉常用项目管理工具:SVN、GIT、MAVEN、Jenkins 3、&nbsp;熟悉Nginx、tomca...
2020年,冯唐49岁:我给20、30岁IT职场年轻人的建议
点击“技术领导力”关注∆每天早上8:30推送 作者|Mr.K 编辑| Emma 来源|技术领导力(ID:jishulingdaoli) 前天的推文《冯唐:职场人35岁以后,方法论比经验重要》,收到了不少读者的反馈,觉得挺受启发。其实,冯唐写了不少关于职场方面的文章,都挺不错的。可惜大家只记住了“春风十里不如你”、“如何避免成为油腻腻的中年人”等不那么正经的文章。 本文整理了冯...
程序员该看的几部电影
1、骇客帝国(1999) 概念:在线/离线,递归,循环,矩阵等 剧情简介: 不久的将来,网络黑客尼奥对这个看似正常的现实世界产生了怀疑。 他结识了黑客崔妮蒂,并见到了黑客组织的首领墨菲斯。 墨菲斯告诉他,现实世界其实是由一个名叫“母体”的计算机人工智能系统控制,人们就像他们饲养的动物,没有自由和思想,而尼奥就是能够拯救人类的救世主。 可是,救赎之路从来都不会一帆风顺,到底哪里才是真实的世界?如何...
蓝桥杯知识点汇总:基础知识和常用算法
文章目录基础语法部分:算法竞赛常用API:算法部分数据结构部分 此系列包含蓝桥杯绝大部分所考察的知识点,以及真题题解~ 基础语法部分: 备战蓝桥杯java(一):一般输入输出 和 快速输入输(BufferedReader&amp;BufferedWrite) 备战蓝桥杯java(二):java编程规范和常用数据类型 备战蓝桥杯java(三):常用功能符以及循环结构和分支结构 备战蓝桥杯java(四...
作为一个程序员,CPU的这些硬核知识你必须会!
CPU对每个程序员来说,是个既熟悉又陌生的东西? 如果你只知道CPU是中央处理器的话,那可能对你并没有什么用,那么作为程序员的我们,必须要搞懂的就是CPU这家伙是如何运行的,尤其要搞懂它里面的寄存器是怎么一回事,因为这将让你从底层明白程序的运行机制。 随我一起,来好好认识下CPU这货吧 把CPU掰开来看 对于CPU来说,我们首先就要搞明白它是怎么回事,也就是它的内部构造,当然,CPU那么牛的一个东...
破14亿,Python分析我国存在哪些人口危机!
一、背景 二、爬取数据 三、数据分析 1、总人口 2、男女人口比例 3、人口城镇化 4、人口增长率 5、人口老化(抚养比) 6、各省人口 7、世界人口 四、遇到的问题 遇到的问题 1、数据分页,需要获取从1949-2018年数据,观察到有近20年参数:LAST20,由此推测获取近70年的参数可设置为:LAST70 2、2019年数据没有放上去,可以手动添加上去 3、将数据进行 行列转换 4、列名...
实现简单的轮播图(单张图片、多张图片)
前言 刚学js没多久,这篇博客就当做记录了,以后还会完善的,希望大佬们多多指点。ps:下面出现的都是直接闪动,没有滑动效果的轮播图。 单张图片的替换 · ...
强烈推荐10本程序员在家读的书
很遗憾,这个春节注定是刻骨铭心的,新型冠状病毒让每个人的神经都是紧绷的。那些处在武汉的白衣天使们,尤其值得我们的尊敬。而我们这些窝在家里的程序员,能不外出就不外出,就是对社会做出的最大的贡献。 有些读者私下问我,窝了几天,有点颓丧,能否推荐几本书在家里看看。我花了一天的时间,挑选了 10 本我最喜欢的书,你可以挑选感兴趣的来读一读。读书不仅可以平复恐惧的压力,还可以对未来充满希望,毕竟苦难终将会...
Linux自学篇——linux命令英文全称及解释
man: Manual 意思是手册,可以用这个命令查询其他命令的用法。 pwd:Print working directory 意思是密码。 su:Swith user 切换用户,切换到root用户 cd:Change directory 切换目录 ls:List files 列出目录下的文件 ps:Process Status 进程状态 mkdir:Make directory ...
Python实战:抓肺炎疫情实时数据,画2019-nCoV疫情地图
今天,群里白垩老师问如何用python画武汉肺炎疫情地图。白垩老师是研究海洋生态与地球生物的学者,国家重点实验室成员,于不惑之年学习python,实为我等学习楷模。先前我并没有关注武汉肺炎的具体数据,也没有画过类似的数据分布图。于是就拿了两个小时,专门研究了一下,遂成此文。
智力题(程序员面试经典)
NO.1  有20瓶药丸,其中19瓶装有1克/粒的药丸,余下一瓶装有1.1克/粒的药丸。给你一台称重精准的天平,怎么找出比较重的那瓶药丸?天平只能用一次。 解法 有时候,严格的限制条件有可能反倒是解题的线索。在这个问题中,限制条件是天平只能用一次。 因为天平只能用一次,我们也得以知道一个有趣的事实:一次必须同时称很多药丸,其实更准确地说,是必须从19瓶拿出药丸进行称重。否则,如果跳过两瓶或更多瓶药...
Java与Python学习通法(1)和(2)序言和编程语言发展史怎么学
dd
在家远程办公效率低?那你一定要收好这个「在家办公」神器!
相信大家都已经收到国务院延长春节假期的消息,接下来,在家远程办公可能将会持续一段时间。 但是问题来了。远程办公不是人在电脑前就当坐班了,相反,对于沟通效率,文件协作,以及信息安全都有着极高的要求。有着非常多的挑战,比如: 1在异地互相不见面的会议上,如何提高沟通效率? 2文件之间的来往反馈如何做到及时性?如何保证信息安全? 3如何规划安排每天工作,以及如何进行成果验收? ...... ...
作为一个程序员,内存和磁盘的这些事情,你不得不知道啊!!!
截止目前,我已经分享了如下几篇文章: 一个程序在计算机中是如何运行的?超级干货!!! 作为一个程序员,CPU的这些硬核知识你必须会! 作为一个程序员,内存的这些硬核知识你必须懂! 这些知识可以说是我们之前都不太重视的基础知识,可能大家在上大学的时候都学习过了,但是嘞,当时由于老师讲解的没那么有趣,又加上这些知识本身就比较枯燥,所以嘞,大家当初几乎等于没学。 再说啦,学习这些,也看不出来有什么用啊!...
阿里架构师花近十年时间整理出来的Java核心知识pdf(Java岗)
由于细节内容实在太多啦,所以只把部分知识点截图出来粗略的介绍,每个小节点里面都有更细化的内容! 整理了一份Java核心知识点。覆盖了JVM、锁、并发、Java反射、Spring原理、微服务、Zookeeper、数据库、数据结构等大量知识点。 欢迎大家加入java学习交流社区 点击加入 可获取文中文档 小编推荐: ...
Python基础知识点梳理
python常见知识点梳理 摘要: 本文主要介绍一些平时经常会用到的python基础知识点,用于加深印象。python的详细语法介绍可以查看官方编程手册,也有一些在线网站对python语法进行了比较全面的介绍,比如菜鸟教程: python3 教程|菜鸟教程 本文主要是介绍基础语法,操作实例在另一篇博客中单独介绍: python语言介绍 python是一门解释型语言,python的设计目标: 一门...
2020年2月全国程序员工资统计,平均工资13716元
趋势 2020年2月,中国大陆程序员平均工资13716员,比上个月增加。具体趋势如图: 各主要程序员城市工资变化 城市 北京,上海,深圳,杭州,广州四地的工资最高。 city 平均工资 最低工资 中位数 最高工资 招聘人数 百分比 北京 18098 3750 15000 45000 20529 9.53% 深圳 16903 5750 15000 37500 30941 1...
Java坑人面试题系列: 包装类(中级难度)
Java Magazine上面有一个专门坑人的面试题系列: https://blogs.oracle.com/javamagazine/quiz-2。 这些问题的设计宗旨,主要是测试面试者对Java语言的了解程度,而不是为了用弯弯绕绕的手段把面试者搞蒙。 如果你看过往期的问题,就会发现每一个都不简单。 这些试题模拟了认证考试中的一些难题。 而 “中级(intermediate)” 和 “高级(ad...
为什么说程序员做外包没前途?
之前做过不到3个月的外包,2020的第一天就被释放了,2019年还剩1天,我从外包公司离职了。我就谈谈我个人的看法吧。首先我们定义一下什么是有前途 稳定的工作环境 不错的收入 能够在项目中不断提升自己的技能(ps:非技术上的认知也算) 找下家的时候能找到一份工资更高的工作 如果你目前还年轻,但高不成低不就,只有外包offer,那请往下看。 外包公司你应该...
相关热词 c# 识别回车 c#生成条形码ean13 c#子控制器调用父控制器 c# 写大文件 c# 浏览pdf c#获取桌面图标的句柄 c# list反射 c# 句柄 进程 c# 倒计时 线程 c# 窗体背景色
立即提问