在caffe安装中 make 出错 怎么解决啊

caffe make 中出现错误

LD -o .build_release/lib/libcaffe-nv.so.0.17.2
/usr/bin/ld: 找不到 -lnvidia-ml
/usr/bin/ld: /usr/lib/x86_64-linux-gnu/libturbojpeg.a(libturbojpeg_la-turbojpeg.o): relocation R_X86_64_32 against `.data' can not be used when making a shared object; recompile with -fPIC
/usr/lib/x86_64-linux-gnu/libturbojpeg.a: 无法添加符号: 错误的值
collect2: error: ld returned 1 exit status
Makefile:601: recipe for target '.build_release/lib/libcaffe-nv.so.0.17.2' failed
make: *** [.build_release/lib/libcaffe-nv.so.0.17.2] Error 1

Csdn user default icon
上传中...
上传图片
插入图片
抄袭、复制答案,以达到刷声望分或其他目的的行为,在CSDN问答是严格禁止的,一经发现立刻封号。是时候展现真正的技术了!
其他相关推荐
服务器无root权限配置caffe安装snappy时make出错

根据教程https://blog.csdn.net/jiajinrang93/article/details/80337513,安装snappy进行make时报错,cmake版本为3.5.1.请问这要怎样解决?? ``` CMakeFiles/snappy_unittest.dir/snappy_unittest.cc.o:(.rodata._ZTIN6snappy31Snappy_ReadPastEndOfBuffer_TestE[_ZTIN6snappy31Snappy_ReadPastEndOfBuffer_TestE]+0x10): more undefined references to `typeinfo for testing::Test' follow collect2: error: ld returned 1 exit status CMakeFiles/snappy_unittest.dir/build.make:122: recipe for target 'snappy_unittest' failed make[2]: *** [snappy_unittest] Error 1 CMakeFiles/Makefile2:104: recipe for target 'CMakeFiles/snappy_unittest.dir/all' failed make[1]: *** [CMakeFiles/snappy_unittest.dir/all] Error 2 Makefile:138: recipe for target 'all' failed make: *** [all] Error 2 ```

caffe 配置 make、make test 通过,但是make runtest报错

* 我caffe是下载别人代码运行,里面涉及到caffe * 用cmake编译的caffe,make、make test都通过了,make runtest 报错 * 错误如下图 ![图片说明](https://img-ask.csdn.net/upload/201904/08/1554733603_888324.jpg)

编译caffe时make runtest出现7个错误,如图!求大神赐教!!

![图片说明](https://img-ask.csdn.net/upload/201602/28/1456655495_407014.png)

紧急求助!!ubuntu16.04 caffe make clean报错!!

我的系统ubuntu16.04,昨天make 了一下没马上清,今天开机在caffe根目录下水make clean 发现报错 rm:无法删除 ".build_release" : 不允许操作 makefile:660:recipe for target "clean" failed make:[clean] error 1 (ignored) rm:无法删除 "build ": 不允许操作 makefile:660:recipe for target "clean" failed make:[clean] error 1 (ignored) rm:无法删除 "distribute": 不允许操作 makefile:660:recipe for target "clean" failed make:[clean] error 1 (ignored) 我什么文件都没改呀!以前一直正常。 跪求各位大侠赐教!! 请问“输出目录”或“输出文件夹”在哪个位置,本人小白请楼下大侠指点,多谢!

caffe make 出错 boost重装了也没有用 求高手!支付宝发红包

sun@sunwin:/RMPE$ cp Makefile.config.example Makefile.config sun@sunwin:/RMPE$ sudo make all -j4 [sudo] sun 的密码: PROTOC src/caffe/proto/caffe.proto CXX src/caffe/blob.cpp CXX src/caffe/layer_factory.cpp CXX src/caffe/syncedmem.cpp CXX src/caffe/common.cpp CXX src/caffe/solvers/nesterov_solver.cpp In file included from /usr/local/include/boost/config.hpp:61:0, from /usr/local/include/boost/thread/detail/platform.hpp:14, from /usr/local/include/boost/thread/thread_only.hpp:12, from /usr/local/include/boost/thread/thread.hpp:12, from /usr/local/include/boost/thread.hpp:13, from src/caffe/common.cpp:1: /usr/local/include/boost/core/ignore_unused.hpp:17:19: error: ‘constexpr’ does not name a type BOOST_FORCEINLINE BOOST_CXX14_CONSTEXPR void ignore_unused(Ts const& ...) ^ /usr/local/include/boost/core/ignore_unused.hpp:17:19: note: C++11 ‘constexpr’ only available with -std=c++11 or -std=gnu++11 /usr/local/include/boost/core/ignore_unused.hpp:21:19: error: ‘constexpr’ does not name a type BOOST_FORCEINLINE BOOST_CXX14_CONSTEXPR void ignore_unused() ^ /usr/local/include/boost/core/ignore_unused.hpp:21:19: note: C++11 ‘constexpr’ only available with -std=c++11 or -std=gnu++11 In file included from /usr/local/include/boost/thread/mutex.hpp:16:0, from /usr/local/include/boost/thread/pthread/thread_data.hpp:13, from src/caffe/common.cpp:1: /usr/include/c++/5/bits/stl_pair.h:214:5: note: template argument deduction/substitution failed: In file included from /usr/local/include/boost/type_index/stl_type_index.hpp:22:0, from /usr/local/include/boost/type_index.hpp:29, from /usr/local/include/boost/function/function_base.hpp:21, from /usr/local/include/boost/function/detail/prologue.hpp:17, from /usr/local/include/boost/function/function_template.hpp:13, from /usr/local/include/boost/function/detail/maybe_include.hpp:13, from /usr/local/include/boost/function/function0.hpp:11, from /usr/local/include/boost/python/errors.hpp:13, from /usr/local/include/boost/python/handle.hpp:11, from /usr/local/include/boost/python/args_fwd.hpp:10, from /usr/local/include/boost/python/args.hpp:10, from /usr/local/include/boost/python.hpp:11, from src/caffe/layer_factory.cpp:4: /usr/local/include/boost/type_index/type_index_facade.hpp:191:25: note: ‘boost::typeindex::stl_type_index’ is not derived from ‘const std::pair<_T1, _T2>’ return Derived(lhs) == rhs; ^ src/caffe/layer_factory.cpp: In function ‘boost::shared_ptrcaffe::Layer<Dtype > caffe::GetTanHLayer(const caffe::LayerParameter&) [with Dtype = double]’: src/caffe/layer_factory.cpp:237:1: warning: control reaches end of non-void function [-Wreturn-type] } ^ src/caffe/layer_factory.cpp: In function ‘boost::shared_ptrcaffe::Layer<Dtype > caffe::GetTanHLayer(const caffe::LayerParameter&) [with Dtype = float]’: src/caffe/layer_factory.cpp: In function ‘boost::shared_ptrcaffe::Layer<Dtype > caffe::GetConvolutionLayer(const caffe::LayerParameter&) [with Dtype = double]’: src/caffe/layer_factory.cpp:71:1: warning: control reaches end of non-void function [-Wreturn-type] } ^ src/caffe/layer_factory.cpp: In function ‘boost::shared_ptrcaffe::Layer<Dtype > caffe::GetConvolutionLayer(const caffe::LayerParameter&) [with Dtype = float]’: src/caffe/layer_factory.cpp:71:1: warning: control reaches end of non-void function [-Wreturn-type] } ^ Makefile:575: recipe for target '.build_release/src/caffe/layer_factory.o' failed make: *** [.build_release/src/caffe/layer_factory.o] Error 1 Steps to reproduce If you are having difficulty building Caffe or training a model, please ask the caffe-users mailing list. If you are reporting a build error that seems to be due to a bug in Caffe, please attach your build configuration (either Makefile.config or CMakeCache.txt) and the output of the make (or cmake) command. MY system configuration Operating system: ubuntu16.04 CUDA version (if applicable):CUDA 8.0 CUDNN version (if applicable): CUDnn5.0 Python or MATLAB version (for pycaffe and matcaffe respectively):Python 2.7 MATLAB2014a 急求高手解决 ! 解决了支付宝直接发红包!

ubuntu14.04环境下安装配置caffe,最后编译caffe时出错

我按照http://www.linuxdiyf.com/linux/13008.html 这篇博客配置caffe,前面都没有问题, 但是到这一步之后 ![图片说明](https://img-ask.csdn.net/upload/201601/29/1454060895_988771.png), 出现了问题,问题如下 ![![图片说明](https://img-ask.csdn.net/upload/201601/29/1454060916_9479.png) ![图片说明](https://img-ask.csdn.net/upload/201601/29/1454060959_210537.png), 提示的是这个 make: *** [.build_release/src/caffe/layer_factory.o] 错误 1 make: *** 正在等待未完成的任务.... 我本人不太懂,请问怎么处理啊,急。。 谢谢各位

fast-rcnn在make test 出错

本人在虚拟机上装的fastr cnn cpu版本 在caffe-fast-rcnn 编译make test时出错 CXX src/caffe/test/test_smooth_L1_loss_layer.cpp (........) src/caffe/test/test_smooth_L1_loss_layer.cpp:72:1: note: in expansion of macro ‘TYPED_TEST’ TYPED_TEST(SmoothL1LossLayerTest, TestGradient) { ^ Makefile:563: recipe for target '.build_releasec/caffe/test/test_smooth_L1_loss_layer.o' failed make: *** [.build_releasec/caffe/test/test_smooth_L1_loss_layer.o] Error 1

ubuntu15.04安装caffe出现问题?

make 进行到最后一步 make runtest 出现问题,求助!!!命令行报错如下: ``` [----------] Global test environment tear-down [==========] 1887 tests from 255 test cases ran. (476334 ms total) [ PASSED ] 1880 tests. [ FAILED ] 7 tests, listed below: [ FAILED ] SGDSolverTest/0.TestSnapshotShare, where TypeParam = caffe::CPUDevice<float> [ FAILED ] AdaGradSolverTest/0.TestSnapshotShare, where TypeParam = caffe::CPUDevice<float> [ FAILED ] NesterovSolverTest/0.TestSnapshot, where TypeParam = caffe::CPUDevice<float> [ FAILED ] NesterovSolverTest/0.TestSnapshotShare, where TypeParam = caffe::CPUDevice<float> [ FAILED ] AdaDeltaSolverTest/0.TestSnapshotShare, where TypeParam = caffe::CPUDevice<float> [ FAILED ] AdamSolverTest/0.TestSnapshotShare, where TypeParam = caffe::CPUDevice<float> [ FAILED ] RMSPropSolverTest/0.TestSnapshotShare, where TypeParam = caffe::CPUDevice<float> 7 FAILED TESTS Makefile:523: recipe for target 'runtest' failed ```

安装caffe(cpu only)过程中最后一步make runtest时出现错,求助!!!

*** SIGABRT (@0x113c) received by PID 4412 (TID 0x7f64016a5b00) from PID 4412; stack trace: *** @ 0x7f63ffd094b0 (unknown) @ 0x7f63ffd09428 gsignal @ 0x7f63ffd0b02a abort @ 0x7f63ffd4b7ea (unknown) @ 0x7f63ffd53e0a (unknown) @ 0x7f63ffd5798c cfree @ 0x7f64008878af google::protobuf::internal::DestroyDefaultRepeatedFields() @ 0x7f6400886b3b google::protobuf::ShutdownProtobufLibrary() @ 0x7f63e98c6329 (unknown) @ 0x7f64015a2c17 (unknown) @ 0x7f63ffd0dff8 (unknown) @ 0x7f63ffd0e045 exit @ 0x7f63ffcf4837 __libc_start_main @ 0x4077c9 _start @ 0x0 (unknown) Makefile:532: recipe for target 'runtest' failed

Mac下配置好caffe后,其他路径make pycaffe 提示错误

Mac下配置好caffe后,在caffe/python目录下可以import caffe,但是换成别的路径执行make pycaffe就有如下提示:ImportError: No module named caffe 请问是我在配置过程中哪里出现问题了吗??求解答

linux安装opencv时make又出错

[ 12%] Built target gen-pkgconfig [ 12%] Built target libwebp [ 12%] Built target ippiw [ 12%] Building CXX object 3rdparty/protobuf/CMakeFiles/libprotobuf.dir/src/google/protobuf/extension_set.cc.o In file included from /home/w/opencv/3rdparty/protobuf/src/google/protobuf/repeated_field.h:62, from /home/w/opencv/3rdparty/protobuf/src/google/protobuf/extension_set.h:51, from /home/w/opencv/3rdparty/protobuf/src/google/protobuf/extension_set.cc:38: 3rdparty/protobuf/CMakeFiles/libprotobuf.dir/build.make:110: recipe for target '3rdparty/protobuf/CMakeFiles/libprotobuf.dir/src/google/protobuf/extension_set.cc.o' failed make[2]: *** [3rdparty/protobuf/CMakeFiles/libprotobuf.dir/src/google/protobuf/extension_set.cc.o] Error 1 CMakeFiles/Makefile2:436: recipe for target '3rdparty/protobuf/CMakeFiles/libprotobuf.dir/all' failed make[1]: *** [3rdparty/protobuf/CMakeFiles/libprotobuf.dir/all] Error 2 Makefile:160: recipe for target 'all' failed make: *** [all] Error 2

fast-rcnn 在make test出错

我在 配置fast rcnn 过程中,make 成功之后 make test 报错 CXX src/caffe/test/test_smooth_L1_loss_layer.cpp (下面是一对关于这个东西的报错) .................... (最后) src/caffe/test/test_smooth_L1_loss_layer.cpp:72:1: note: in expansion of macro ‘TYPED_TEST’ TYPED_TEST(SmoothL1LossLayerTest, TestGradient) { ^ Makefile:5 6 3: recipe for target '.build_release/src/caffe/test/test_smooth_L1_loss_layer.o' failed make: *** [.build_release/src/caffe/test/test_smooth_L1_loss_layer.o] Error

ubuntu14 下 Caffe编译问题 出错

# .build_release/lib/libcaffe.so: undefined reference to `cudnnConvolutionBackwardData_v3'.build_release/lib/libcaffe.so: undefined reference to `cudnnConvolutionBackwardData_v3' .build_release/lib/libcaffe.so: undefined reference to `cudnnConvolutionBackwardFilter_v3' collect2: error: ld returned 1 exit status make: *** [.build_release/tools/upgrade_solver_proto_text.bin] Error 1 make: *** Waiting for unfinished jobs.... .build_release/lib/libcaffe.so: undefined reference to `cudnnConvolutionBackwardData_v3' .build_release/lib/libcaffe.so: undefined reference to `cudnnConvolutionBackwardFilter_v3' collect2: error: ld returned 1 exit status make: *** [.build_release/tools/upgrade_net_proto_binary.bin] Error 1 .build_release/lib/libcaffe.so: undefined reference to `cudnnConvolutionBackwardData_v3' .build_release/lib/libcaffe.so: undefined reference to `cudnnConvolutionBackwardFilter_v3' collect2: error: ld returned 1 exit status .build_release/lib/make: libcaffe.so: undefined reference to *** [.build_release/tools/compute_image_mean.bin] Error 1`cudnnConvolutionBackwardData_v3 ' .build_release/lib/libcaffe.so: undefined reference to `cudnnConvolutionBackwardFilter_v3' collect2: error: ld returned 1 exit status make: *** [.build_release/tools/caffe.bin] Error 1 .build_release/lib/libcaffe.so: undefined reference to `cudnnConvolutionBackwardData_v3' .build_release/lib/libcaffe.so: undefined reference to `cudnnConvolutionBackwardFilter_v3' collect2: error: ld returned 1 exit status make: *** [.build_release/examples/cifar10/convert_cifar_data.bin] Error 1 .build_release/lib/libcaffe.so: undefined reference to `cudnnConvolutionBackwardData_v3' .build_release/lib/libcaffe.so: undefined reference to `cudnnConvolutionBackwardFilter_v3' collect2: error: ld returned 1 exit status make: *** [.build_release/tools/convert_imageset.bin] Error 1 .build_release/lib/libcaffe.so: undefined reference to `cudnnConvolutionBackwardData_v3' .build_release/lib/libcaffe.so: undefined reference to `cudnnConvolutionBackwardFilter_v3' collect2: error: ld returned 1 exit status make: *** [.build_release/tools/extract_features.bin] Error 1 .build_release/lib/libcaffe.so: undefined reference to `cudnnConvolutionBackwardData_v3' .build_release/lib/libcaffe.so: undefined reference to `cudnnConvolutionBackwardFilter_v3' collect2: error: ld returned 1 exit status make: *** [.build_release/tools/upgrade_net_proto_text.bin] Error 1_**

Mac 安装caffe时候出现如下错误,求解答

提示./include/caffe/common.hpp:5:10: fatal error: 'gflags/gflags.h' file not found 1 error generated. make: *** [.build_release/tools/upgrade_solver_proto_text.o] Error 1 make: *** [.build_release/tools/upgrade_net_proto_text.o] Error 1 make: *** [.build_release/tools/upgrade_net_proto_binary.o] Error 1 请问该如何处理?求解答

ubuntu16.04安装openpose编译出现错误/libopenpose.so.1.4.0:对‘caffe::Net未定义的引用

> ![图片说明](https://img-ask.csdn.net/upload/201903/07/1551930959_664828.png) caffe编译测试通过,将生成的caffe.pb.h和caffe.pb.cc文件放入指定文件这一步也做了,在openpose/build 文件下执行make -j'nproc'出现如图错误,感谢

ubuntu16.04安装opencv时,make不通过该怎么办?

cmake已经完成,情况如下: ``` cmake .. -- Detected version of GNU GCC: 54 (504) -- Found ZLIB: /usr/lib/x86_64-linux-gnu/libz.so (found suitable version "1.2.8", minimum required is "1.2.3") -- Found ZLIB: /usr/lib/x86_64-linux-gnu/libz.so (found version "1.2.8") -- Checking for module 'gstreamer-base-1.0' -- No package 'gstreamer-base-1.0' found -- Checking for module 'gstreamer-video-1.0' -- No package 'gstreamer-video-1.0' found -- Checking for module 'gstreamer-app-1.0' -- No package 'gstreamer-app-1.0' found -- Checking for module 'gstreamer-riff-1.0' -- No package 'gstreamer-riff-1.0' found -- Checking for module 'gstreamer-pbutils-1.0' -- No package 'gstreamer-pbutils-1.0' found -- Checking for module 'gstreamer-base-0.10' -- No package 'gstreamer-base-0.10' found -- Checking for module 'gstreamer-video-0.10' -- No package 'gstreamer-video-0.10' found -- Checking for module 'gstreamer-app-0.10' -- No package 'gstreamer-app-0.10' found -- Checking for module 'gstreamer-riff-0.10' -- No package 'gstreamer-riff-0.10' found -- Checking for module 'gstreamer-pbutils-0.10' -- No package 'gstreamer-pbutils-0.10' found -- Looking for linux/videodev.h -- Looking for linux/videodev.h - not found -- Looking for linux/videodev2.h -- Looking for linux/videodev2.h - found -- Looking for sys/videoio.h -- Looking for sys/videoio.h - not found -- Checking for module 'libavresample' -- No package 'libavresample' found -- Looking for libavformat/avformat.h -- Looking for libavformat/avformat.h - found -- Looking for ffmpeg/avformat.h -- Looking for ffmpeg/avformat.h - not found -- Checking for module 'libgphoto2' -- No package 'libgphoto2' found -- found IPP (ICV version): 9.0.1 [9.0.1] -- at: /home/quxutao/opencv-3.1.0/3rdparty/ippicv/unpack/ippicv_lnx -- CUDA detected: 7.5 -- CUDA NVCC target flags: -gencode;arch=compute_20,code=sm_20;-gencode;arch=compute_20,code=sm_21;-gencode;arch=compute_30,code=sm_30;-gencode;arch=compute_35,code=sm_35;-gencode;arch=compute_30,code=compute_30 -- Could NOT find Doxygen (missing: DOXYGEN_EXECUTABLE) -- To enable PlantUML support, set PLANTUML_JAR environment variable or pass -DPLANTUML_JAR=<filepath> option to cmake -- Could NOT find PythonInterp: Found unsuitable version "1.4", but required is at least "2.7" (found /home/quxutao/.virtualenvs/cv/bin/python) -- Could NOT find PythonInterp: Found unsuitable version "1.4", but required is at least "2.6" (found /home/quxutao/.virtualenvs/cv/bin/python) -- Could NOT find PythonInterp: Found unsuitable version "1.4", but required is at least "3.4" (found /home/quxutao/.virtualenvs/cv/bin/python) -- Could NOT find PythonInterp: Found unsuitable version "1.4", but required is at least "3.2" (found /home/quxutao/.virtualenvs/cv/bin/python) -- Could NOT find JNI (missing: JAVA_INCLUDE_PATH JAVA_INCLUDE_PATH2 JAVA_AWT_INCLUDE_PATH) -- Could NOT find Matlab (missing: MATLAB_MEX_SCRIPT MATLAB_INCLUDE_DIRS MATLAB_ROOT_DIR MATLAB_LIBRARIES MATLAB_LIBRARY_DIRS MATLAB_MEXEXT MATLAB_ARCH MATLAB_BIN) -- VTK is not found. Please set -DVTK_DIR in CMake to VTK build directory, or to VTK install subdirectory with VTKConfig.cmake file -- Caffe: NO -- Protobuf: YES -- Glog: NO -- HDF5: YES -- Module opencv_sfm disabled because the following dependencies are not found: Eigen Glog/Gflags -- Tesseract: NO -- HDF5: YES -- Build libprotobuf from sources: -- The protocol buffer compiler not found -- Tesseract: NO -- -- General configuration for OpenCV 3.1.0 ===================================== -- Version control: unknown -- -- Platform: -- Host: Linux 4.15.0-47-generic x86_64 -- CMake: 3.5.1 -- CMake generator: Unix Makefiles -- CMake build tool: /usr/bin/make -- Configuration: RELEASE -- -- C/C++: -- Built as dynamic libs?: YES -- C++ Compiler: /usr/bin/c++ (ver 5.4.0) -- C++ flags (Release): -fsigned-char -W -Wall -Werror=return-type -Werror=non-virtual-dtor -Werror=address -Werror=sequence-point -Wformat -Werror=format-security -Wmissing-declarations -Wundef -Winit-self -Wpointer-arith -Wshadow -Wsign-promo -Wno-narrowing -Wno-delete-non-virtual-dtor -fdiagnostics-show-option -Wno-long-long -pthread -fomit-frame-pointer -msse -msse2 -mno-avx -msse3 -mno-ssse3 -mno-sse4.1 -mno-sse4.2 -ffunction-sections -fvisibility=hidden -fvisibility-inlines-hidden -O3 -DNDEBUG -DNDEBUG -- C++ flags (Debug): -fsigned-char -W -Wall -Werror=return-type -Werror=non-virtual-dtor -Werror=address -Werror=sequence-point -Wformat -Werror=format-security -Wmissing-declarations -Wundef -Winit-self -Wpointer-arith -Wshadow -Wsign-promo -Wno-narrowing -Wno-delete-non-virtual-dtor -fdiagnostics-show-option -Wno-long-long -pthread -fomit-frame-pointer -msse -msse2 -mno-avx -msse3 -mno-ssse3 -mno-sse4.1 -mno-sse4.2 -ffunction-sections -fvisibility=hidden -fvisibility-inlines-hidden -g -O0 -DDEBUG -D_DEBUG -- C Compiler: /usr/bin/cc -- C flags (Release): -fsigned-char -W -Wall -Werror=return-type -Werror=non-virtual-dtor -Werror=address -Werror=sequence-point -Wformat -Werror=format-security -Wmissing-declarations -Wmissing-prototypes -Wstrict-prototypes -Wundef -Winit-self -Wpointer-arith -Wshadow -Wno-narrowing -fdiagnostics-show-option -Wno-long-long -pthread -fomit-frame-pointer -msse -msse2 -mno-avx -msse3 -mno-ssse3 -mno-sse4.1 -mno-sse4.2 -ffunction-sections -fvisibility=hidden -O3 -DNDEBUG -DNDEBUG -- C flags (Debug): -fsigned-char -W -Wall -Werror=return-type -Werror=non-virtual-dtor -Werror=address -Werror=sequence-point -Wformat -Werror=format-security -Wmissing-declarations -Wmissing-prototypes -Wstrict-prototypes -Wundef -Winit-self -Wpointer-arith -Wshadow -Wno-narrowing -fdiagnostics-show-option -Wno-long-long -pthread -fomit-frame-pointer -msse -msse2 -mno-avx -msse3 -mno-ssse3 -mno-sse4.1 -mno-sse4.2 -ffunction-sections -fvisibility=hidden -g -O0 -DDEBUG -D_DEBUG -- Linker flags (Release): -- Linker flags (Debug): -- Precompiled headers: YES -- Extra dependencies: /usr/lib/x86_64-linux-gnu/libpng.so /usr/lib/x86_64-linux-gnu/libtiff.so /usr/lib/x86_64-linux-gnu/libjasper.so /usr/lib/x86_64-linux-gnu/libjpeg.so gtk-3 gdk-3 pangocairo-1.0 pango-1.0 atk-1.0 cairo-gobject cairo gdk_pixbuf-2.0 gio-2.0 gobject-2.0 gthread-2.0 glib-2.0 dc1394 v4l1 v4l2 avcodec-ffmpeg avformat-ffmpeg avutil-ffmpeg swscale-ffmpeg /usr/lib/x86_64-linux-gnu/libbz2.so /usr/lib/x86_64-linux-gnu/hdf5/openmpi/lib/libhdf5.so /usr/lib/x86_64-linux-gnu/libsz.so /usr/lib/x86_64-linux-gnu/libz.so /usr/lib/x86_64-linux-gnu/libdl.so /usr/lib/x86_64-linux-gnu/libm.so dl m pthread rt cudart nppc nppi npps cufft -L/usr/lib/x86_64-linux-gnu -- 3rdparty dependencies: libwebp IlmImf libprotobuf -- -- OpenCV modules: -- To be built: cudev core cudaarithm flann hdf imgproc ml reg surface_matching video cudabgsegm cudafilters cudaimgproc cudawarping dnn fuzzy imgcodecs photo shape videoio cudacodec highgui objdetect plot ts xobjdetect xphoto bgsegm bioinspired dpm face features2d line_descriptor saliency text calib3d ccalib cudafeatures2d cudalegacy cudaobjdetect cudaoptflow cudastereo datasets rgbd stereo structured_light superres tracking videostab xfeatures2d ximgproc aruco optflow stitching -- Disabled: world contrib_world -- Disabled by dependency: - -- Unavailable: java python2 python3 viz cvv matlab sfm -- -- GUI: -- QT: NO -- GTK+ 3.x: YES (ver 3.18.9) -- GThread : YES (ver 2.48.2) -- GtkGlExt: NO -- OpenGL support: NO -- VTK support: NO -- -- Media I/O: -- ZLib: /usr/lib/x86_64-linux-gnu/libz.so (ver 1.2.8) -- JPEG: /usr/lib/x86_64-linux-gnu/libjpeg.so (ver ) -- WEBP: build (ver 0.3.1) -- PNG: /usr/lib/x86_64-linux-gnu/libpng.so (ver 1.2.54) -- TIFF: /usr/lib/x86_64-linux-gnu/libtiff.so (ver 42 - 4.0.6) -- JPEG 2000: /usr/lib/x86_64-linux-gnu/libjasper.so (ver 1.900.1) -- OpenEXR: build (ver 1.7.1) -- GDAL: NO -- -- Video I/O: -- DC1394 1.x: NO -- DC1394 2.x: YES (ver 2.2.4) -- FFMPEG: YES -- codec: YES (ver 56.60.100) -- format: YES (ver 56.40.101) -- util: YES (ver 54.31.100) -- swscale: YES (ver 3.1.101) -- resample: NO -- gentoo-style: YES -- GStreamer: NO -- OpenNI: NO -- OpenNI PrimeSensor Modules: NO -- OpenNI2: NO -- PvAPI: NO -- GigEVisionSDK: NO -- UniCap: NO -- UniCap ucil: NO -- V4L/V4L2: Using libv4l1 (ver 1.10.0) / libv4l2 (ver 1.10.0) -- XIMEA: NO -- Xine: NO -- gPhoto2: NO -- -- Parallel framework: pthreads -- -- Other third-party libraries: -- Use IPP: 9.0.1 [9.0.1] -- at: /home/quxutao/opencv-3.1.0/3rdparty/ippicv/unpack/ippicv_lnx -- Use IPP Async: NO -- Use VA: NO -- Use Intel VA-API/OpenCL: NO -- Use Eigen: NO -- Use Cuda: YES (ver 7.5) -- Use OpenCL: YES -- Use custom HAL: NO -- -- NVIDIA CUDA -- Use CUFFT: YES -- Use CUBLAS: NO -- USE NVCUVID: NO -- NVIDIA GPU arch: 20 21 30 35 -- NVIDIA PTX archs: 30 -- Use fast math: NO -- -- OpenCL: -- Version: dynamic -- Include path: /home/quxutao/opencv-3.1.0/3rdparty/include/opencl/1.2 -- Use AMDFFT: NO -- Use AMDBLAS: NO -- -- Python 2: -- Interpreter: NO -- -- Python 3: -- Interpreter: NO -- -- Python (for build): NO -- -- Java: -- ant: NO -- JNI: NO -- Java wrappers: NO -- Java tests: NO -- -- Matlab: Matlab not found or implicitly disabled -- -- Documentation: -- Doxygen: NO -- PlantUML: NO -- -- Tests and samples: -- Tests: YES -- Performance tests: YES -- C/C++ Examples: YES -- -- Install path: /usr/local -- -- cvconfig.h is in: /home/quxutao/opencv-3.1.0/build -- ----------------------------------------------------------------- -- -- Configuring done -- Generating done -- Build files have been written to: /home/quxutao/opencv-3.1.0/build ``` 但是make的时候,就报错: ``` make [ 4%] Built target libwebp [ 4%] Built target IlmImf [ 4%] Built target opencv_cudev [ 4%] Built target opencv_core_pch_dephelp [ 4%] Built target pch_Generate_opencv_core [ 4%] Building NVCC (Device) object modules/core/CMakeFiles/cuda_compile.dir/src/cuda/cuda_compile_generated_gpu_mat.cu.o /usr/include/string.h: In function ‘void* __mempcpy_inline(void*, const void*, size_t)’: /usr/include/string.h:652:42: error: ‘memcpy’ was not declared in this scope return (char *) memcpy (__dest, __src, __n) + __n; ^ CMake Error at cuda_compile_generated_gpu_mat.cu.o.cmake:266 (message): Error generating file /home/quxutao/opencv-3.1.0/build/modules/core/CMakeFiles/cuda_compile.dir/src/cuda/./cuda_compile_generated_gpu_mat.cu.o modules/core/CMakeFiles/opencv_core.dir/build.make:399: recipe for target 'modules/core/CMakeFiles/cuda_compile.dir/src/cuda/cuda_compile_generated_gpu_mat.cu.o' failed make[2]: *** [modules/core/CMakeFiles/cuda_compile.dir/src/cuda/cuda_compile_generated_gpu_mat.cu.o] Error 1 CMakeFiles/Makefile2:2307: recipe for target 'modules/core/CMakeFiles/opencv_core.dir/all' failed make[1]: *** [modules/core/CMakeFiles/opencv_core.dir/all] Error 2 Makefile:160: recipe for target 'all' failed make: *** [all] Error 2 ``` 弄了一下午了,没有找到相关的解决办法。我的cuda是7.5,其实不用GPU也可以的,我只是想用KAZE滤波。。。跪求大神帮忙。。。

如何解决运行Caffe的MNIST的实例出现的指针问题

我是ubuntu系统。下载好mnist数据后,在转换为LMDB时出现问题。 运行指令:sudo sh examples/mnist/create_mnist.sh 出现这样的问题:*** Error in `build/examples/mnist/convert_mnist_data.bin': munmap_chunk(): invalid pointer: 0x0000000000fc6240 *** 去检查./examples/mnist/目录下,本应生成train和test两个文件夹,此时只有train而没有test。 从网上搜索发现大家都没出现这样的问题,出现这个问题都是在自己编写程序时指针声明和释放出错,但是这里为什么会报错呢。对于这样的错误怎么解决呢? 完整的信息如下: Creating lmdb... I1113 15:57:00.470358 4735 db_lmdb.cpp:35] Opened lmdb examples/mnist/mnist_train_lmdb I1113 15:57:00.470620 4735 convert_mnist_data.cpp:88] A total of 60000 items. I1113 15:57:00.470633 4735 convert_mnist_data.cpp:89] Rows: 28 Cols: 28 I1113 15:57:07.320497 4735 convert_mnist_data.cpp:108] Processed 60000 files. *** Error in `build/examples/mnist/convert_mnist_data.bin': munmap_chunk(): invalid pointer: 0x0000000000fc6240 *** ======= Backtrace: ========= /lib/x86_64-linux-gnu/libc.so.6(+0x777e5)[0x7f06569327e5] /lib/x86_64-linux-gnu/libc.so.6(cfree+0x1a8)[0x7f065693f698] /usr/lib/x86_64-linux-gnu/libprotobuf.so.9(_ZN6google8protobuf8internal28DestroyDefaultRepeatedFieldsEv+0x1f)[0x7f066094d8af] /usr/lib/x86_64-linux-gnu/libprotobuf.so.9(_ZN6google8protobuf23ShutdownProtobufLibraryEv+0x8b)[0x7f066094cb3b] /usr/lib/x86_64-linux-gnu/libmirprotobuf.so.3(+0x233b9)[0x7f062efc23b9] /lib64/ld-linux-x86-64.so.2(+0x10de7)[0x7f0667226de7] /lib/x86_64-linux-gnu/libc.so.6(+0x39ff8)[0x7f06568f4ff8] /lib/x86_64-linux-gnu/libc.so.6(+0x3a045)[0x7f06568f5045] /lib/x86_64-linux-gnu/libc.so.6(__libc_start_main+0xf7)[0x7f06568db837] build/examples/mnist/convert_mnist_data.bin[0x4025b9]

openpose cmake gui 编译报错caffe lib?

CMake Error: The following variables are used in this project, but they are set to NOTFOUND. Please set them or make sure they are set and tested correctly in the CMake files: Caffe_LIB linked by target "openpose" in directory E:/openpose-1.5.1/src/openpose linked by target "Calibration" in directory E:/openpose-1.5.1/examples/calibration linked by target "OpenPoseDemo" in directory E:/openpose-1.5.1/examples/openpose linked by target "1_custom_post_processing" in directory E:/openpose-1.5.1/examples/tutorial_add_module linked by target "01_body_from_image_default" in directory E:/openpose-1.5.1/examples/tutorial_api_cpp linked by target "02_whole_body_from_image_default" in directory E:/openpose-1.5.1/examples/tutorial_api_cpp linked by target "09_keypoints_from_heatmaps" in directory E:/openpose-1.5.1/examples/tutorial_api_cpp linked by target "08_heatmaps_from_image" in directory E:/openpose-1.5.1/examples/tutorial_api_cpp linked by target "03_keypoints_from_image" in directory E:/openpose-1.5.1/examples/tutorial_api_cpp linked by target "12_asynchronous_custom_input_output_and_datum" in directory E:/openpose-1.5.1/examples/tutorial_api_cpp linked by target "05_keypoints_from_images_multi_gpu" in directory E:/openpose-1.5.1/examples/tutorial_api_cpp linked by target "04_keypoints_from_images" in directory E:/openpose-1.5.1/examples/tutorial_api_cpp linked by target "06_face_from_image" in directory E:/openpose-1.5.1/examples/tutorial_api_cpp linked by target "07_hand_from_image" in directory E:/openpose-1.5.1/examples/tutorial_api_cpp linked by target "10_asynchronous_custom_input" in directory E:/openpose-1.5.1/examples/tutorial_api_cpp linked by target "11_asynchronous_custom_output" in directory E:/openpose-1.5.1/examples/tutorial_api_cpp linked by target "13_synchronous_custom_input" in directory E:/openpose-1.5.1/examples/tutorial_api_cpp linked by target "17_synchronous_custom_all_and_datum" in directory E:/openpose-1.5.1/examples/tutorial_api_cpp linked by target "14_synchronous_custom_preprocessing" in directory E:/openpose-1.5.1/examples/tutorial_api_cpp linked by target "15_synchronous_custom_postprocessing" in directory E:/openpose-1.5.1/examples/tutorial_api_cpp linked by target "16_synchronous_custom_output" in directory E:/openpose-1.5.1/examples/tutorial_api_cpp linked by target "1_thread_user_processing_function" in directory E:/openpose-1.5.1/examples/tutorial_api_thread linked by target "2_thread_user_input_processing_output_and_datum" in directory E:/openpose-1.5.1/examples/tutorial_api_thread Caffe_Proto_LIB linked by target "openpose" in directory E:/openpose-1.5.1/src/openpose linked by target "Calibration" in directory E:/openpose-1.5.1/examples/calibration linked by target "OpenPoseDemo" in directory E:/openpose-1.5.1/examples/openpose linked by target "1_custom_post_processing" in directory E:/openpose-1.5.1/examples/tutorial_add_module linked by target "01_body_from_image_default" in directory E:/openpose-1.5.1/examples/tutorial_api_cpp linked by target "02_whole_body_from_image_default" in directory E:/openpose-1.5.1/examples/tutorial_api_cpp linked by target "09_keypoints_from_heatmaps" in directory E:/openpose-1.5.1/examples/tutorial_api_cpp linked by target "08_heatmaps_from_image" in directory E:/openpose-1.5.1/examples/tutorial_api_cpp linked by target "03_keypoints_from_image" in directory E:/openpose-1.5.1/examples/tutorial_api_cpp linked by target "12_asynchronous_custom_input_output_and_datum" in directory E:/openpose-1.5.1/examples/tutorial_api_cpp linked by target "05_keypoints_from_images_multi_gpu" in directory E:/openpose-1.5.1/examples/tutorial_api_cpp linked by target "04_keypoints_from_images" in directory E:/openpose-1.5.1/examples/tutorial_api_cpp linked by target "06_face_from_image" in directory E:/openpose-1.5.1/examples/tutorial_api_cpp linked by target "07_hand_from_image" in directory E:/openpose-1.5.1/examples/tutorial_api_cpp linked by target "10_asynchronous_custom_input" in directory E:/openpose-1.5.1/examples/tutorial_api_cpp linked by target "11_asynchronous_custom_output" in directory E:/openpose-1.5.1/examples/tutorial_api_cpp linked by target "13_synchronous_custom_input" in directory E:/openpose-1.5.1/examples/tutorial_api_cpp linked by target "17_synchronous_custom_all_and_datum" in directory E:/openpose-1.5.1/examples/tutorial_api_cpp linked by target "14_synchronous_custom_preprocessing" in directory E:/openpose-1.5.1/examples/tutorial_api_cpp linked by target "15_synchronous_custom_postprocessing" in directory E:/openpose-1.5.1/examples/tutorial_api_cpp linked by target "16_synchronous_custom_output" in directory E:/openpose-1.5.1/examples/tutorial_api_cpp linked by target "1_thread_user_processing_function" in directory E:/openpose-1.5.1/examples/tutorial_api_thread linked by target "2_thread_user_input_processing_output_and_datum" in directory E:/openpose-1.5.1/examples/tutorial_api_thread Configuring incomplete, errors occurred! See also "E:/openpose-1.5.1/bulid/CMakeFiles/CMakeOutput.log".

一个深度学习的程序,程序应该没问题,本来可以编译通过。由于自己卸载安装了protobuf,程序报错

我运行的本来是一个关于caffe的程序(就叫mydemo好了),改好代码,编译好caffe(demo 能出来), 然后cmake,make都顺利,然后就等 ./mydemo可执行程序 的时候问题来了。 我的protobuf版本是2.5.0.错误提示的意思大概是,程序需要2.6.0.的protobuf(当时忘记截图), 于是我就yum update protobuf,然后发现yum最高的版本就是2.5.0,。于是我就在博客上找了一份2.6.0的包, 扔到一个目录下就开始解压,./configure,make ,make clean,make install.然后在重新运行./mydemo,发现出错,(ps:在重新安装这个protobuf2.6.0的时候,发现跳了很多代码,但并没有报错,只有很多warning)不知道有没有影响,反正后来我就把这个安装的make uninstall掉了,文件夹也删除,然后就发现mydemo,make就开始报错了。不知道怎么解决,但感觉还是protobuf的问题。求解!!大家帮忙看看![图片说明](https://img-ask.csdn.net/upload/201611/29/1480400303_753440.png)

大学四年自学走来,这些私藏的实用工具/学习网站我贡献出来了

大学四年,看课本是不可能一直看课本的了,对于学习,特别是自学,善于搜索网上的一些资源来辅助,还是非常有必要的,下面我就把这几年私藏的各种资源,网站贡献出来给你们。主要有:电子书搜索、实用工具、在线视频学习网站、非视频学习网站、软件下载、面试/求职必备网站。 注意:文中提到的所有资源,文末我都给你整理好了,你们只管拿去,如果觉得不错,转发、分享就是最大的支持了。 一、电子书搜索 对于大部分程序员...

在中国程序员是青春饭吗?

今年,我也32了 ,为了不给大家误导,咨询了猎头、圈内好友,以及年过35岁的几位老程序员……舍了老脸去揭人家伤疤……希望能给大家以帮助,记得帮我点赞哦。 目录: 你以为的人生 一次又一次的伤害 猎头界的真相 如何应对互联网行业的「中年危机」 一、你以为的人生 刚入行时,拿着傲人的工资,想着好好干,以为我们的人生是这样的: 等真到了那一天,你会发现,你的人生很可能是这样的: ...

Java基础知识面试题(2020最新版)

文章目录Java概述何为编程什么是Javajdk1.5之后的三大版本JVM、JRE和JDK的关系什么是跨平台性?原理是什么Java语言有哪些特点什么是字节码?采用字节码的最大好处是什么什么是Java程序的主类?应用程序和小程序的主类有何不同?Java应用程序与小程序之间有那些差别?Java和C++的区别Oracle JDK 和 OpenJDK 的对比基础语法数据类型Java有哪些数据类型switc...

我以为我学懂了数据结构,直到看了这个导图才发现,我错了

数据结构与算法思维导图

String s = new String(" a ") 到底产生几个对象?

老生常谈的一个梗,到2020了还在争论,你们一天天的,哎哎哎,我不是针对你一个,我是说在座的各位都是人才! 上图红色的这3个箭头,对于通过new产生一个字符串(”宜春”)时,会先去常量池中查找是否已经有了”宜春”对象,如果没有则在常量池中创建一个此字符串对象,然后堆中再创建一个常量池中此”宜春”对象的拷贝对象。 也就是说准确答案是产生了一个或两个对象,如果常量池中原来没有 ”宜春” ,就是两个。...

技术大佬:我去,你写的 switch 语句也太老土了吧

昨天早上通过远程的方式 review 了两名新来同事的代码,大部分代码都写得很漂亮,严谨的同时注释也很到位,这令我非常满意。但当我看到他们当中有一个人写的 switch 语句时,还是忍不住破口大骂:“我擦,小王,你丫写的 switch 语句也太老土了吧!” 来看看小王写的代码吧,看完不要骂我装逼啊。 private static String createPlayer(PlayerTypes p...

Linux面试题(2020最新版)

文章目录Linux 概述什么是LinuxUnix和Linux有什么区别?什么是 Linux 内核?Linux的基本组件是什么?Linux 的体系结构BASH和DOS之间的基本区别是什么?Linux 开机启动过程?Linux系统缺省的运行级别?Linux 使用的进程间通信方式?Linux 有哪些系统日志文件?Linux系统安装多个桌面环境有帮助吗?什么是交换空间?什么是root帐户什么是LILO?什...

Linux命令学习神器!命令看不懂直接给你解释!

大家都知道,Linux 系统有非常多的命令,而且每个命令又有非常多的用法,想要全部记住所有命令的所有用法,恐怕是一件不可能完成的任务。 一般情况下,我们学习一个命令时,要么直接百度去搜索它的用法,要么就直接用 man 命令去查看守冗长的帮助手册。这两个都可以实现我们的目标,但有没有更简便的方式呢? 答案是必须有的!今天给大家推荐一款有趣而实用学习神器 — kmdr,让你解锁 Linux 学习新姿势...

和黑客斗争的 6 天!

互联网公司工作,很难避免不和黑客们打交道,我呆过的两家互联网公司,几乎每月每天每分钟都有黑客在公司网站上扫描。有的是寻找 Sql 注入的缺口,有的是寻找线上服务器可能存在的漏洞,大部分都...

史上最全的 python 基础知识汇总篇,没有比这再全面的了,建议收藏

网友们有福了,小编终于把基础篇的内容全部涉略了一遍,这是一篇关于基础知识的汇总的文章,请朋友们收下,不用客气,不过文章篇幅肯能会有点长,耐心阅读吧爬虫(七十)多进程multiproces...

讲一个程序员如何副业月赚三万的真实故事

loonggg读完需要3分钟速读仅需 1 分钟大家好,我是你们的校长。我之前讲过,这年头,只要肯动脑,肯行动,程序员凭借自己的技术,赚钱的方式还是有很多种的。仅仅靠在公司出卖自己的劳动时...

女程序员,为什么比男程序员少???

昨天看到一档综艺节目,讨论了两个话题:(1)中国学生的数学成绩,平均下来看,会比国外好?为什么?(2)男生的数学成绩,平均下来看,会比女生好?为什么?同时,我又联想到了一个技术圈经常讨...

85后蒋凡:28岁实现财务自由、34岁成为阿里万亿电商帝国双掌门,他的人生底层逻辑是什么?...

蒋凡是何许人也? 2017年12月27日,在入职4年时间里,蒋凡开挂般坐上了淘宝总裁位置。 为此,时任阿里CEO张勇在任命书中力赞: 蒋凡加入阿里,始终保持创业者的冲劲,有敏锐的...

总结了 150 余个神奇网站,你不来瞅瞅吗?

原博客再更新,可能就没了,之后将持续更新本篇博客。

副业收入是我做程序媛的3倍,工作外的B面人生是怎样的?

提到“程序员”,多数人脑海里首先想到的大约是:为人木讷、薪水超高、工作枯燥…… 然而,当离开工作岗位,撕去层层标签,脱下“程序员”这身外套,有的人生动又有趣,马上展现出了完全不同的A/B面人生! 不论是简单的爱好,还是正经的副业,他们都干得同样出色。偶尔,还能和程序员的特质结合,产生奇妙的“化学反应”。 @Charlotte:平日素颜示人,周末美妆博主 大家都以为程序媛也个个不修边幅,但我们也许...

MySQL数据库面试题(2020最新版)

文章目录数据库基础知识为什么要使用数据库什么是SQL?什么是MySQL?数据库三大范式是什么mysql有关权限的表都有哪几个MySQL的binlog有有几种录入格式?分别有什么区别?数据类型mysql有哪些数据类型引擎MySQL存储引擎MyISAM与InnoDB区别MyISAM索引与InnoDB索引的区别?InnoDB引擎的4大特性存储引擎选择索引什么是索引?索引有哪些优缺点?索引使用场景(重点)...

新一代神器STM32CubeMonitor介绍、下载、安装和使用教程

关注、星标公众号,不错过精彩内容作者:黄工公众号:strongerHuang最近ST官网悄悄新上线了一款比较强大的工具:STM32CubeMonitor V1.0.0。经过我研究和使用之...

如果你是老板,你会不会踢了这样的员工?

有个好朋友ZS,是技术总监,昨天问我:“有一个老下属,跟了我很多年,做事勤勤恳恳,主动性也很好。但随着公司的发展,他的进步速度,跟不上团队的步伐了,有点...

我入职阿里后,才知道原来简历这么写

私下里,有不少读者问我:“二哥,如何才能写出一份专业的技术简历呢?我总感觉自己写的简历太烂了,所以投了无数份,都石沉大海了。”说实话,我自己好多年没有写过简历了,但我认识的一个同行,他在阿里,给我说了一些他当年写简历的方法论,我感觉太牛逼了,实在是忍不住,就分享了出来,希望能够帮助到你。 01、简历的本质 作为简历的撰写者,你必须要搞清楚一点,简历的本质是什么,它就是为了来销售你的价值主张的。往深...

大学一路走来,学习互联网全靠这几个网站,最终拿下了一把offer

大佬原来都是这样炼成的

离职半年了,老东家又发 offer,回不回?

有小伙伴问松哥这个问题,他在上海某公司,在离职了几个月后,前公司的领导联系到他,希望他能够返聘回去,他很纠结要不要回去? 俗话说好马不吃回头草,但是这个小伙伴既然感到纠结了,我觉得至少说明了两个问题:1.曾经的公司还不错;2.现在的日子也不是很如意。否则应该就不会纠结了。 老实说,松哥之前也有过类似的经历,今天就来和小伙伴们聊聊回头草到底吃不吃。 首先一个基本观点,就是离职了也没必要和老东家弄的苦...

为什么你不想学习?只想玩?人是如何一步一步废掉的

不知道是不是只有我这样子,还是你们也有过类似的经历。 上学的时候总有很多光辉历史,学年名列前茅,或者单科目大佬,但是虽然慢慢地长大了,你开始懈怠了,开始废掉了。。。 什么?你说不知道具体的情况是怎么样的? 我来告诉你: 你常常潜意识里或者心理觉得,自己真正的生活或者奋斗还没有开始。总是幻想着自己还拥有大把时间,还有无限的可能,自己还能逆风翻盘,只不是自己还没开始罢了,自己以后肯定会变得特别厉害...

什么时候跳槽,为什么离职,你想好了么?

都是出来打工的,多为自己着想

为什么程序员做外包会被瞧不起?

二哥,有个事想询问下您的意见,您觉得应届生值得去外包吗?公司虽然挺大的,中xx,但待遇感觉挺低,马上要报到,挺纠结的。

当HR压你价,说你只值7K,你该怎么回答?

当HR压你价,说你只值7K时,你可以流畅地回答,记住,是流畅,不能犹豫。 礼貌地说:“7K是吗?了解了。嗯~其实我对贵司的面试官印象很好。只不过,现在我的手头上已经有一份11K的offer。来面试,主要也是自己对贵司挺有兴趣的,所以过来看看……”(未完) 这段话主要是陪HR互诈的同时,从公司兴趣,公司职员印象上,都给予对方正面的肯定,既能提升HR的好感度,又能让谈判气氛融洽,为后面的发挥留足空间。...

面试阿里p7,被按在地上摩擦,鬼知道我经历了什么?

面试阿里p7被问到的问题(当时我只知道第一个):@Conditional是做什么的?@Conditional多个条件是什么逻辑关系?条件判断在什么时候执...

你期望月薪4万,出门右拐,不送,这几个点,你也就是个初级的水平

先来看几个问题通过注解的方式注入依赖对象,介绍一下你知道的几种方式@Autowired和@Resource有何区别说一下@Autowired查找候选者的...

面试了一个 31 岁程序员,让我有所触动,30岁以上的程序员该何去何从?

最近面试了一个31岁8年经验的程序猿,让我有点感慨,大龄程序猿该何去何从。

大三实习生,字节跳动面经分享,已拿Offer

说实话,自己的算法,我一个不会,太难了吧

程序员垃圾简历长什么样?

已经连续五年参加大厂校招、社招的技术面试工作,简历看的不下于万份 这篇文章会用实例告诉你,什么是差的程序员简历! 疫情快要结束了,各个公司也都开始春招了,作为即将红遍大江南北的新晋UP主,那当然要为小伙伴们做点事(手动狗头)。 就在公众号里公开征简历,义务帮大家看,并一一点评。《启舰:春招在即,义务帮大家看看简历吧》 一石激起千层浪,三天收到两百多封简历。 花光了两个星期的所有空闲时...

立即提问
相关内容推荐