osx eclipse 启动tomcat时报错:严重: Socket accept failed java.net.SocketException: Socket closed

如题,使用mac版eclipse启动
已经关闭ipv6,eclipse连接Oracle可以连通。
控制台信息如下:

Init datasource error [design] can not get connection,please check the DBSet
三月 20, 2019 3:53:23 下午 org.apache.coyote.AbstractProtocol init
信息: Initializing ProtocolHandler ["http-bio-127.0.0.1-8099"]
三月 20, 2019 3:53:24 下午 org.apache.catalina.core.StandardService startInternal
信息: Starting service bright
三月 20, 2019 3:53:24 下午 org.apache.catalina.core.StandardEngine startInternal
信息: Starting Servlet Engine: UAP Server
三月 20, 2019 3:53:25 下午 org.apache.catalina.startup.ContextConfig getDefaultWebXmlFragment
信息: No global web.xml found
ESA Server starting
NTBService6.3 started.~~~~~~
ESA Server started: 51965
三月 20, 2019 3:54:37 下午 org.apache.coyote.AbstractProtocol start
信息: Starting ProtocolHandler ["http-bio-127.0.0.1-8099"]
三月 20, 2019 3:54:38 下午 org.apache.tomcat.util.net.JIoEndpoint$Acceptor run
严重: Socket accept failed
java.net.SocketException: Socket closed
at java.net.PlainSocketImpl.socketAccept(Native Method)
at java.net.AbstractPlainSocketImpl.accept(AbstractPlainSocketImpl.java:398)
at java.net.ServerSocket.implAccept(ServerSocket.java:530)
at java.net.ServerSocket.accept(ServerSocket.java:498)
at org.apache.tomcat.util.net.DefaultServerSocketFactory.acceptSocket(DefaultServerSocketFactory.java:60)
at org.apache.tomcat.util.net.JIoEndpoint$Acceptor.run(JIoEndpoint.java:216)
at java.lang.Thread.run(Thread.java:745)

三月 20, 2019 3:54:38 下午 org.apache.tomcat.granite.BrightTomcat start
信息: Server startup in 76169 ms
三月 20, 2019 3:54:38 下午 org.apache.coyote.AbstractProtocol pause
信息: Pausing ProtocolHandler ["http-bio-127.0.0.1-8099"]
三月 20, 2019 3:54:38 下午 org.apache.tomcat.util.net.JIoEndpoint$Acceptor run
严重: Socket accept failed
java.net.SocketException: Socket closed
at java.net.PlainSocketImpl.socketAccept(Native Method)
at java.net.AbstractPlainSocketImpl.accept(AbstractPlainSocketImpl.java:398)
at java.net.ServerSocket.implAccept(ServerSocket.java:530)
at java.net.ServerSocket.accept(ServerSocket.java:498)
at org.apache.tomcat.util.net.DefaultServerSocketFactory.acceptSocket(DefaultServerSocketFactory.java:60)
at org.apache.tomcat.util.net.JIoEndpoint$Acceptor.run(JIoEndpoint.java:216)
at java.lang.Thread.run(Thread.java:745)

三月 20, 2019 3:54:38 下午 org.apache.catalina.core.StandardService stopInternal
信息: Stopping service bright
ESA Server stopping
ESA Server stopped
三月 20, 2019 3:54:39 下午 org.apache.catalina.loader.WebappClassLoader clearReferencesThreads
严重: The web application [/] appears to have started a thread named [check-offline-msg-valid] but has failed to stop it. This is very likely to create a memory leak.
三月 20, 2019 3:54:39 下午 org.apache.catalina.loader.WebappClassLoader clearReferencesThreads
严重: The web application [/] appears to have started a thread named [Thread-6] but has failed to stop it. This is very likely to create a memory leak.
三月 20, 2019 3:54:39 下午 org.apache.catalina.loader.WebappClassLoader clearReferencesThreads
严重: The web application [/] appears to have started a thread named [Thread-7] but has failed to stop it. This is very likely to create a memory leak.
三月 20, 2019 3:54:39 下午 org.apache.catalina.loader.WebappClassLoader clearReferencesThreads
严重: The web application [/] appears to have started a thread named [Thread-8] but has failed to stop it. This is very likely to create a memory leak.
三月 20, 2019 3:54:39 下午 org.apache.catalina.loader.WebappClassLoader clearReferencesThreads
严重: The web application [/] appears to have started a thread named [Thread-10] but has failed to stop it. This is very likely to create a memory leak.
三月 20, 2019 3:54:39 下午 org.apache.catalina.loader.WebappClassLoader clearReferencesThreads
严重: The web application [/] appears to have started a thread named [Thread-9] but has failed to stop it. This is very likely to create a memory leak.
三月 20, 2019 3:54:39 下午 org.apache.catalina.loader.WebappClassLoader clearReferencesThreads
严重: The web application [/] appears to have started a thread named [Thread-11] but has failed to stop it. This is very likely to create a memory leak.
三月 20, 2019 3:54:39 下午 org.apache.catalina.loader.WebappClassLoader clearReferencesThreads
严重: The web application [/] appears to have started a thread named [Thread-12] but has failed to stop it. This is very likely to create a memory leak.
三月 20, 2019 3:54:39 下午 org.apache.catalina.loader.WebappClassLoader clearReferencesThreads
严重: The web application [/] appears to have started a thread named [Thread-13] but has failed to stop it. This is very likely to create a memory leak.
三月 20, 2019 3:54:39 下午 org.apache.catalina.loader.WebappClassLoader clearReferencesThreads
严重: The web application [/] appears to have started a thread named [Thread-15] but has failed to stop it. This is very likely to create a memory leak.
三月 20, 2019 3:54:39 下午 org.apache.catalina.loader.WebappClassLoader clearReferencesThreads
严重: The web application [/] appears to have started a thread named [Thread-16] but has failed to stop it. This is very likely to create a memory leak.
三月 20, 2019 3:54:39 下午 org.apache.catalina.loader.WebappClassLoader clearReferencesThreads
严重: The web application [/] appears to have started a thread named [Thread-17] but has failed to stop it. This is very likely to create a memory leak.
三月 20, 2019 3:54:39 下午 org.apache.catalina.loader.WebappClassLoader clearReferencesThreads
严重: The web application [/] appears to have started a thread named [Thread-18] but has failed to stop it. This is very likely to create a memory leak.
三月 20, 2019 3:54:39 下午 org.apache.catalina.loader.WebappClassLoader clearReferencesThreads
严重: The web application [/] appears to have started a thread named [Timer-1] but has failed to stop it. This is very likely to create a memory leak.
三月 20, 2019 3:54:39 下午 org.apache.catalina.loader.WebappClassLoader clearReferencesThreads
严重: The web application [/] appears to have started a thread named [Thread-20] but has failed to stop it. This is very likely to create a memory leak.
三月 20, 2019 3:54:39 下午 org.apache.catalina.loader.WebappClassLoader clearReferencesThreads
严重: The web application [/] appears to have started a thread named [Thread-21] but has failed to stop it. This is very likely to create a memory leak.
三月 20, 2019 3:54:39 下午 org.apache.catalina.loader.WebappClassLoader clearReferencesThreads
严重: The web application [/] appears to have started a thread named [Thread-22] but has failed to stop it. This is very likely to create a memory leak.
三月 20, 2019 3:54:39 下午 org.apache.catalina.loader.WebappClassLoader clearReferencesThreads
严重: The web application [/] appears to have started a thread named [Thread-23] but has failed to stop it. This is very likely to create a memory leak.
三月 20, 2019 3:54:39 下午 org.apache.catalina.loader.WebappClassLoader clearReferencesThreads
严重: The web application [/] appears to have started a thread named [Thread-24] but has failed to stop it. This is very likely to create a memory leak.
三月 20, 2019 3:54:39 下午 org.apache.catalina.loader.WebappClassLoader clearReferencesThreads
严重: The web application [/] appears to have started a thread named [Thread-25] but has failed to stop it. This is very likely to create a memory leak.
三月 20, 2019 3:54:39 下午 org.apache.catalina.loader.WebappClassLoader clearReferencesThreads
严重: The web application [/] appears to have started a thread named [Thread-26] but has failed to stop it. This is very likely to create a memory leak.
三月 20, 2019 3:54:39 下午 org.apache.catalina.loader.WebappClassLoader clearReferencesThreads
严重: The web application [/] appears to have started a thread named [Thread-27] but has failed to stop it. This is very likely to create a memory leak.
三月 20, 2019 3:54:39 下午 org.apache.catalina.loader.WebappClassLoader clearReferencesThreads
严重: The web application [/] appears to have started a thread named [Thread-28] but has failed to stop it. This is very likely to create a memory leak.
三月 20, 2019 3:54:39 下午 org.apache.catalina.loader.WebappClassLoader clearReferencesThreads
严重: The web application [/] appears to have started a thread named [Thread-29] but has failed to stop it. This is very likely to create a memory leak.
三月 20, 2019 3:54:39 下午 org.apache.catalina.loader.WebappClassLoader clearReferencesThreads
严重: The web application [/] appears to have started a thread named [Thread-30] but has failed to stop it. This is very likely to create a memory leak.
三月 20, 2019 3:54:39 下午 org.apache.catalina.loader.WebappClassLoader clearReferencesThreads
严重: The web application [/] appears to have started a thread named [Thread-31] but has failed to stop it. This is very likely to create a memory leak.
三月 20, 2019 3:54:39 下午 org.apache.catalina.loader.WebappClassLoader clearReferencesThreads
严重: The web application [/] appears to have started a thread named [Thread-32] but has failed to stop it. This is very likely to create a memory leak.
三月 20, 2019 3:54:39 下午 org.apache.catalina.loader.WebappClassLoader clearReferencesThreads
严重: The web application [/] appears to have started a thread named [Thread-33] but has failed to stop it. This is very likely to create a memory leak.
三月 20, 2019 3:54:39 下午 org.apache.catalina.loader.WebappClassLoader clearReferencesThreads
严重: The web application [/] appears to have started a thread named [Thread-34] but has failed to stop it. This is very likely to create a memory leak.
三月 20, 2019 3:54:39 下午 org.apache.catalina.loader.WebappClassLoader clearReferencesThreads
严重: The web application [/] appears to have started a thread named [Thread-35] but has failed to stop it. This is very likely to create a memory leak.
三月 20, 2019 3:54:39 下午 org.apache.catalina.loader.WebappClassLoader clearReferencesThreads
严重: The web application [/] appears to have started a thread named [Thread-36] but has failed to stop it. This is very likely to create a memory leak.
三月 20, 2019 3:54:39 下午 org.apache.catalina.loader.WebappClassLoader clearReferencesThreads
严重: The web application [/] appears to have started a thread named [Thread-37] but has failed to stop it. This is very likely to create a memory leak.
三月 20, 2019 3:54:39 下午 org.apache.catalina.loader.WebappClassLoader clearReferencesThreads
严重: The web application [/] appears to have started a thread named [Thread-38] but has failed to stop it. This is very likely to create a memory leak.
三月 20, 2019 3:54:39 下午 org.apache.catalina.loader.WebappClassLoader clearReferencesThreads
严重: The web application [/] appears to have started a thread named [Thread-39] but has failed to stop it. This is very likely to create a memory leak.
三月 20, 2019 3:54:39 下午 org.apache.catalina.loader.WebappClassLoader clearReferencesThreads
严重: The web application [/] appears to have started a thread named [Thread-40] but has failed to stop it. This is very likely to create a memory leak.
三月 20, 2019 3:54:39 下午 org.apache.catalina.loader.WebappClassLoader clearReferencesThreads
严重: The web application [/] appears to have started a thread named [transport-check-msg-repeat-thread] but has failed to stop it. This is very likely to create a memory leak.
三月 20, 2019 3:54:39 下午 org.apache.catalina.loader.WebappClassLoader clearReferencesThreads
严重: The web application [/] appears to have started a thread named [antesearch-1-thread] but has failed to stop it. This is very likely to create a memory leak.
三月 20, 2019 3:54:39 下午 org.apache.catalina.loader.WebappClassLoader clearReferencesThreads
严重: The web application [/] appears to have started a thread named [antesearch-2-thread] but has failed to stop it. This is very likely to create a memory leak.
三月 20, 2019 3:54:39 下午 org.apache.catalina.loader.WebappClassLoader clearReferencesThreads
严重: The web application [/] appears to have started a thread named [antesearch-3-thread] but has failed to stop it. This is very likely to create a memory leak.
三月 20, 2019 3:54:39 下午 org.apache.catalina.loader.WebappClassLoader clearReferencesThreads
严重: The web application [/] appears to have started a thread named [antesearch-4-thread] but has failed to stop it. This is very likely to create a memory leak.
三月 20, 2019 3:54:39 下午 org.apache.catalina.loader.WebappClassLoader clearReferencesThreads
严重: The web application [/] appears to have started a thread named [antesearch-5-thread] but has failed to stop it. This is very likely to create a memory leak.
三月 20, 2019 3:54:39 下午 org.apache.catalina.loader.WebappClassLoader clearReferencesThreads
严重: The web application [/] appears to have started a thread named [Thread-42] but has failed to stop it. This is very likely to create a memory leak.
三月 20, 2019 3:54:39 下午 org.apache.catalina.loader.WebappClassLoader clearReferencesThreads
严重: The web application [/] appears to have started a thread named [Thread-44] but has failed to stop it. This is very likely to create a memory leak.
三月 20, 2019 3:54:39 下午 org.apache.catalina.loader.WebappClassLoader clearReferencesThreads
严重: The web application [/] appears to have started a thread named [Thread-45] but has failed to stop it. This is very likely to create a memory leak.
三月 20, 2019 3:54:39 下午 org.apache.catalina.loader.WebappClassLoader clearReferencesThreads
严重: The web application [/] appears to have started a thread named [Thread-46] but has failed to stop it. This is very likely to create a memory leak.
三月 20, 2019 3:54:39 下午 org.apache.catalina.loader.WebappClassLoader clearReferencesThreads
严重: The web application [/] appears to have started a thread named [Thread-47] but has failed to stop it. This is very likely to create a memory leak.
三月 20, 2019 3:54:39 下午 org.apache.catalina.loader.WebappClassLoader clearReferencesThreads
严重: The web application [/] appears to have started a thread named [Thread-48] but has failed to stop it. This is very likely to create a memory leak.
三月 20, 2019 3:54:39 下午 org.apache.catalina.loader.WebappClassLoader clearReferencesThreads
严重: The web application [/] appears to have started a thread named [Thread-49] but has failed to stop it. This is very likely to create a memory leak.
三月 20, 2019 3:54:39 下午 org.apache.catalina.loader.WebappClassLoader clearReferencesThreads
严重: The web application [/] appears to have started a thread named [Thread-50] but has failed to stop it. This is very likely to create a memory leak.
三月 20, 2019 3:54:39 下午 org.apache.catalina.loader.WebappClassLoader clearReferencesThreads
严重: The web application [/] appears to have started a thread named [Thread-51] but has failed to stop it. This is very likely to create a memory leak.
三月 20, 2019 3:54:39 下午 org.apache.coyote.AbstractProtocol stop
信息: Stopping ProtocolHandler ["http-bio-127.0.0.1-8099"]
三月 20, 2019 3:54:39 下午 org.apache.coyote.AbstractProtocol destroy
信息: Destroying ProtocolHandler ["http-bio-127.0.0.1-8099"]

Csdn user default icon
上传中...
上传图片
插入图片
抄袭、复制答案,以达到刷声望分或其他目的的行为,在CSDN问答是严格禁止的,一经发现立刻封号。是时候展现真正的技术了!
其他相关推荐
osx 下的tomcat 配置,tomcat的文件路径怎么查看
初学小白,在网上搜索都是说按照那个文件路径启动 tomcat 里bin/startup.sh文件, 可是osx10.1里面的文件路径是中文,将下载后的tomcat放在桌面上,应该在终端里怎么 输入这个文件路径?
Ubuntu16.04安装ros Kinetic后 rosdep update一直不能过,使用了多种网上的办法依然不行
有时会一开始就报错有时会HIT几个url后报错,超时时间也更改过,但是重复命令一下午也没有成功过,求大佬们帮帮我 ERROR: unable to process source [https://raw.githubusercontent.com/ros/rosdistro/master/rosdep/osx-homebrew.yaml]: <urlopen error [Errno 111] Connection refused> (https://raw.githubusercontent.com/ros/rosdistro/master/rosdep/osx-homebrew.yaml)
OSX下,netbeans运行tomcat总是报错端口被占用,烦!谁能帮我,谢谢
未能启动 Tomcat, 服务器端口 8081 已在使用中。 /Volumes/mtian/MT/nbproject/build-impl.xml:1045: 部署错误: 未能启动 Tomcat, 服务器端口 8081 已在使用中。 有关详细信息, 请查看服务器日志。 构建失败 (总时间: 10 秒) 端口换了n遍不行,netbeans8.2+tomcat9
mac系统 intelliJ IDEA调用Maple接口,出现java.lang.UnsatisfiedLinkError和Reason: image not found问题
近期实验室配置项目环境,在macos系统上使用IDEA调用Maple接口 这是我的VM options ``` -ea -Djava.library.path="/Library/Frameworks/Maple.framework/Versions/2017/bin.APPLE_UNIVERSAL_OSX" -Xms1024m -Xmx6144m -XX:-UseGCOverheadLimit -XX:SurvivorRatio=8 -XX:+AggressiveOpts -Xss10m -Dfile.encoding=UTF-8 ``` 出现以下报错 ``` java.lang.UnsatisfiedLinkError: /Library/Frameworks/Maple.framework/Versions/2017/bin.APPLE_UNIVERSAL_OSX/libjopenmaple.jnilib: dlopen(/Library/Frameworks/Maple.framework/Versions/2017/bin.APPLE_UNIVERSAL_OSX/libjopenmaple.jnilib, 1): Library not loaded: @rpath/libhf.dylib Referenced from: /Library/Frameworks/Maple.framework/Versions/2017/bin.APPLE_UNIVERSAL_OSX/libjopenmaple.jnilib Reason: image not found at java.lang.ClassLoader$NativeLibrary.load(Native Method) at java.lang.ClassLoader.loadLibrary0(ClassLoader.java:1941) at java.lang.ClassLoader.loadLibrary(ClassLoader.java:1861) at java.lang.Runtime.loadLibrary0(Runtime.java:870) at java.lang.System.loadLibrary(System.java:1122) at com.maplesoft.openmaple.Engine.<clinit>(Unknown Source) at edu.uestc.auto.reasoning.core.maple.MapleEngineNOCache.<init>(MapleEngineNOCache.java:46) at edu.uestc.auto.reasoning.core.maple.thread.v2.MapleEngineThread.run(MapleEngineThread.java:40) Exception in thread "maple-evaluate-work" java.lang.UnsatisfiedLinkError: com.maplesoft.openmaple.Engine.getKernel([Ljava/lang/String;Lcom/maplesoft/openmaple/EngineCallBacks;Ljava/lang/Object;Ljava/lang/Object;)J at com.maplesoft.openmaple.Engine.getKernel(Native Method) at com.maplesoft.openmaple.Engine.<init>(Unknown Source) at edu.uestc.auto.reasoning.core.maple.MapleEngineNOCache.<init>(MapleEngineNOCache.java:46) at edu.uestc.auto.reasoning.core.maple.thread.v2.MapleEngineThread.run(MapleEngineThread.java:40) ``` 有人知道怎么解决吗?
用Mac版Matlab的fraclab工具箱计算分形维数时出错。
用Mac版Matlab的fraclab工具箱计算分形维数时出错 可以到达这个界面 ![图片说明](https://img-ask.csdn.net/upload/201911/28/1574905590_824947.png) 但是点击计算之后无论是自动还是手动都无法计算分形维数。 手动计算报错代码如下: MEX 文件 '/Applications/MATLAB_R2018a.app/toolbox/FracLab-2-2.2-Universal_20170325/FracLab-2.2-Universal/FracLab/Binaries/osx64intel/monolr.mexmaci64' 无效: dlopen(/Applications/MATLAB_R2018a.app/toolbox/FracLab-2-2.2-Universal_20170325/FracLab-2.2-Universal/FracLab/Binaries/osx64intel/monolr.mexmaci64, 6): Library not loaded: @loader_path/libmex.dylib Referenced from: /Applications/MATLAB_R2018a.app/toolbox/FracLab-2-2.2-Universal_20170325/FracLab-2.2-Universal/FracLab/Binaries/osx64intel/monolr.mexmaci64 Reason: image not found。 出错 fl_monolr (line 36) [a_hat,b_hat] = monolr(x,y,RegType,u{:}); 出错 choixbornes (line 64) [a_hat,b_hat]=fl_monolr(x(Indexes),y(Indexes),RegParam_bis{:}); 计算 Line ButtonDownFcn 时出错。 自动计算报错代码如下: MEX 文件 '/Applications/MATLAB_R2018a.app/toolbox/FracLab-2-2.2-Universal_20170325/FracLab-2.2-Universal/FracLab/Binaries/osx64intel/monolr.mexmaci64' 无效: dlopen(/Applications/MATLAB_R2018a.app/toolbox/FracLab-2-2.2-Universal_20170325/FracLab-2.2-Universal/FracLab/Binaries/osx64intel/monolr.mexmaci64, 6): Library not loaded: @loader_path/libmex.dylib Referenced from: /Applications/MATLAB_R2018a.app/toolbox/FracLab-2-2.2-Universal_20170325/FracLab-2.2-Universal/FracLab/Binaries/osx64intel/monolr.mexmaci64 Reason: image not found。 出错 fl_monolr (line 36) [a_hat,b_hat] = monolr(x,y,RegType,u{:}); 出错 fl_regression (line 89) [a_hat,b_hat]=fl_monolr(x,y,RegParam{:}); 出错 boxdim_listepoints (line 135) [boxdim,handlefig,bounds]=fl_regression(log2(tailles_carres),log2(Nboites),'-a_hat','BoxDimension',reg,RegParam{:}); 出错 boxdim_binaire (line 136) [boxdim,Nboites,handlefig,bounds]=boxdim_listepoints(listepoints,tailles_carres,pave_elementaire,Waitbar,reg,u{:}); 出错 fl_boxdim_compute (line 251) [dim,nb,handlefig]=boxdim_binaire(SignIn,box_size,AspectRatio,[],1,reg,RegParam{:}); 计算 UIControl Callback 时出错。 请求大佬帮忙看一下
【正则求助】根据 .XX:before 的格式获取XX的值
规则:根据 .XX:before 的格式获取XX的值 内容如下: Ih3619SECVoOXzQNMVA19DD+wp2IyITgOamxTRudb0qjenwuaNSUBcCCockm8m2/beJZdKULFlU1vwnSNjRU1MQ30whAU6LPCr6o4oLFpg7sn/riVSSybRbpGr4Lgn/Hz6xj50kbyKCyHmtiFMpH+SgSH5fWN/0BZ5HwZzwLv5jXVvT8OgwlxxwoDVGJYMKec6Q2JtDGLQl7l8G46+CsXtiyFm434UwJ29HGLSQ3AbZUjjYup26KdpS0xaseAAAA') format('woff2'),url(fonts/module/icon.ttf?t=1544578265837) format('truetype'),url(fonts/module/icon.svg?t=1544578265837#icon) format('svg')}[class*=modicon-],[class^=modicon-]{font-family:ModIcon!important;font-size:16px;font-style:normal;line-height:1;display:inline-block;vertical-align:middle;-webkit-font-smoothing:antialiased;-moz-osx-font-smoothing:grayscale}.modicon-1:before{content:"\e60b"}.modicon-2:before{content:"\e60c"}.modicon-3:before{content:"\e60d"}.modicon-4:before{content:"\e60e"}.modicon-5:before{content:"\e60f"}.modicon-6:before{content:"\e610"}.modicon-7:before{content:"\e611"}.modicon-8:before{content:"\e602"}.modicon-9:before{content:"\e603"}.modicon-10:before{content:"\e604"}.modicon-11:before{content:"\e605"}.modicon-136:before{content:"\e689"}.modicon-137:before{content:"\e68a"}.modicon-138:before{content:"\e68b"}
MAC OSX MyEclipse 2015 stable 控制台乱码
MAC osx 10.10.5,MyEclipse 2015 stable,JDK:1.7.0,tomcat8.0,不管是myeclipse自带tomcat还是自己装的tomcat控制台 都是乱码,写个main方法输出中文不是乱码,还有看了网上一些教程,那些的说法在这个版本上用不上 ![图片说明](https://img-ask.csdn.net/upload/201509/15/1442322957_359608.png) ![图片说明](https://img-ask.csdn.net/upload/201509/15/1442322473_677508.png) MyEclipse 2015 stable里面设置JDK和tomcat都变了,下面是一些配置图,网上说的方法大多 用不上,坐等大神 ![图片说明](https://img-ask.csdn.net/upload/201509/15/1442322679_279145.png) ![图片说明](https://img-ask.csdn.net/upload/201509/15/1442322637_627835.png) ![图片说明](https://img-ask.csdn.net/upload/201509/15/1442322697_962867.png) ![图片说明](https://img-ask.csdn.net/upload/201509/15/1442322660_587726.png)
osx android studio虚拟机启动黑屏
osx 10.11 Android studio 1.4 HAXM is working and emulator runs in fast virt mode emulator: emulator window was out of view and was recentered 错误如上 虚拟机启动后一直黑屏,无响应。以前1.2的时候没问题
xcode 和 python 有什么依赖关系?
我是iOS程序员,本来想学python, 装了半年python也没学. 最近电脑有点卡,那就把python删了吧. 第一个问题是:长按应用后,大部分应该左上角会出现x来删除,但是为什么有些不会? 把python和一些不用的应用删了后, 遇到了xcode打不开的问题,osx - Xcode 6.1: Loading a plug-in failed,在这里找到了解决方案,并且成功解决. 第二个问题是:xcode和python有什么关系,为什么我把python删了之后,xcode不能运行?
鼠标拖动报错,一直在网上找不到答案,求大神支招
按照书上描述麻了如下代码,居然报错了,报错了,报错了。一直百度不得其解,故上来问问大神 系统是osX,该下的模块以及依赖包都下好,就是有问题。 代码如下: ``` import pyautogui, time time.sleep(5) pyautogui.click() distance = 200 while distance >0: pyautogui.dragRel(distance, 0, duration=0.2) distance = distance - 5 pyautogui.dragRel(0, distance, duration=0.2) pyautogui.dragRel(-distance, 0, duration=0.2) distance = distance - 5 pyautogui.dragRel(0, -distance, duration=0.2) ``` 报错如下 ``` Traceback (most recent call last): File "/Users/jibohe/exercise.py", line 11, in <module> pyautogui.dragRel(distance,0,duration=0.2) File "/Library/Frameworks/Python.framework/Versions/3.7/lib/python3.7/site-packages/pyautogui/__init__.py", line 944, in dragRel _mouseMoveDrag('drag', mousex, mousey, xOffset, yOffset, duration, tween, button) File "/Library/Frameworks/Python.framework/Versions/3.7/lib/python3.7/site-packages/pyautogui/__init__.py", line 1053, in _mouseMoveDrag platformModule._dragTo(tweenX, tweenY, button) File "/Library/Frameworks/Python.framework/Versions/3.7/lib/python3.7/site-packages/pyautogui/_pyautogui_osx.py", line 436, in _dragTo assert False, "button argument not in ('left', 'middle', 'right')" AssertionError: button argument not in ('left', 'middle', 'right') ```
Mac OSx安装pkg安装文件报错安装失败
提示 安装器遇到一个错误,导致安装失败。请联系软件制造商以获得帮助。 不是安装文件的问题,好多安装包都是这个错误。 是在最后一步效验签名的时候出错了
osx下编译hadoop2.5.2的时候报错Ant BuildException
[ERROR] Failed to execute goal org.apache.maven.plugins:maven-antrun-plugin:1.7:run (site) on project hadoop-common: An Ant BuildException has occured: stylesheet /Users/narayan/Downloads/hadoop-2.5.2-src/hadoop-common-project/hadoop-common/${env.FINDBUGS_HOME}/src/xsl/default.xsl doesn't exist. [ERROR] around Ant part ...<xslt style="${env.FINDBUGS_HOME}/src/xsl/default.xsl" in="/Users/narayan/Downloads/hadoop-2.5.2-src/hadoop-common-project/hadoop-common/target/findbugsXml.xml" out="/Users/narayan/Downloads/hadoop-2.5.2-src/hadoop-common-project/hadoop-common/target/site/findbugs.html"/>... @ 44:275 in /Users/narayan/Downloads/hadoop-2.5.2-src/hadoop-common-project/hadoop-common/target/antrun/build-main.xml [ERROR] -> [Help 1] [ERROR] [ERROR] To see the full stack trace of the errors, re-run Maven with the -e switch. [ERROR] Re-run Maven using the -X switch to enable full debug logging. [ERROR] [ERROR] For more information about the errors and possible solutions, please read the following articles: [ERROR] [Help 1] http://cwiki.apache.org/confluence/display/MAVEN/MojoExecutionException [ERROR] [ERROR] After correcting the problems, you can resume the build with the command [ERROR] mvn <goals> -rf :hadoop-common 网上查是说少了findbugs?但是我brew安装了findbugs之后依然报错。然后说是在安装目录下$ ant 然后 Buildfile: build.xml does not exist! Build failed 还是需要其他的什么设置么?
在mac osx10.6下安装mysql后,启动总是报错ERROR 2002 (HY000): Can't connect to local MySQL ser
要在mac10.6下安装mysql以便rails开发,装了两天都没有成功。之前没用过mac或linux开发,一直用windows,所以希望高手们能指点一下。 我在安装时参考了以下文章: http://beike.iteye.com/blog/617341 http://hqman.iteye.com/blog/258979 下面是我的安装过程及错误: 安装和初始化mysql [code="java"]port search mysql sudo port install mysql5-server ########################################################### # A startup item has been generated that will aid in # starting mysql5-server with launchd. It is disabled # by default. Execute the following command to start it, # and to cause it to launch at startup: # # sudo port load mysql5-server ########################################################### ---> Installing mysql5-server @5.1.50_0 ****************************************************** * In order to setup the database, you might want to run * sudo -u _mysql mysql_install_db5 * if this is a new install ****************************************************** ---> Activating mysql5-server @5.1.50_0 ---> Cleaning mysql5-server[/code] [code="java"]sudo /opt/local/lib/mysql5/bin/mysql_install_db --user=mysql Installing MySQL system tables... OK Filling help tables... OK To start mysqld at boot time you have to copy support-files/mysql.server to the right place for your system PLEASE REMEMBER TO SET A PASSWORD FOR THE MySQL root USER ! To do so, start the server, then issue the following commands: /opt/local/lib/mysql5/bin/mysqladmin -u root password 'new-password' /opt/local/lib/mysql5/bin/mysqladmin -u root -h bogon password 'new-password' Alternatively you can run: /opt/local/lib/mysql5/bin/mysql_secure_installation which will also give you the option of removing the test databases and anonymous user created by default. This is strongly recommended for production servers. See the manual for more instructions. You can start the MySQL daemon with: cd /opt/local ; /opt/local/lib/mysql5/bin/mysqld_safe & You can test the MySQL daemon with mysql-test-run.pl cd /opt/local/mysql-test ; perl mysql-test-run.pl Please report any problems with the /opt/local/lib/mysql5/bin/mysqlbug script![/code] 配置mysql: 开机自动启动mysql [code="java"]sudo launchctl load -w /Library/LaunchDaemons/org.macports.mysql5.plist [/code] 启动mysql 如果要快捷启动,则要先设置aliases,再用aliases来启动: mate ~/.profile打开这个配置文件,输入以下内容: [code="java"]alias mysqlstart='sudo /opt/local/bin/mysqld_safe5 &' alias mysqlstop='/opt/local/bin/mysqladmin5 -u root -p shutdown'[/code] 启动mysql [code="java"]mysqlstart [1] 62478[/code] 如果没有设置aliases,则用以下命令来启动 /opt/local/share/mysql5/mysql/mysql.server start 验证mysql安装成功: [code="java"]mysqladmin5 -u root -p ping error: 'Can't connect to local MySQL server through socket '/opt/local/var/run/mysql5/mysqld.sock' (2)' Check that mysqld is running and that the socket: '/opt/local/var/run/mysql5/mysqld.sock' exists! [/code] 或 [code="java"]mysql5 -u root –p ERROR 2002 (HY000): Can't connect to local MySQL server through socket '/opt/local/var/run/mysql5/mysqld.sock' (2)[/code] mate /opt/local/etc/mysql5/my.cnf并输入以下内容(参考http://beike.iteye.com/blog/617341): [code="java"][mysqld_safe] socket = /tmp/mysql.sock[/code] 再调用 mysql5 -u root –p还是报相同错误。
pyinstaller打包处理的程序用不了
warn-xxx.txt文件的信息如下,求大佬处理 This file lists modules PyInstaller was not able to find. This does not necessarily mean this module is required for running you program. Python and Python 3rd-party packages include a lot of conditional or optional module. For example the module 'ntpath' only exists on Windows, whereas the module 'posixpath' only exists on Posix systems. Types if import: * top-level: imported at the top-level - look at these first * conditional: imported within an if-statement * delayed: imported from within a function * optional: imported within a try-except-statement IMPORTANT: Do NOT post this list to the issue-tracker. Use it as a basis for yourself tracking down the missing module. Thanks! missing module named pyimod03_importers - imported by PyInstaller.loader.pyimod02_archive (delayed, conditional), c:\program files\python37\lib\site-packages\PyInstaller\loader\rthooks\pyi_rth_pkgres.py (top-level) missing module named 'pkg_resources.extern.pyparsing' - imported by pkg_resources._vendor.packaging.requirements (top-level), pkg_resources._vendor.packaging.markers (top-level) missing module named 'com.sun' - imported by pkg_resources._vendor.appdirs (delayed, conditional, optional) missing module named com - imported by pkg_resources._vendor.appdirs (delayed) missing module named win32api - imported by distutils.msvccompiler (optional), pkg_resources._vendor.appdirs (delayed, conditional, optional) missing module named win32com.shell - imported by pkg_resources._vendor.appdirs (delayed, conditional, optional) missing module named _uuid - imported by uuid (optional) missing module named netbios - imported by uuid (delayed) missing module named win32wnet - imported by uuid (delayed) missing module named __builtin__ - imported by numpy.core.numerictypes (conditional), numpy.core.numeric (conditional), numpy.lib.function_base (conditional), numpy.lib._iotools (conditional), numpy.ma.core (conditional), numpy.distutils.misc_util (delayed, conditional), numpy (conditional), pymysql._compat (conditional), pkg_resources._vendor.pyparsing (conditional), setuptools._vendor.pyparsing (conditional) missing module named ordereddict - imported by pkg_resources._vendor.pyparsing (optional), setuptools._vendor.pyparsing (optional) missing module named StringIO - imported by PyInstaller.lib.modulegraph._compat (conditional), PyInstaller.lib.modulegraph.zipio (conditional), setuptools._vendor.six (conditional), numpy.lib.utils (delayed, conditional), numpy.lib.format (delayed, conditional), numpy.testing._private.utils (conditional), six (conditional), urllib3.packages.six (conditional), requests.compat (conditional), selenium.webdriver.remote.webelement (optional), pkg_resources._vendor.six (conditional) missing module named _scproxy - imported by urllib.request (conditional) missing module named 'macholib.MachO' - imported by PyInstaller.depend.dylib (delayed), PyInstaller.depend.bindepend (delayed), PyInstaller.utils.osx (top-level) missing module named macholib - imported by PyInstaller.depend.dylib (delayed, conditional) missing module named _pkgutil - imported by PyInstaller.lib.modulegraph.modulegraph (delayed, optional) missing module named dis3 - imported by PyInstaller.lib.modulegraph._compat (conditional) missing module named urllib.pathname2url - imported by urllib (conditional), PyInstaller.lib.modulegraph._compat (conditional) missing module named pyimod00_crypto_key - imported by PyInstaller.loader.pyimod02_archive (delayed, optional) missing module named thread - imported by numpy.core.arrayprint (conditional, optional), PyInstaller.loader.pyimod02_archive (conditional) missing module named 'macholib.dyld' - imported by PyInstaller.depend.bindepend (delayed) missing module named 'macholib.mach_o' - imported by PyInstaller.depend.bindepend (delayed) missing module named Crypto - imported by PyInstaller.building.makespec (delayed, conditional, optional) missing module named win32ctypes.core._time - imported by win32ctypes.core (top-level), win32ctypes.pywin32.win32api (top-level) missing module named win32ctypes.core._system_information - imported by win32ctypes.core (top-level), win32ctypes.pywin32.win32api (top-level) missing module named win32ctypes.core._resource - imported by win32ctypes.core (top-level), win32ctypes.pywin32.win32api (top-level) missing module named win32ctypes.core._dll - imported by win32ctypes.core (top-level), win32ctypes.pywin32.win32api (top-level) missing module named win32ctypes.core._common - imported by win32ctypes.core (top-level), win32ctypes.pywin32.win32api (top-level), win32ctypes.pywin32.win32cred (top-level) missing module named win32ctypes.core._authentication - imported by win32ctypes.core (top-level), win32ctypes.pywin32.win32cred (top-level) missing module named cffi - imported by win32ctypes.core (optional) missing module named UserDict - imported by PyInstaller.compat (conditional), pytz.lazy (optional) missing module named multiprocessing.set_start_method - imported by multiprocessing (top-level), multiprocessing.spawn (top-level) missing module named multiprocessing.get_start_method - imported by multiprocessing (top-level), multiprocessing.spawn (top-level) missing module named multiprocessing.TimeoutError - imported by multiprocessing (top-level), multiprocessing.pool (top-level) missing module named multiprocessing.get_context - imported by multiprocessing (top-level), multiprocessing.pool (top-level), multiprocessing.managers (top-level), multiprocessing.sharedctypes (top-level) missing module named multiprocessing.BufferTooShort - imported by multiprocessing (top-level), multiprocessing.connection (top-level) missing module named multiprocessing.AuthenticationError - imported by multiprocessing (top-level), multiprocessing.connection (top-level) missing module named pkg_resources.extern.packaging - imported by pkg_resources.extern (top-level), pkg_resources (top-level) missing module named pkg_resources.extern.appdirs - imported by pkg_resources.extern (top-level), pkg_resources (top-level) missing module named 'pkg_resources.extern.six.moves' - imported by pkg_resources (top-level), pkg_resources._vendor.packaging.requirements (top-level) missing module named pkg_resources.extern.six - imported by pkg_resources.extern (top-level), pkg_resources (top-level) missing module named 'multiprocessing.forking' - imported by c:\program files\python37\lib\site-packages\PyInstaller\loader\rthooks\pyi_rth_multiprocessing.py (optional) missing module named resource - imported by posix (top-level), E:\yxrj\dingzhi\cj\231.py (top-level) missing module named posix - imported by os (conditional, optional), E:\yxrj\dingzhi\cj\231.py (top-level) missing module named _posixsubprocess - imported by subprocess (conditional), multiprocessing.util (delayed), E:\yxrj\dingzhi\cj\231.py (top-level) missing module named readline - imported by cmd (delayed, conditional, optional), code (delayed, conditional, optional), pdb (delayed, optional), E:\yxrj\dingzhi\cj\231.py (top-level) excluded module named _frozen_importlib - imported by importlib (optional), importlib.abc (optional), PyInstaller.loader.pyimod02_archive (delayed, conditional), E:\yxrj\dingzhi\cj\231.py (top-level) missing module named _frozen_importlib_external - imported by importlib._bootstrap (delayed), importlib (optional), importlib.abc (optional), E:\yxrj\dingzhi\cj\231.py (top-level) missing module named _winreg - imported by platform (delayed, optional), numpy.distutils.cpuinfo (delayed, conditional, optional), requests.utils (delayed, conditional, optional), selenium.webdriver.firefox.firefox_binary (delayed, optional), E:\yxrj\dingzhi\cj\231.py (top-level), pkg_resources._vendor.appdirs (delayed) missing module named java - imported by platform (delayed), E:\yxrj\dingzhi\cj\231.py (top-level) missing module named 'java.lang' - imported by platform (delayed, optional), xml.sax._exceptions (conditional), E:\yxrj\dingzhi\cj\231.py (top-level) missing module named vms_lib - imported by platform (delayed, conditional, optional), E:\yxrj\dingzhi\cj\231.py (top-level) missing module named termios - imported by tty (top-level), getpass (optional), E:\yxrj\dingzhi\cj\231.py (top-level) missing module named urllib.getproxies_environment - imported by urllib (conditional), requests.compat (conditional) missing module named urllib.proxy_bypass_environment - imported by urllib (conditional), requests.compat (conditional) missing module named urllib.proxy_bypass - imported by urllib (conditional), requests.compat (conditional) missing module named urllib.getproxies - imported by urllib (conditional), requests.compat (conditional) missing module named urllib.unquote_plus - imported by urllib (conditional), requests.compat (conditional) missing module named urllib.quote_plus - imported by urllib (conditional), requests.compat (conditional) missing module named urllib.unquote - imported by urllib (conditional), requests.compat (conditional) missing module named urllib.urlencode - imported by urllib (optional), urllib3.packages.rfc3986.compat (optional), requests.compat (conditional) missing module named urllib.quote - imported by urllib (optional), urllib3.packages.rfc3986.compat (optional), requests.compat (conditional) missing module named grp - imported by shutil (optional), tarfile (optional), pathlib (delayed), distutils.archive_util (optional), E:\yxrj\dingzhi\cj\231.py (top-level) missing module named 'org.python' - imported by pickle (optional), xml.sax (delayed, conditional), setuptools.sandbox (conditional), E:\yxrj\dingzhi\cj\231.py (top-level) missing module named org - imported by copy (optional), E:\yxrj\dingzhi\cj\231.py (top-level) missing module named pwd - imported by posixpath (delayed, conditional), shutil (optional), tarfile (optional), http.server (delayed, optional), webbrowser (delayed), pathlib (delayed, conditional, optional), distutils.util (delayed, conditional), distutils.archive_util (optional), netrc (delayed, conditional), getpass (delayed), E:\yxrj\dingzhi\cj\231.py (top-level) missing module named urllib2 - imported by numpy.lib._datasource (delayed, conditional), requests.compat (conditional), selenium.webdriver.common.utils (delayed, optional), selenium.webdriver.common.service (delayed, optional) missing module named urlparse - imported by numpy.lib._datasource (delayed, conditional), requests.compat (conditional), selenium.webdriver.remote.remote_connection (optional) runtime module named urllib3.packages.six.moves - imported by http.client (top-level), urllib3.connectionpool (top-level), urllib3.util.response (top-level), 'urllib3.packages.six.moves.urllib' (top-level), urllib3.response (top-level), urllib3.util.queue (top-level) missing module named 'OpenSSL.crypto' - imported by urllib3.contrib.pyopenssl (delayed) missing module named 'cryptography.x509' - imported by urllib3.contrib.pyopenssl (delayed, optional) missing module named 'cryptography.hazmat' - imported by pymysql._auth (optional), urllib3.contrib.pyopenssl (top-level) missing module named cryptography - imported by pymysql._auth (optional), urllib3.contrib.pyopenssl (top-level), requests (optional) missing module named OpenSSL - imported by urllib3.contrib.pyopenssl (top-level) missing module named 'backports.ssl_match_hostname' - imported by setuptools.ssl_support (optional), urllib3.packages.ssl_match_hostname (optional) missing module named brotli - imported by urllib3.util.request (optional), urllib3.response (optional) missing module named "'urllib3.packages.six.moves.urllib'.parse" - imported by urllib3.request (top-level), urllib3.poolmanager (top-level) missing module named Queue - imported by urllib3.util.queue (conditional) missing module named httplib - imported by selenium.webdriver.safari.webdriver (optional), selenium.webdriver.blackberry.webdriver (optional), selenium.webdriver.webkitgtk.webdriver (optional) missing module named cStringIO - imported by selenium.webdriver.firefox.firefox_profile (optional) missing module named copy_reg - imported by numpy.core (conditional), soupsieve.util (conditional), cStringIO (top-level) missing module named 'backports.functools_lru_cache' - imported by soupsieve.util (conditional) missing module named iconv_codec - imported by bs4.dammit (optional) missing module named cchardet - imported by bs4.dammit (optional) missing module named lxml - imported by bs4.builder._lxml (top-level) missing module named 'html5lib.treebuilders' - imported by bs4.builder._html5lib (optional) missing module named 'html5lib.constants' - imported by bs4.builder._html5lib (top-level) missing module named html5lib - imported by bs4.builder._html5lib (top-level) missing module named Cookie - imported by requests.compat (conditional) missing module named cookielib - imported by requests.compat (conditional) missing module named simplejson - imported by pandas.util._print_versions (delayed, conditional, optional), requests.compat (optional) missing module named socks - imported by urllib3.contrib.socks (optional) missing module named _dummy_threading - imported by dummy_threading (optional) missing module named ConfigParser - imported by numpy.distutils.system_info (conditional), numpy.distutils.npy_pkg_config (conditional), pymysql.optionfile (conditional) missing module named scipy - imported by numpy.testing._private.nosetester (delayed, conditional), pandas.core.missing (delayed) missing module named numexpr - imported by pandas.core.computation.expressions (conditional), pandas.core.computation.engines (delayed) missing module named 'scipy.stats' - imported by pandas.plotting._matplotlib.hist (delayed), pandas.plotting._matplotlib.misc (delayed, conditional), pandas.core.nanops (delayed, conditional) missing module named 'scipy.signal' - imported by pandas.core.window (delayed, conditional) missing module named commands - imported by numpy.distutils.cpuinfo (conditional) missing module named setuptools.extern.packaging - imported by setuptools.extern (top-level), setuptools.dist (top-level), setuptools.command.egg_info (top-level) missing module named 'setuptools.extern.six' - imported by setuptools (top-level), setuptools.extension (top-level) missing module named setuptools.extern.six.moves.filterfalse - imported by setuptools.extern.six.moves (top-level), setuptools.dist (top-level), setuptools.msvc (top-level) missing module named setuptools.extern.six.moves.filter - imported by setuptools.extern.six.moves (top-level), setuptools.dist (top-level), setuptools.ssl_support (top-level), setuptools.command.py36compat (top-level) missing module named _manylinux - imported by setuptools.pep425tags (delayed, optional) missing module named wincertstore - imported by setuptools.ssl_support (delayed, optional) missing module named backports - imported by setuptools.ssl_support (optional) missing module named 'setuptools._vendor.six.moves' - imported by 'setuptools._vendor.six.moves' (top-level) missing module named 'setuptools.extern.pyparsing' - imported by setuptools._vendor.packaging.requirements (top-level), setuptools._vendor.packaging.markers (top-level) missing module named 'setuptools.extern.packaging.version' - imported by setuptools.msvc (top-level) missing module named setuptools.extern.six.moves.map - imported by setuptools.extern.six.moves (top-level), setuptools.dist (top-level), setuptools.command.easy_install (top-level), setuptools.sandbox (top-level), setuptools.package_index (top-level), setuptools.ssl_support (top-level), setuptools.command.egg_info (top-level), setuptools.namespaces (top-level) runtime module named setuptools.extern.six.moves - imported by setuptools.dist (top-level), setuptools.py33compat (top-level), setuptools.command.easy_install (top-level), setuptools.sandbox (top-level), setuptools.command.setopt (top-level), setuptools.package_index (top-level), setuptools.ssl_support (top-level), setuptools.command.egg_info (top-level), setuptools.command.py36compat (top-level), setuptools.namespaces (top-level), setuptools.msvc (top-level), 'setuptools._vendor.six.moves' (top-level) missing module named setuptools.extern.six - imported by setuptools.extern (top-level), setuptools.monkey (top-level), setuptools.dist (top-level), setuptools.extern.six.moves (top-level), setuptools.py33compat (top-level), setuptools.config (top-level), setuptools.command.easy_install (top-level), setuptools.sandbox (top-level), setuptools.py27compat (top-level), setuptools.package_index (top-level), setuptools.wheel (top-level), setuptools.command.egg_info (top-level), setuptools.command.sdist (top-level), setuptools.command.bdist_egg (top-level), setuptools.unicode_utils (top-level), setuptools.glob (top-level), setuptools.command.develop (top-level) missing module named 'numpy_distutils.cpuinfo' - imported by numpy.f2py.diagnose (delayed, conditional, optional) missing module named 'numpy_distutils.fcompiler' - imported by numpy.f2py.diagnose (delayed, conditional, optional) missing module named 'numpy_distutils.command' - imported by numpy.f2py.diagnose (delayed, conditional, optional) missing module named numpy_distutils - imported by numpy.f2py.diagnose (delayed, optional) missing module named 'nose.plugins' - imported by numpy.testing._private.noseclasses (top-level), numpy.testing._private.nosetester (delayed) missing module named numpy.core.number - imported by numpy.core (delayed), numpy.testing._private.utils (delayed) missing module named numpy.core.signbit - imported by numpy.core (delayed), numpy.testing._private.utils (delayed) missing module named numpy.core.float64 - imported by numpy.core (delayed), numpy.testing._private.utils (delayed) missing module named numpy.core.integer - imported by numpy.core (top-level), numpy.fft.helper (top-level) missing module named numpy.core.conjugate - imported by numpy.core (top-level), numpy.fft.pocketfft (top-level) missing module named numpy.core.sign - imported by numpy.core (top-level), numpy.linalg.linalg (top-level) missing module named numpy.core.divide - imported by numpy.core (top-level), numpy.linalg.linalg (top-level) missing module named numpy.core.object_ - imported by numpy.core (top-level), numpy.linalg.linalg (top-level) missing module named numpy.core.geterrobj - imported by numpy.core (top-level), numpy.linalg.linalg (top-level) missing module named numpy.core.sqrt - imported by numpy.core (top-level), numpy.linalg.linalg (top-level), numpy.fft.pocketfft (top-level) missing module named numpy.core.add - imported by numpy.core (top-level), numpy.linalg.linalg (top-level) missing module named numpy.core.complexfloating - imported by numpy.core (top-level), numpy.linalg.linalg (top-level) missing module named numpy.core.inexact - imported by numpy.core (top-level), numpy.linalg.linalg (top-level) missing module named numpy.core.cdouble - imported by numpy.core (top-level), numpy.linalg.linalg (top-level) missing module named numpy.core.csingle - imported by numpy.core (top-level), numpy.linalg.linalg (top-level) missing module named numpy.core.double - imported by numpy.core (top-level), numpy.linalg.linalg (top-level) missing module named numpy.core.single - imported by numpy.core (top-level), numpy.linalg.linalg (top-level) missing module named numpy.core.float32 - imported by numpy.core (top-level), numpy.testing._private.utils (top-level) missing module named numpy.core.intp - imported by numpy.core (top-level), numpy.testing._private.utils (top-level), numpy.linalg.linalg (top-level) missing module named numpy.eye - imported by numpy (delayed), numpy.core.numeric (delayed) missing module named dummy_thread - imported by numpy.core.arrayprint (conditional, optional) missing module named 'nose.util' - imported by numpy.testing._private.noseclasses (top-level) missing module named nose - imported by numpy.testing._private.utils (delayed, optional), numpy.testing._private.decorators (delayed), numpy.testing._private.noseclasses (top-level) missing module named win32pdh - imported by numpy.testing._private.utils (delayed, conditional) missing module named __svn_version__ - imported by numpy.f2py.__version__ (optional) missing module named numarray - imported by numpy.distutils.system_info (delayed, conditional, optional) missing module named Numeric - imported by numpy.distutils.system_info (delayed, conditional, optional) missing module named win32con - imported by distutils.msvccompiler (optional) missing module named _curses - imported by curses (top-level), curses.has_key (top-level) missing module named pytest - imported by numpy._pytesttester (delayed), pandas.util._tester (delayed, optional), pandas.util.testing (delayed, conditional, optional) missing module named future_builtins - imported by numpy.lib.npyio (conditional) missing module named cpickle - imported by numpy.compat.py3k (conditional) missing module named pickle5 - imported by numpy.compat.py3k (conditional, optional) missing module named numpy.histogramdd - imported by numpy (delayed), numpy.lib.twodim_base (delayed) missing module named numpy.lib.i0 - imported by numpy.lib (top-level), numpy.dual (top-level) missing module named 'scipy.sparse' - imported by pandas.core.sparse.scipy_sparse (delayed), pandas.core.arrays.sparse (delayed), pandas.core.dtypes.common (delayed, conditional, optional) missing module named botocore - imported by pandas.io.s3 (delayed) missing module named 'pyarrow.parquet' - imported by pandas.io.parquet (delayed) missing module named pyarrow - imported by pandas.io.feather_format (delayed) missing module named contextmanager - imported by dateutil.tz.tz (optional) runtime module named six.moves - imported by dateutil.tz.tz (top-level), dateutil.tz.win (top-level), dateutil.rrule (top-level) missing module named six.moves.range - imported by six.moves (top-level), dateutil.rrule (top-level) missing module named dateutil.tz.tzfile - imported by dateutil.tz (top-level), dateutil.zoneinfo (top-level) missing module named dateutil.tz.tzlocal - imported by dateutil.tz (top-level), dateutil.rrule (top-level) missing module named dateutil.tz.tzutc - imported by dateutil.tz (top-level), dateutil.rrule (top-level) missing module named PyQt4 - imported by pandas.io.clipboard.clipboards (delayed, optional), pandas.io.clipboard (delayed, conditional, optional) missing module named PyQt5 - imported by pandas.io.clipboard.clipboards (delayed, optional), pandas.io.clipboard (delayed, conditional, optional) missing module named qtpy - imported by pandas.io.clipboard.clipboards (delayed, optional), pandas.io.clipboard (delayed, conditional, optional) missing module named 'sqlalchemy.types' - imported by pandas.io.sql (delayed, conditional) missing module named 'sqlalchemy.schema' - imported by pandas.io.sql (delayed, conditional) missing module named sqlalchemy - imported by pandas.io.sql (delayed, conditional, optional) missing module named tables - imported by pandas.io.pytables (delayed, conditional) missing module named xlwt - imported by pandas.io.excel._xlwt (delayed) missing module named xlsxwriter - imported by pandas.io.excel._xlsxwriter (delayed) missing module named 'openpyxl.styles' - imported by pandas.io.excel._openpyxl (delayed) missing module named 'openpyxl.style' - imported by pandas.io.excel._openpyxl (delayed) missing module named openpyxl - imported by pandas.io.excel._openpyxl (delayed, conditional) missing module named xlrd - imported by pandas.io.excel._xlrd (delayed) missing module named 'odf.namespaces' - imported by pandas.io.excel._odfreader (delayed) missing module named 'odf.table' - imported by pandas.io.excel._odfreader (delayed) missing module named 'odf.opendocument' - imported by pandas.io.excel._odfreader (delayed) missing module named odf - imported by pandas.io.excel._odfreader (delayed) missing module named matplotlib - imported by pandas.plotting._matplotlib.boxplot (top-level), pandas.plotting._matplotlib.compat (delayed, optional), pandas.plotting._matplotlib.timeseries (delayed), pandas.plotting._matplotlib.core (delayed), pandas.io.formats.style (optional) missing module named 'matplotlib.pyplot' - imported by pandas.plotting._matplotlib.style (delayed), pandas.plotting._matplotlib.tools (delayed), pandas.plotting._matplotlib.core (delayed), pandas.plotting._matplotlib.timeseries (delayed), pandas.plotting._matplotlib.boxplot (delayed), pandas.plotting._matplotlib.hist (delayed), pandas.plotting._matplotlib.misc (delayed), pandas.plotting._matplotlib (delayed), pandas.io.formats.style (optional), pandas.util.testing (delayed) missing module named numpy.array - imported by numpy (top-level), numpy.ma.core (top-level), numpy.ma.extras (top-level), numpy.ma.mrecords (top-level), numpy.ctypeslib (top-level) missing module named numpy.recarray - imported by numpy (top-level), numpy.ma.mrecords (top-level) missing module named numpy.ndarray - imported by numpy (top-level), numpy.ma.core (top-level), numpy.ma.extras (top-level), numpy.ma.mrecords (top-level), numpy.ctypeslib (top-level), pandas.compat.numpy.function (top-level) missing module named numpy.dtype - imported by numpy (top-level), numpy.ma.mrecords (top-level), numpy.ctypeslib (top-level) missing module named numpy.bool_ - imported by numpy (top-level), numpy.ma.core (top-level), numpy.ma.mrecords (top-level) missing module named 'matplotlib.ticker' - imported by pandas.plotting._matplotlib.converter (top-level), pandas.plotting._matplotlib.tools (top-level), pandas.plotting._matplotlib.core (delayed) missing module named 'matplotlib.table' - imported by pandas.plotting._matplotlib.tools (top-level) missing module named 'matplotlib.colors' - imported by pandas.plotting._matplotlib.style (top-level) missing module named 'matplotlib.cm' - imported by pandas.plotting._matplotlib.style (top-level) missing module named 'matplotlib.patches' - imported by pandas.plotting._matplotlib.misc (top-level) missing module named 'matplotlib.lines' - imported by pandas.plotting._matplotlib.misc (top-level) missing module named 'matplotlib.axes' - imported by pandas.plotting._matplotlib.core (delayed) missing module named 'matplotlib.units' - imported by pandas.plotting._matplotlib.converter (top-level) missing module named 'matplotlib.transforms' - imported by pandas.plotting._matplotlib.converter (top-level) missing module named 'matplotlib.dates' - imported by pandas.plotting._matplotlib.converter (top-level) missing module named numpy.expand_dims - imported by numpy (top-level), numpy.ma.core (top-level) missing module named numpy.iscomplexobj - imported by numpy (top-level), numpy.ma.core (top-level) missing module named numpy.amin - imported by numpy (top-level), numpy.ma.core (top-level) missing module named numpy.amax - imported by numpy (top-level), numpy.ma.core (top-level) missing module named 'IPython.core' - imported by pandas.io.formats.printing (delayed, conditional) missing module named IPython - imported by pandas.io.formats.printing (delayed) missing module named s3fs - imported by pandas.io.common (delayed, optional) missing module named sets - imported by pytz.tzinfo (optional) missing module named numpy.random.randn - imported by numpy.random (top-level), pandas.util.testing (top-level) missing module named numpy.random.rand - imported by numpy.random (top-level), pandas.util.testing (top-level) missing module named hypothesis - imported by pandas.util._tester (delayed, optional) missing module named 'lxml.etree' - imported by pandas.io.html (delayed) missing module named 'lxml.html' - imported by pandas.io.html (delayed)
hexo博客无法显示背景图片
hexo框架写的博客,主题是next,本地预览可以看到背景,但是真实网站看不到,已经试过先hexo c之后再上传,还是没有用 hexo的配置文件 ``` # Hexo Configuration ## Docs: https://hexo.io/docs/configuration.html ## Source: https://github.com/hexojs/hexo/ # Site title: subtitle: description: 这是一个搞着玩的博客,功能暂未完全完善,将就着看吧您内~! keywords: author: 肖肖 language: zh-Hans timezone: # URL ## If your site is put in a subdirectory, set url as 'http://yoursite.com/child' and root as '/child/' url: http://yoursite.com root: / permalink: :year/:month/:day/:title/ permalink_defaults: # Directory source_dir: source public_dir: public tag_dir: tags archive_dir: archives category_dir: categories code_dir: downloads/code i18n_dir: :lang skip_render: # Writing new_post_name: :title.md # File name of new posts default_layout: post titlecase: false # Transform title into titlecase external_link: true # Open external links in new tab filename_case: 0 render_drafts: false post_asset_folder: true relative_link: false future: true highlight: enable: true line_number: true auto_detect: false tab_replace: # Home page setting # path: Root path for your blogs index page. (default = '') # per_page: Posts displayed per page. (0 = disable pagination) # order_by: Posts order. (Order by date descending by default) index_generator: path: '' per_page: 10 order_by: -date # Category & Tag default_category: uncategorized category_map: tag_map: # Date / Time format ## Hexo uses Moment.js to parse and display date ## You can customize the date format as defined in ## http://momentjs.com/docs/#/displaying/format/ date_format: YYYY-MM-DD time_format: HH:mm:ss # Pagination ## Set per_page to 0 to disable pagination per_page: 10 pagination_dir: page # Extensions ## Plugins: https://hexo.io/plugins/ ## Themes: https://hexo.io/themes/ theme: next # Deployment ## Docs: https://hexo.io/docs/deployment.html deploy: type: git repo: branch: master ``` 然后是next的配置文件 ``` # =============================================================== # ========================= ATTENTION! ========================== # =============================================================== # NexT repository is moving here: https://github.com/theme-next # =============================================================== # It's rebase to v6.0.0 and future maintenance will resume there # =============================================================== # --------------------------------------------------------------- # Theme Core Configuration Settings # --------------------------------------------------------------- # Set to true, if you want to fully override the default configuration. # Useful if you don't want to inherit the theme _config.yml configurations. override: false # --------------------------------------------------------------- # Site Information Settings # --------------------------------------------------------------- # To get or check favicons visit: https://realfavicongenerator.net # Put your favicons into `hexo-site/source/` (recommend) or `hexo-site/themes/next/source/images/` directory. # Default NexT favicons placed in `hexo-site/themes/next/source/images/` directory. # And if you want to place your icons in `hexo-site/source/` root directory, you must remove `/images` prefix from pathes. # For example, you put your favicons into `hexo-site/source/images` directory. # Then need to rename & redefine they on any other names, otherwise icons from Next will rewrite your custom icons in Hexo. favicon: small: /images/favicon-16x16-next.png medium: /images/favicon.ico apple_touch_icon: /images/apple-touch-icon-next.png safari_pinned_tab: /images/logo.svg #android_manifest: /images/manifest.json #ms_browserconfig: /images/browserconfig.xml # Set default keywords (Use a comma to separate) keywords: "Hexo, NexT" # Set rss to false to disable feed link. # Leave rss as empty to use site's feed link. # Set rss to specific value if you have burned your feed already. rss: footer: # Specify the date when the site was setup. # If not defined, current year will be used. since: 2019 # Icon between year and copyright info. icon: user # If not defined, will be used `author` from Hexo main config. copyright: # ------------------------------------------------------------- # Hexo link (Powered by Hexo). powered: true theme: # Theme & scheme info link (Theme - NexT.scheme). enable: true # Version info of NexT after scheme info (vX.X.X). version: true # ------------------------------------------------------------- # Any custom text can be defined here. #custom_text: Hosted by <a target="_blank" href="https://pages.github.com">GitHub Pages</a> # --------------------------------------------------------------- # SEO Settings # --------------------------------------------------------------- # Canonical, set a canonical link tag in your hexo, you could use it for your SEO of blog. # See: https://support.google.com/webmasters/answer/139066 # Tips: Before you open this tag, remember set up your URL in hexo _config.yml ( ex. url: http://yourdomain.com ) canonical: true # Change headers hierarchy on site-subtitle (will be main site description) and on all post/pages titles for better SEO-optimization. seo: false # If true, will add site-subtitle to index page, added in main hexo config. # subtitle: Subtitle index_with_subtitle: false # --------------------------------------------------------------- # Menu Settings # --------------------------------------------------------------- # When running the site in a subdirectory (e.g. domain.tld/blog), remove the leading slash from link value (/archives -> archives). # Usage: `Key: /link/ || icon` # Key is the name of menu item. If translate for this menu will find in languages - this translate will be loaded; if not - Key name will be used. Key is case-senstive. # Value before `||` delimeter is the target link. # Value after `||` delimeter is the name of FontAwesome icon. If icon (with or without delimeter) is not specified, question icon will be loaded. menu: home: / || home #about: /about/ || user #tags: /tags/ || tags #categories: /categories/ || th archives: /archives/ || archive #schedule: /schedule/ || calendar #sitemap: /sitemap.xml || sitemap #commonweal: /404/ || heartbeat # Enable/Disable menu icons. menu_icons: enable: true # --------------------------------------------------------------- # Scheme Settings # --------------------------------------------------------------- # Schemes #scheme: Muse #scheme: Mist #scheme: Pisces scheme: Gemini # --------------------------------------------------------------- # Sidebar Settings # --------------------------------------------------------------- # Social Links. # Usage: `Key: permalink || icon` # Key is the link label showing to end users. # Value before `||` delimeter is the target permalink. # Value after `||` delimeter is the name of FontAwesome icon. If icon (with or without delimeter) is not specified, globe icon will be loaded. #social: #GitHub: https://github.com/yourname || github #E-Mail: mailto:yourname@gmail.com || envelope #Google: https://plus.google.com/yourname || google #Twitter: https://twitter.com/yourname || twitter #FB Page: https://www.facebook.com/yourname || facebook #VK Group: https://vk.com/yourname || vk #StackOverflow: https://stackoverflow.com/yourname || stack-overflow #YouTube: https://youtube.com/yourname || youtube #Instagram: https://instagram.com/yourname || instagram #Skype: skype:yourname?call|chat || skype social_icons: enable: true icons_only: false transition: false # Blog rolls links_icon: link links_title: Links links_layout: block #links_layout: inline #links: #Title: http://example.com/ # Sidebar Avatar # in theme directory(source/images): /images/avatar.gif # in site directory(source/uploads): /uploads/avatar.gif avatar: /images/avatar.png # Table Of Contents in the Sidebar toc: enable: true # Automatically add list number to toc. number: true # If true, all words will placed on next lines if header width longer then sidebar width. wrap: false # Creative Commons 4.0 International License. # http://creativecommons.org/ # Available: by | by-nc | by-nc-nd | by-nc-sa | by-nd | by-sa | zero #creative_commons: by-nc-sa #creative_commons: sidebar: # Sidebar Position, available value: left | right (only for Pisces | Gemini). position: left #position: right # Sidebar Display, available value (only for Muse | Mist): # - post expand on posts automatically. Default. # - always expand for all pages automatically # - hide expand only when click on the sidebar toggle icon. # - remove Totally remove sidebar including sidebar toggle. display: post #display: always #display: hide #display: remove # Sidebar offset from top menubar in pixels (only for Pisces | Gemini). offset: 12 # Back to top in sidebar (only for Pisces | Gemini). b2t: false # Scroll percent label in b2t button. scrollpercent: true # Enable sidebar on narrow view (only for Muse | Mist). onmobile: true # --------------------------------------------------------------- # Post Settings # --------------------------------------------------------------- # Automatically scroll page to section which is under <!-- more --> mark. scroll_to_more: true # Automatically saving scroll position on each post/page in cookies. save_scroll: false # Automatically excerpt description in homepage as preamble text. excerpt_description: true # Automatically Excerpt. Not recommend. # Please use <!-- more --> in the post to control excerpt accurately. auto_excerpt: enable: true length: 0 # Post meta display settings post_meta: item_text: true created_at: true updated_at: false categories: true # Post wordcount display settings # Dependencies: https://github.com/willin/hexo-wordcount post_wordcount: item_text: true wordcount: true min2read: true totalcount: false separated_meta: true # Wechat Subscriber #wechat_subscriber: #enabled: true #qcode: /path/to/your/wechatqcode ex. /uploads/wechat-qcode.jpg #description: ex. subscribe to my blog by scanning my public wechat account # Reward #reward_comment: Donate comment here #wechatpay: /images/wechatpay.jpg #alipay: /images/alipay.jpg #bitcoin: /images/bitcoin.png # Declare license on posts post_copyright: enable: false license: CC BY-NC-SA 3.0 license_url: https://creativecommons.org/licenses/by-nc-sa/3.0/ # --------------------------------------------------------------- # Misc Theme Settings # --------------------------------------------------------------- # Reduce padding / margin indents on devices with narrow width. mobile_layout_economy: false # Android Chrome header panel color ($black-deep). android_chrome_color: "#222" # Custom Logo. # !!Only available for Default Scheme currently. # Options: # enabled: [true/false] - Replace with specific image # image: url-of-image - Images's url custom_logo: enabled: true image: # Code Highlight theme # Available value: # normal | night | night eighties | night blue | night bright # https://github.com/chriskempson/tomorrow-theme highlight_theme: normal # --------------------------------------------------------------- # Font Settings # - Find fonts on Google Fonts (https://www.google.com/fonts) # - All fonts set here will have the following styles: # light, light italic, normal, normal italic, bold, bold italic # - Be aware that setting too much fonts will cause site running slowly # - Introduce in 5.0.1 # --------------------------------------------------------------- # CAUTION! Safari Version 10.1.2 bug: https://github.com/iissnan/hexo-theme-next/issues/1844 # To avoid space between header and sidebar in Pisces / Gemini themes recommended to use Web Safe fonts for `global` (and `logo`): # Arial | Tahoma | Helvetica | Times New Roman | Courier New | Verdana | Georgia | Palatino | Garamond | Comic Sans MS | Trebuchet MS # --------------------------------------------------------------- font: enable: true # Uri of fonts host. E.g. //fonts.googleapis.com (Default). host: # Font options: # `external: true` will load this font family from `host` above. # `family: Times New Roman`. Without any quotes. # `size: xx`. Use `px` as unit. # Global font settings used on <body> element. global: external: true family: Lato size: # Font settings for Headlines (h1, h2, h3, h4, h5, h6). # Fallback to `global` font settings. headings: external: true family: size: # Font settings for posts. # Fallback to `global` font settings. posts: external: true family: # Font settings for Logo. # Fallback to `global` font settings. logo: external: true family: size: # Font settings for <code> and code blocks. codes: external: true family: size: # --------------------------------------------------------------- # Third Party Services Settings # --------------------------------------------------------------- # MathJax Support mathjax: enable: false per_page: false cdn: //cdn.bootcss.com/mathjax/2.7.1/latest.js?config=TeX-AMS-MML_HTMLorMML # Han Support docs: https://hanzi.pro/ han: false # Swiftype Search API Key #swiftype_key: # Baidu Analytics ID #baidu_analytics: # Duoshuo ShortName #duoshuo_shortname: # Disqus disqus: enable: false shortname: count: true # Hypercomments #hypercomments_id: # changyan changyan: enable: false appid: appkey: # Valine. # You can get your appid and appkey from https://leancloud.cn # more info please open https://valine.js.org valine: enable: true appid: appkey: notify: false # mail notifier , https://github.com/xCss/Valine/wiki verify: false # Verification code placeholder: 高冷的你说点什么吧( ´・・)ノ(._.`) avatar: mm # gravatar style guest_info: nick,mail,link # custom comment header pageSize: 10 # pagination size # Support for youyan comments system. # You can get your uid from http://www.uyan.cc #youyan_uid: your uid # Support for LiveRe comments system. # You can get your uid from https://livere.com/insight/myCode (General web site) #livere_uid: your uid # Gitment # Introduction: https://imsun.net/posts/gitment-introduction/ # You can get your Github ID from https://api.github.com/users/<Github username> gitment: enable: false mint: true # RECOMMEND, A mint on Gitment, to support count, language and proxy_gateway count: true # Show comments count in post meta area lazy: false # Comments lazy loading with a button cleanly: false # Hide 'Powered by ...' on footer, and more language: # Force language, or auto switch by theme github_user: # MUST HAVE, Your Github ID github_repo: # MUST HAVE, The repo you use to store Gitment comments client_id: # MUST HAVE, Github client id for the Gitment client_secret: # EITHER this or proxy_gateway, Github access secret token for the Gitment proxy_gateway: # Address of api proxy, See: https://github.com/aimingoo/intersect redirect_protocol: # Protocol of redirect_uri with force_redirect_protocol when mint enabled # Baidu Share # Available value: # button | slide # Warning: Baidu Share does not support https. #baidushare: ## type: button # Share # This plugin is more useful in China, make sure you known how to use it. # And you can find the use guide at official webiste: http://www.jiathis.com/. # Warning: JiaThis does not support https. #jiathis: ##uid: Get this uid from http://www.jiathis.com/ #add_this_id: # Share duoshuo_share: true # NeedMoreShare2 # This plugin is a pure javascript sharing lib which is useful in China. # See: https://github.com/revir/need-more-share2 # Also see: https://github.com/DzmVasileusky/needShareButton # iconStyle: default | box # boxForm: horizontal | vertical # position: top / middle / bottom + Left / Center / Right networks: Weibo,Wechat,Douban,QQZone,Twitter,Linkedin,Mailto,Reddit, # Delicious,StumbleUpon,Pinterest,Facebook,GooglePlus,Slashdot, # Technorati,Posterous,Tumblr,GoogleBookmarks,Newsvine, # Evernote,Friendfeed,Vkontakte,Odnoklassniki,Mailru needmoreshare2: enable: false postbottom: enable: false options: iconStyle: box boxForm: horizontal position: bottomCenter networks: Weibo,Wechat,Douban,QQZone,Twitter,Facebook float: enable: false options: iconStyle: box boxForm: horizontal position: middleRight networks: Weibo,Wechat,Douban,QQZone,Twitter,Facebook # Google Webmaster tools verification setting # See: https://www.google.com/webmasters/ #google_site_verification: # Google Analytics #google_analytics: # Bing Webmaster tools verification setting # See: https://www.bing.com/webmaster/ #bing_site_verification: # Yandex Webmaster tools verification setting # See: https://webmaster.yandex.ru/ #yandex_site_verification: # CNZZ count #cnzz_siteid: # Application Insights # See https://azure.microsoft.com/en-us/services/application-insights/ # application_insights: # Make duoshuo show UA # user_id must NOT be null when admin_enable is true! # you can visit http://dev.duoshuo.com get duoshuo user id. duoshuo_info: ua_enable: true admin_enable: false user_id: 0 #admin_nickname: Author # Post widgets & FB/VK comments settings. # --------------------------------------------------------------- # Facebook SDK Support. # https://github.com/iissnan/hexo-theme-next/pull/410 facebook_sdk: enable: false app_id: #<app_id> fb_admin: #<user_id> like_button: #true webmaster: #true # Facebook comments plugin # This plugin depends on Facebook SDK. # If facebook_sdk.enable is false, Facebook comments plugin is unavailable. facebook_comments_plugin: enable: false num_of_posts: 10 # min posts num is 1 width: 100% # default width is 550px scheme: light # default scheme is light (light or dark) # VKontakte API Support. # To get your AppID visit https://vk.com/editapp?act=create vkontakte_api: enable: false app_id: #<app_id> like: true comments: true num_of_posts: 10 # Star rating support to each article. # To get your ID visit https://widgetpack.com rating: enable: false id: #<app_id> color: fc6423 # --------------------------------------------------------------- # Show number of visitors to each article. # You can visit https://leancloud.cn get AppID and AppKey. leancloud_visitors: enable: false app_id: #<app_id> app_key: #<app_key> # Another tool to show number of visitors to each article. # visit https://console.firebase.google.com/u/0/ to get apiKey and projectId # visit https://firebase.google.com/docs/firestore/ to get more information about firestore firestore: enable: false collection: articles #required, a string collection name to access firestore database apiKey: #required projectId: #required bluebird: false #enable this if you want to include bluebird 3.5.1(core version) Promise polyfill # Show PV/UV of the website/page with busuanzi. # Get more information on http://ibruce.info/2015/04/04/busuanzi/ busuanzi_count: # count values only if the other configs are false enable: true # custom uv span for the whole site site_uv: true site_uv_header: 本站访问人数 site_uv_footer: 人次 # custom pv span for the whole site site_pv: true site_pv_header: 本站访问量 site_pv_footer: 次 # custom pv span for one page only page_pv: true page_pv_header: 本文阅读量 page_pv_footer: 次 # Tencent analytics ID # tencent_analytics: # Tencent MTA ID # tencent_mta: # Enable baidu push so that the blog will push the url to baidu automatically which is very helpful for SEO baidu_push: false # Google Calendar # Share your recent schedule to others via calendar page # # API Documentation: # https://developers.google.com/google-apps/calendar/v3/reference/events/list calendar: enable: false calendar_id: <required> api_key: <required> orderBy: startTime offsetMax: 24 offsetMin: 4 timeZone: showDeleted: false singleEvents: true maxResults: 250 # Algolia Search algolia_search: enable: false hits: per_page: 10 labels: input_placeholder: Search for Posts hits_empty: "We didn't find any results for the search: ${query}" hits_stats: "${hits} results found in ${time} ms" # Local search # Dependencies: https://github.com/flashlab/hexo-generator-search local_search: enable: true # if auto, trigger search by changing input # if manual, trigger search by pressing enter key or search button trigger: auto # show top n results per article, show all results by setting to -1 top_n_per_article: 1 # --------------------------------------------------------------- # Tags Settings # --------------------------------------------------------------- # External URL with BASE64 encrypt & decrypt. # Usage: {% exturl text url "title" %} # Alias: {% extlink text url "title" %} exturl: false # Note tag (bs-callout). note: # Note tag style values: # - simple bs-callout old alert style. Default. # - modern bs-callout new (v2-v3) alert style. # - flat flat callout style with background, like on Mozilla or StackOverflow. # - disabled disable all CSS styles import of note tag. style: simple icons: false border_radius: 3 # Offset lighter of background in % for modern and flat styles (modern: -12 | 12; flat: -18 | 6). # Offset also applied to label tag variables. This option can work with disabled note tag. light_bg_offset: 0 # Label tag. label: true # Tabs tag. tabs: enable: true transition: tabs: false labels: true border_radius: 0 #! --------------------------------------------------------------- #! DO NOT EDIT THE FOLLOWING SETTINGS #! UNLESS YOU KNOW WHAT YOU ARE DOING #! --------------------------------------------------------------- # Use velocity to animate everything. motion: enable: true async: false transition: # Transition variants: # fadeIn | fadeOut | flipXIn | flipXOut | flipYIn | flipYOut | flipBounceXIn | flipBounceXOut | flipBounceYIn | flipBounceYOut # swoopIn | swoopOut | whirlIn | whirlOut | shrinkIn | shrinkOut | expandIn | expandOut # bounceIn | bounceOut | bounceUpIn | bounceUpOut | bounceDownIn | bounceDownOut | bounceLeftIn | bounceLeftOut | bounceRightIn | bounceRightOut # slideUpIn | slideUpOut | slideDownIn | slideDownOut | slideLeftIn | slideLeftOut | slideRightIn | slideRightOut # slideUpBigIn | slideUpBigOut | slideDownBigIn | slideDownBigOut | slideLeftBigIn | slideLeftBigOut | slideRightBigIn | slideRightBigOut # perspectiveUpIn | perspectiveUpOut | perspectiveDownIn | perspectiveDownOut | perspectiveLeftIn | perspectiveLeftOut | perspectiveRightIn | perspectiveRightOut post_block: fadeIn post_header: slideDownIn post_body: slideDownIn coll_header: slideLeftIn # Only for Pisces | Gemini. sidebar: slideUpIn # Fancybox fancybox: true # Progress bar in the top during page loading. pace: true # Themes list: #pace-theme-big-counter #pace-theme-bounce #pace-theme-barber-shop #pace-theme-center-atom #pace-theme-center-circle #pace-theme-center-radar #pace-theme-center-simple #pace-theme-corner-indicator #pace-theme-fill-left #pace-theme-flash #pace-theme-loading-bar #pace-theme-mac-osx #pace-theme-minimal # For example # pace_theme: pace-theme-center-simple pace_theme: pace-theme-minimal # Canvas-nest canvas_nest: true # three_waves three_waves: false # canvas_lines canvas_lines: false # canvas_sphere canvas_sphere: false # Only fit scheme Pisces # Canvas-ribbon # size: The width of the ribbon. # alpha: The transparency of the ribbon. # zIndex: The display level of the ribbon. canvas_ribbon: enable: false size: 300 alpha: 0.6 zIndex: -1 # Script Vendors. # Set a CDN address for the vendor you want to customize. # For example # jquery: https://ajax.googleapis.com/ajax/libs/jquery/2.2.0/jquery.min.js # Be aware that you should use the same version as internal ones to avoid potential problems. # Please use the https protocol of CDN files when you enable https on your site. vendors: # Internal path prefix. Please do not edit it. _internal: lib # Internal version: 2.1.3 jquery: # Internal version: 2.1.5 # See: http://fancyapps.com/fancybox/ fancybox: fancybox_css: # Internal version: 1.0.6 # See: https://github.com/ftlabs/fastclick fastclick: # Internal version: 1.9.7 # See: https://github.com/tuupola/jquery_lazyload lazyload: # Internal version: 1.2.1 # See: http://VelocityJS.org velocity: # Internal version: 1.2.1 # See: http://VelocityJS.org velocity_ui: # Internal version: 0.7.9 # See: https://faisalman.github.io/ua-parser-js/ ua_parser: # Internal version: 4.6.2 # See: http://fontawesome.io/ fontawesome: # Internal version: 1 # https://www.algolia.com algolia_instant_js: algolia_instant_css: # Internal version: 1.0.2 # See: https://github.com/HubSpot/pace # Or use direct links below: # pace: //cdn.bootcss.com/pace/1.0.2/pace.min.js # pace_css: //cdn.bootcss.com/pace/1.0.2/themes/blue/pace-theme-flash.min.css pace: pace_css: # Internal version: 1.0.0 # https://github.com/hustcc/canvas-nest.js canvas_nest: # three three: # three_waves # https://github.com/jjandxa/three_waves three_waves: # three_waves # https://github.com/jjandxa/canvas_lines canvas_lines: # three_waves # https://github.com/jjandxa/canvas_sphere canvas_sphere: # Internal version: 1.0.0 # https://github.com/zproo/canvas-ribbon canvas_ribbon: # Internal version: 3.3.0 # https://github.com/ethantw/Han han: # needMoreShare2 # https://github.com/revir/need-more-share2 needMoreShare2: # Assets css: css js: js images: images # Online contact daovoice: true daovoice_app_id: # 这里填你刚才获得的 app_id # Theme version live2d: enable: false model: z16 bottom: -30 version: 5.1.4 ``` 已经折腾了两天了,就差回档了,感觉回档也没有用,小白在此感谢各位大佬了 然后我修改背景图片修改的是Blog\themes\next\source\css\_custom\custom.styl文件 ``` // Custom styles. // 主页文章添加阴影效果 .post { margin-top: 60px; margin-bottom: 60px; padding: 25px; -webkit-box-shadow: 0 0 5px rgba(202, 203, 203, .5); -moz-box-shadow: 0 0 5px rgba(202, 203, 204, .5); } .site-meta { background: $orange; //天空的颜色,和我的眼镜是绝配 } // 鼠标样式 * { cursor: url(""),auto!important } :active { cursor: url(""),auto!important } // Custom styles. body { background-image: url(/images/background.jpg); background-attachment: fixed; background-repeat: no-repeat; background-size: cover; //改变背景色和透明度 .main-inner { padding: 25px; opacity: 0.85; border-radius: 10px; right: 0 !important; top: 0 !important; bottom: 0 !important; } } body .main { margin-bottom: 0px; } ```
npm run dev出错,运行项目时报错
![图片说明](https://img-ask.csdn.net/upload/201801/11/1515650209_532506.png) 不知道是哪里出了错,只是更改了src下的资源文件和app.vue ``` <template> <div id="app"> hello world! </div> </template> <script> // export default { // name: 'app' // } </script> <style> /* #app { font-family: 'Avenir', Helvetica, Arial, sans-serif; -webkit-font-smoothing: antialiased; -moz-osx-font-smoothing: grayscale; text-align: center; color: #2c3e50; margin-top: 60px; } */ </style> ```
关于mac mysql配置的问题
配置mysql appledeMacBook-Pro-2:~ apple$ /usr/local/mysql-5.7.15-osx10.11-x86_64/bin/mysqladmin -u root password 12345 报错:error: 'Access denied for user 'root'@'localhost' (using password: NO)' 调试的时候 输入mysql 出现报错 command not found 查阅资料后建立连接文件 ln -s /usr/local/mysql/bin/mysql /usr/bin 然后查阅资料发现 sudo ln -s /usr/local/mysql/bin/mysql /usr/bin 这条语句也不可以 alias mysql=/usr/local/mysql/bin/mysql 报错: ERROR 1045 (28000): Access denied for user 'apple'@'localhost' (using password: NO) 出现1045错误 感觉死循环了 求高手解答一下 谢谢!
eclipse中jsp无法导入背景图片
osx系统,不太清楚相对路径是放在eclipse的哪个包里 是WebContent文件夹里吗,dw里有那个自动填url的,放eclipse里真不会了。 求个大佬指点 这个是dw里的代码 ``` <body background="../../eclipse-workspace/ks/WebContent/timg.jpg"> ```
iconfont 小图标 放大失真有锯齿如何解决
-webkit-font-smoothing:antialiased;/*设置字体的光滑度属性,也就是CSS3用于webkit引擎(chrome) 设置字体抗锯齿属性*/ -webkit-text-stroke-width:.2px;/*设置文字边框*/ -moz-osx-font-smoothing:grayscale;/*该属性是为了让字体显示的更清晰的作用*/ 以上解决方法在ie下差别还是很大
终于明白阿里百度这样的大公司,为什么面试经常拿ThreadLocal考验求职者了
点击上面↑「爱开发」关注我们每晚10点,捕获技术思考和创业资源洞察什么是ThreadLocalThreadLocal是一个本地线程副本变量工具类,各个线程都拥有一份线程私...
程序员必须掌握的核心算法有哪些?
由于我之前一直强调数据结构以及算法学习的重要性,所以就有一些读者经常问我,数据结构与算法应该要学习到哪个程度呢?,说实话,这个问题我不知道要怎么回答你,主要取决于你想学习到哪些程度,不过针对这个问题,我稍微总结一下我学过的算法知识点,以及我觉得值得学习的算法。这些算法与数据结构的学习大多数是零散的,并没有一本把他们全部覆盖的书籍。下面是我觉得值得学习的一些算法以及数据结构,当然,我也会整理一些看过...
Linux(服务器编程):15---两种高效的事件处理模式(reactor模式、proactor模式)
前言 同步I/O模型通常用于实现Reactor模式 异步I/O模型则用于实现Proactor模式 最后我们会使用同步I/O方式模拟出Proactor模式 一、Reactor模式 Reactor模式特点 它要求主线程(I/O处理单元)只负责监听文件描述符上是否有事件发生,有的话就立即将时间通知工作线程(逻辑单元)。除此之外,主线程不做任何其他实质性的工作 读写数据,接受新的连接,以及处...
阿里面试官问我:如何设计秒杀系统?我的回答让他比起大拇指
你知道的越多,你不知道的越多 点赞再看,养成习惯 GitHub上已经开源 https://github.com/JavaFamily 有一线大厂面试点脑图和个人联系方式,欢迎Star和指教 前言 Redis在互联网技术存储方面使用如此广泛,几乎所有的后端技术面试官都要在Redis的使用和原理方面对小伙伴们进行360°的刁难。 作为一个在互联网公司面一次拿一次Offer的面霸,打败了...
五年程序员记流水账式的自白。
不知觉已中码龄已突破五年,一路走来从起初铁憨憨到现在的十九线程序员,一路成长,虽然不能成为高工,但是也能挡下一面,从15年很火的android开始入坑,走过java、.Net、QT,目前仍处于android和.net交替开发中。 毕业到现在一共就职过两家公司,目前是第二家,公司算是半个创业公司,所以基本上都会身兼多职。比如不光要写代码,还要写软著、软著评测、线上线下客户对接需求收集...
C语言魔塔游戏
很早就很想写这个,今天终于写完了。 游戏截图: 编译环境: VS2017 游戏需要一些图片,如果有想要的或者对游戏有什么看法的可以加我的QQ 2985486630 讨论,如果暂时没有回应,可以在博客下方留言,到时候我会看到。 下面我来介绍一下游戏的主要功能和实现方式 首先是玩家的定义,使用结构体,这个名字是可以自己改变的 struct gamerole { char n...
一文详尽系列之模型评估指标
点击上方“Datawhale”,选择“星标”公众号第一时间获取价值内容在机器学习领域通常会根据实际的业务场景拟定相应的不同的业务指标,针对不同机器学习问题如回归、分类、排...
究竟你适不适合买Mac?
我清晰的记得,刚买的macbook pro回到家,开机后第一件事情,就是上了淘宝网,花了500元钱,找了一个上门维修电脑的师傅,上门给我装了一个windows系统。。。。。。 表砍我。。。 当时买mac的初衷,只是想要个固态硬盘的笔记本,用来运行一些复杂的扑克软件。而看了当时所有的SSD笔记本后,最终决定,还是买个好(xiong)看(da)的。 已经有好几个朋友问我mba怎么样了,所以今天尽量客观...
程序员一般通过什么途径接私活?
二哥,你好,我想知道一般程序猿都如何接私活,我也想接,能告诉我一些方法吗? 上面是一个读者“烦不烦”问我的一个问题。其实不止是“烦不烦”,还有很多读者问过我类似这样的问题。 我接的私活不算多,挣到的钱也没有多少,加起来不到 20W。说实话,这个数目说出来我是有点心虚的,毕竟太少了,大家轻喷。但我想,恰好配得上“一般程序员”这个称号啊。毕竟苍蝇再小也是肉,我也算是有经验的人了。 唾弃接私活、做外...
压测学习总结(1)——高并发性能指标:QPS、TPS、RT、吞吐量详解
一、QPS,每秒查询 QPS:Queries Per Second意思是“每秒查询率”,是一台服务器每秒能够相应的查询次数,是对一个特定的查询服务器在规定时间内所处理流量多少的衡量标准。互联网中,作为域名系统服务器的机器的性能经常用每秒查询率来衡量。 二、TPS,每秒事务 TPS:是TransactionsPerSecond的缩写,也就是事务数/秒。它是软件测试结果的测量单位。一个事务是指一...
Python爬虫爬取淘宝,京东商品信息
小编是一个理科生,不善长说一些废话。简单介绍下原理然后直接上代码。 使用的工具(Python+pycharm2019.3+selenium+xpath+chromedriver)其中要使用pycharm也可以私聊我selenium是一个框架可以通过pip下载 pip installselenium -ihttps://pypi.tuna.tsinghua.edu.cn/simple/ ...
阿里程序员写了一个新手都写不出的低级bug,被骂惨了。
这种新手都不会范的错,居然被一个工作好几年的小伙子写出来,差点被当场开除了。
Java工作4年来应聘要16K最后没要,细节如下。。。
前奏: 今天2B哥和大家分享一位前几天面试的一位应聘者,工作4年26岁,统招本科。 以下就是他的简历和面试情况。 基本情况: 专业技能: 1、&nbsp;熟悉Sping了解SpringMVC、SpringBoot、Mybatis等框架、了解SpringCloud微服务 2、&nbsp;熟悉常用项目管理工具:SVN、GIT、MAVEN、Jenkins 3、&nbsp;熟悉Nginx、tomca...
2020年,冯唐49岁:我给20、30岁IT职场年轻人的建议
点击“技术领导力”关注∆每天早上8:30推送 作者|Mr.K 编辑| Emma 来源|技术领导力(ID:jishulingdaoli) 前天的推文《冯唐:职场人35岁以后,方法论比经验重要》,收到了不少读者的反馈,觉得挺受启发。其实,冯唐写了不少关于职场方面的文章,都挺不错的。可惜大家只记住了“春风十里不如你”、“如何避免成为油腻腻的中年人”等不那么正经的文章。 本文整理了冯...
程序员该看的几部电影
1、骇客帝国(1999) 概念:在线/离线,递归,循环,矩阵等 剧情简介: 不久的将来,网络黑客尼奥对这个看似正常的现实世界产生了怀疑。 他结识了黑客崔妮蒂,并见到了黑客组织的首领墨菲斯。 墨菲斯告诉他,现实世界其实是由一个名叫“母体”的计算机人工智能系统控制,人们就像他们饲养的动物,没有自由和思想,而尼奥就是能够拯救人类的救世主。 可是,救赎之路从来都不会一帆风顺,到底哪里才是真实的世界?如何...
Python绘图,圣诞树,花,爱心 | Turtle篇
每周每日,分享Python实战代码,入门资料,进阶资料,基础语法,爬虫,数据分析,web网站,机器学习,深度学习等等。 公众号回复【进群】沟通交流吧,QQ扫码进群学习吧 微信群 QQ群 1.画圣诞树 import turtle screen = turtle.Screen() screen.setup(800,600) circle = turtle.Turtle()...
作为一个程序员,CPU的这些硬核知识你必须会!
CPU对每个程序员来说,是个既熟悉又陌生的东西? 如果你只知道CPU是中央处理器的话,那可能对你并没有什么用,那么作为程序员的我们,必须要搞懂的就是CPU这家伙是如何运行的,尤其要搞懂它里面的寄存器是怎么一回事,因为这将让你从底层明白程序的运行机制。 随我一起,来好好认识下CPU这货吧 把CPU掰开来看 对于CPU来说,我们首先就要搞明白它是怎么回事,也就是它的内部构造,当然,CPU那么牛的一个东...
还记得那个提速8倍的IDEA插件吗?VS Code版本也发布啦!!
去年,阿里云发布了本地 IDE 插件 Cloud Toolkit,仅 IntelliJ IDEA 一个平台,就有 15 万以上的开发者进行了下载,体验了一键部署带来的开发便利。时隔一年的今天,阿里云正式发布了 Visual Studio Code 版本,全面覆盖前端开发者,帮助前端实现一键打包部署,让开发提速 8 倍。 VSCode 版本的插件,目前能做到什么? 安装插件之后,开发者可以立即体验...
破14亿,Python分析我国存在哪些人口危机!
一、背景 二、爬取数据 三、数据分析 1、总人口 2、男女人口比例 3、人口城镇化 4、人口增长率 5、人口老化(抚养比) 6、各省人口 7、世界人口 四、遇到的问题 遇到的问题 1、数据分页,需要获取从1949-2018年数据,观察到有近20年参数:LAST20,由此推测获取近70年的参数可设置为:LAST70 2、2019年数据没有放上去,可以手动添加上去 3、将数据进行 行列转换 4、列名...
2019年除夕夜的有感而发
天气:小雨(加小雪) 温度:3摄氏度 空气:严重污染(399) 风向:北风 风力:微风 现在是除夕夜晚上十点钟,再有两个小时就要新的一年了; 首先要说的是我没患病,至少现在是没有患病;但是心情确像患了病一样沉重; 现在这个时刻应该大部分家庭都在看春晚吧,或许一家人团团圆圆的坐在一起,或许因为某些特殊原因而不能团圆;但不管是身在何处,身处什么境地,我都想对每一个人说一句:新年快乐! 不知道csdn这...
听说想当黑客的都玩过这个Monyer游戏(1~14攻略)
第零关 进入传送门开始第0关(游戏链接) 请点击链接进入第1关: 连接在左边→ ←连接在右边 看不到啊。。。。(只能看到一堆大佬做完的留名,也能看到菜鸡的我,在后面~~) 直接fn+f12吧 &lt;span&gt;连接在左边→&lt;/span&gt; &lt;a href="first.php"&gt;&lt;/a&gt; &lt;span&gt;←连接在右边&lt;/span&gt; o...
在家远程办公效率低?那你一定要收好这个「在家办公」神器!
相信大家都已经收到国务院延长春节假期的消息,接下来,在家远程办公可能将会持续一段时间。 但是问题来了。远程办公不是人在电脑前就当坐班了,相反,对于沟通效率,文件协作,以及信息安全都有着极高的要求。有着非常多的挑战,比如: 1在异地互相不见面的会议上,如何提高沟通效率? 2文件之间的来往反馈如何做到及时性?如何保证信息安全? 3如何规划安排每天工作,以及如何进行成果验收? ...... ...
作为一个程序员,内存和磁盘的这些事情,你不得不知道啊!!!
截止目前,我已经分享了如下几篇文章: 一个程序在计算机中是如何运行的?超级干货!!! 作为一个程序员,CPU的这些硬核知识你必须会! 作为一个程序员,内存的这些硬核知识你必须懂! 这些知识可以说是我们之前都不太重视的基础知识,可能大家在上大学的时候都学习过了,但是嘞,当时由于老师讲解的没那么有趣,又加上这些知识本身就比较枯燥,所以嘞,大家当初几乎等于没学。 再说啦,学习这些,也看不出来有什么用啊!...
2020年的1月,我辞掉了我的第一份工作
其实,这篇文章,我应该早点写的,毕竟现在已经2月份了。不过一些其它原因,或者是我的惰性、还有一些迷茫的念头,让自己迟迟没有试着写一点东西,记录下,或者说是总结下自己前3年的工作上的经历、学习的过程。 我自己知道的,在写自己的博客方面,我的文笔很一般,非技术类的文章不想去写;另外我又是一个还比较热衷于技术的人,而平常复杂一点的东西,如果想写文章写的清楚点,是需要足够...
别低估自己的直觉,也别高估自己的智商
所有群全部吵翻天,朋友圈全部沦陷,公众号疯狂转发。这两周没怎么发原创,只发新闻,可能有人注意到了。我不是懒,是文章写了却没发,因为大家的关注力始终在这次的疫情上面,发了也没人看。当然,我...
这个世界上人真的分三六九等,你信吗?
偶然间,在知乎上看到一个问题 一时间,勾起了我深深的回忆。 以前在厂里打过两次工,做过家教,干过辅导班,做过中介。零下几度的晚上,贴过广告,满脸、满手地长冻疮。 再回首那段岁月,虽然苦,但让我学会了坚持和忍耐。让我明白了,在这个世界上,无论环境多么的恶劣,只要心存希望,星星之火,亦可燎原。 下文是原回答,希望能对你能有所启发。 如果我说,这个世界上人真的分三六九等,...
节后首个工作日,企业们集体开晨会让钉钉挂了
By 超神经场景描述:昨天 2 月 3 日,是大部分城市号召远程工作的第一天,全国有接近 2 亿人在家开始远程办公,钉钉上也有超过 1000 万家企业活跃起来。关键词:十一出行 人脸...
Java基础知识点梳理
虽然已经在实际工作中经常与java打交道,但是一直没系统地对java这门语言进行梳理和总结,掌握的知识也比较零散。恰好利用这段时间重新认识下java,并对一些常见的语法和知识点做个总结与回顾,一方面为了加深印象,方便后面查阅,一方面为了掌握好Android打下基础。
2020年全新Java学习路线图,含配套视频,学完即为中级Java程序员!!
新的一年来临,突如其来的疫情打破了平静的生活! 在家的你是否很无聊,如果无聊就来学习吧! 世上只有一种投资只赚不赔,那就是学习!!! 传智播客于2020年升级了Java学习线路图,硬核升级,免费放送! 学完你就是中级程序员,能更快一步找到工作! 一、Java基础 JavaSE基础是Java中级程序员的起点,是帮助你从小白到懂得编程的必经之路。 在Java基础板块中有6个子模块的学...
B 站上有哪些很好的学习资源?
哇说起B站,在小九眼里就是宝藏般的存在,放年假宅在家时一天刷6、7个小时不在话下,更别提今年的跨年晚会,我简直是跪着看完的!! 最早大家聚在在B站是为了追番,再后来我在上面刷欧美新歌和漂亮小姐姐的舞蹈视频,最近两年我和周围的朋友们已经把B站当作学习教室了,而且学习成本还免费,真是个励志的好平台ヽ(.◕ฺˇд ˇ◕ฺ;)ノ 下面我们就来盘点一下B站上优质的学习资源: 综合类 Oeasy: 综合...
相关热词 c# 识别回车 c#生成条形码ean13 c#子控制器调用父控制器 c# 写大文件 c# 浏览pdf c#获取桌面图标的句柄 c# list反射 c# 句柄 进程 c# 倒计时 线程 c# 窗体背景色
立即提问