ubuntu16.04安装opencv时,make不通过该怎么办?

cmake已经完成,情况如下:

cmake ..
-- Detected version of GNU GCC: 54 (504)
-- Found ZLIB: /usr/lib/x86_64-linux-gnu/libz.so (found suitable version "1.2.8", minimum required is "1.2.3") 
-- Found ZLIB: /usr/lib/x86_64-linux-gnu/libz.so (found version "1.2.8") 
-- Checking for module 'gstreamer-base-1.0'
--   No package 'gstreamer-base-1.0' found
-- Checking for module 'gstreamer-video-1.0'
--   No package 'gstreamer-video-1.0' found
-- Checking for module 'gstreamer-app-1.0'
--   No package 'gstreamer-app-1.0' found
-- Checking for module 'gstreamer-riff-1.0'
--   No package 'gstreamer-riff-1.0' found
-- Checking for module 'gstreamer-pbutils-1.0'
--   No package 'gstreamer-pbutils-1.0' found
-- Checking for module 'gstreamer-base-0.10'
--   No package 'gstreamer-base-0.10' found
-- Checking for module 'gstreamer-video-0.10'
--   No package 'gstreamer-video-0.10' found
-- Checking for module 'gstreamer-app-0.10'
--   No package 'gstreamer-app-0.10' found
-- Checking for module 'gstreamer-riff-0.10'
--   No package 'gstreamer-riff-0.10' found
-- Checking for module 'gstreamer-pbutils-0.10'
--   No package 'gstreamer-pbutils-0.10' found
-- Looking for linux/videodev.h
-- Looking for linux/videodev.h - not found
-- Looking for linux/videodev2.h
-- Looking for linux/videodev2.h - found
-- Looking for sys/videoio.h
-- Looking for sys/videoio.h - not found
-- Checking for module 'libavresample'
--   No package 'libavresample' found
-- Looking for libavformat/avformat.h
-- Looking for libavformat/avformat.h - found
-- Looking for ffmpeg/avformat.h
-- Looking for ffmpeg/avformat.h - not found
-- Checking for module 'libgphoto2'
--   No package 'libgphoto2' found
-- found IPP (ICV version): 9.0.1 [9.0.1]
-- at: /home/quxutao/opencv-3.1.0/3rdparty/ippicv/unpack/ippicv_lnx
-- CUDA detected: 7.5
-- CUDA NVCC target flags: -gencode;arch=compute_20,code=sm_20;-gencode;arch=compute_20,code=sm_21;-gencode;arch=compute_30,code=sm_30;-gencode;arch=compute_35,code=sm_35;-gencode;arch=compute_30,code=compute_30
-- Could NOT find Doxygen (missing:  DOXYGEN_EXECUTABLE) 
-- To enable PlantUML support, set PLANTUML_JAR environment variable or pass -DPLANTUML_JAR=<filepath> option to cmake
-- Could NOT find PythonInterp: Found unsuitable version "1.4", but required is at least "2.7" (found /home/quxutao/.virtualenvs/cv/bin/python)
-- Could NOT find PythonInterp: Found unsuitable version "1.4", but required is at least "2.6" (found /home/quxutao/.virtualenvs/cv/bin/python)
-- Could NOT find PythonInterp: Found unsuitable version "1.4", but required is at least "3.4" (found /home/quxutao/.virtualenvs/cv/bin/python)
-- Could NOT find PythonInterp: Found unsuitable version "1.4", but required is at least "3.2" (found /home/quxutao/.virtualenvs/cv/bin/python)
-- Could NOT find JNI (missing:  JAVA_INCLUDE_PATH JAVA_INCLUDE_PATH2 JAVA_AWT_INCLUDE_PATH) 
-- Could NOT find Matlab (missing:  MATLAB_MEX_SCRIPT MATLAB_INCLUDE_DIRS MATLAB_ROOT_DIR MATLAB_LIBRARIES MATLAB_LIBRARY_DIRS MATLAB_MEXEXT MATLAB_ARCH MATLAB_BIN) 
-- VTK is not found. Please set -DVTK_DIR in CMake to VTK build directory, or to VTK install subdirectory with VTKConfig.cmake file
-- Caffe:   NO
-- Protobuf:   YES
-- Glog:   NO
-- HDF5:   YES
-- Module opencv_sfm disabled because the following dependencies are not found: Eigen Glog/Gflags
-- Tesseract:   NO
-- HDF5:   YES
-- Build libprotobuf from sources:
--     The protocol buffer compiler not found
-- Tesseract:   NO
-- 
-- General configuration for OpenCV 3.1.0 =====================================
--   Version control:               unknown
-- 
--   Platform:
--     Host:                        Linux 4.15.0-47-generic x86_64
--     CMake:                       3.5.1
--     CMake generator:             Unix Makefiles
--     CMake build tool:            /usr/bin/make
--     Configuration:               RELEASE
-- 
--   C/C++:
--     Built as dynamic libs?:      YES
--     C++ Compiler:                /usr/bin/c++  (ver 5.4.0)
--     C++ flags (Release):         -fsigned-char -W -Wall -Werror=return-type -Werror=non-virtual-dtor -Werror=address -Werror=sequence-point -Wformat -Werror=format-security -Wmissing-declarations -Wundef -Winit-self -Wpointer-arith -Wshadow -Wsign-promo -Wno-narrowing -Wno-delete-non-virtual-dtor -fdiagnostics-show-option -Wno-long-long -pthread -fomit-frame-pointer -msse -msse2 -mno-avx -msse3 -mno-ssse3 -mno-sse4.1 -mno-sse4.2 -ffunction-sections -fvisibility=hidden -fvisibility-inlines-hidden -O3 -DNDEBUG  -DNDEBUG
--     C++ flags (Debug):           -fsigned-char -W -Wall -Werror=return-type -Werror=non-virtual-dtor -Werror=address -Werror=sequence-point -Wformat -Werror=format-security -Wmissing-declarations -Wundef -Winit-self -Wpointer-arith -Wshadow -Wsign-promo -Wno-narrowing -Wno-delete-non-virtual-dtor -fdiagnostics-show-option -Wno-long-long -pthread -fomit-frame-pointer -msse -msse2 -mno-avx -msse3 -mno-ssse3 -mno-sse4.1 -mno-sse4.2 -ffunction-sections -fvisibility=hidden -fvisibility-inlines-hidden -g  -O0 -DDEBUG -D_DEBUG
--     C Compiler:                  /usr/bin/cc
--     C flags (Release):           -fsigned-char -W -Wall -Werror=return-type -Werror=non-virtual-dtor -Werror=address -Werror=sequence-point -Wformat -Werror=format-security -Wmissing-declarations -Wmissing-prototypes -Wstrict-prototypes -Wundef -Winit-self -Wpointer-arith -Wshadow -Wno-narrowing -fdiagnostics-show-option -Wno-long-long -pthread -fomit-frame-pointer -msse -msse2 -mno-avx -msse3 -mno-ssse3 -mno-sse4.1 -mno-sse4.2 -ffunction-sections -fvisibility=hidden -O3 -DNDEBUG  -DNDEBUG
--     C flags (Debug):             -fsigned-char -W -Wall -Werror=return-type -Werror=non-virtual-dtor -Werror=address -Werror=sequence-point -Wformat -Werror=format-security -Wmissing-declarations -Wmissing-prototypes -Wstrict-prototypes -Wundef -Winit-self -Wpointer-arith -Wshadow -Wno-narrowing -fdiagnostics-show-option -Wno-long-long -pthread -fomit-frame-pointer -msse -msse2 -mno-avx -msse3 -mno-ssse3 -mno-sse4.1 -mno-sse4.2 -ffunction-sections -fvisibility=hidden -g  -O0 -DDEBUG -D_DEBUG
--     Linker flags (Release):
--     Linker flags (Debug):
--     Precompiled headers:         YES
--     Extra dependencies:          /usr/lib/x86_64-linux-gnu/libpng.so /usr/lib/x86_64-linux-gnu/libtiff.so /usr/lib/x86_64-linux-gnu/libjasper.so /usr/lib/x86_64-linux-gnu/libjpeg.so gtk-3 gdk-3 pangocairo-1.0 pango-1.0 atk-1.0 cairo-gobject cairo gdk_pixbuf-2.0 gio-2.0 gobject-2.0 gthread-2.0 glib-2.0 dc1394 v4l1 v4l2 avcodec-ffmpeg avformat-ffmpeg avutil-ffmpeg swscale-ffmpeg /usr/lib/x86_64-linux-gnu/libbz2.so /usr/lib/x86_64-linux-gnu/hdf5/openmpi/lib/libhdf5.so /usr/lib/x86_64-linux-gnu/libsz.so /usr/lib/x86_64-linux-gnu/libz.so /usr/lib/x86_64-linux-gnu/libdl.so /usr/lib/x86_64-linux-gnu/libm.so dl m pthread rt cudart nppc nppi npps cufft -L/usr/lib/x86_64-linux-gnu
--     3rdparty dependencies:       libwebp IlmImf libprotobuf
-- 
--   OpenCV modules:
--     To be built:                 cudev core cudaarithm flann hdf imgproc ml reg surface_matching video cudabgsegm cudafilters cudaimgproc cudawarping dnn fuzzy imgcodecs photo shape videoio cudacodec highgui objdetect plot ts xobjdetect xphoto bgsegm bioinspired dpm face features2d line_descriptor saliency text calib3d ccalib cudafeatures2d cudalegacy cudaobjdetect cudaoptflow cudastereo datasets rgbd stereo structured_light superres tracking videostab xfeatures2d ximgproc aruco optflow stitching
--     Disabled:                    world contrib_world
--     Disabled by dependency:      -
--     Unavailable:                 java python2 python3 viz cvv matlab sfm
-- 
--   GUI: 
--     QT:                          NO
--     GTK+ 3.x:                    YES (ver 3.18.9)
--     GThread :                    YES (ver 2.48.2)
--     GtkGlExt:                    NO
--     OpenGL support:              NO
--     VTK support:                 NO
-- 
--   Media I/O: 
--     ZLib:                        /usr/lib/x86_64-linux-gnu/libz.so (ver 1.2.8)
--     JPEG:                        /usr/lib/x86_64-linux-gnu/libjpeg.so (ver )
--     WEBP:                        build (ver 0.3.1)
--     PNG:                         /usr/lib/x86_64-linux-gnu/libpng.so (ver 1.2.54)
--     TIFF:                        /usr/lib/x86_64-linux-gnu/libtiff.so (ver 42 - 4.0.6)
--     JPEG 2000:                   /usr/lib/x86_64-linux-gnu/libjasper.so (ver 1.900.1)
--     OpenEXR:                     build (ver 1.7.1)
--     GDAL:                        NO
-- 
--   Video I/O:
--     DC1394 1.x:                  NO
--     DC1394 2.x:                  YES (ver 2.2.4)
--     FFMPEG:                      YES
--       codec:                     YES (ver 56.60.100)
--       format:                    YES (ver 56.40.101)
--       util:                      YES (ver 54.31.100)
--       swscale:                   YES (ver 3.1.101)
--       resample:                  NO
--       gentoo-style:              YES
--     GStreamer:                   NO
--     OpenNI:                      NO
--     OpenNI PrimeSensor Modules:  NO
--     OpenNI2:                     NO
--     PvAPI:                       NO
--     GigEVisionSDK:               NO
--     UniCap:                      NO
--     UniCap ucil:                 NO
--     V4L/V4L2:                    Using libv4l1 (ver 1.10.0) / libv4l2 (ver 1.10.0)
--     XIMEA:                       NO
--     Xine:                        NO
--     gPhoto2:                     NO
-- 
--   Parallel framework:            pthreads
-- 
--   Other third-party libraries:
--     Use IPP:                     9.0.1 [9.0.1]
--          at:                     /home/quxutao/opencv-3.1.0/3rdparty/ippicv/unpack/ippicv_lnx
--     Use IPP Async:               NO
--     Use VA:                      NO
--     Use Intel VA-API/OpenCL:     NO
--     Use Eigen:                   NO
--     Use Cuda:                    YES (ver 7.5)
--     Use OpenCL:                  YES
--     Use custom HAL:              NO
-- 
--   NVIDIA CUDA
--     Use CUFFT:                   YES
--     Use CUBLAS:                  NO
--     USE NVCUVID:                 NO
--     NVIDIA GPU arch:             20 21 30 35
--     NVIDIA PTX archs:            30
--     Use fast math:               NO
-- 
--   OpenCL:
--     Version:                     dynamic
--     Include path:                /home/quxutao/opencv-3.1.0/3rdparty/include/opencl/1.2
--     Use AMDFFT:                  NO
--     Use AMDBLAS:                 NO
-- 
--   Python 2:
--     Interpreter:                 NO
-- 
--   Python 3:
--     Interpreter:                 NO
-- 
--   Python (for build):            NO
-- 
--   Java:
--     ant:                         NO
--     JNI:                         NO
--     Java wrappers:               NO
--     Java tests:                  NO
-- 
--   Matlab:                        Matlab not found or implicitly disabled
-- 
--   Documentation:
--     Doxygen:                     NO
--     PlantUML:                    NO
-- 
--   Tests and samples:
--     Tests:                       YES
--     Performance tests:           YES
--     C/C++ Examples:              YES
-- 
--   Install path:                  /usr/local
-- 
--   cvconfig.h is in:              /home/quxutao/opencv-3.1.0/build
-- -----------------------------------------------------------------
-- 
-- Configuring done
-- Generating done
-- Build files have been written to: /home/quxutao/opencv-3.1.0/build

但是make的时候,就报错:

 make
[  4%] Built target libwebp
[  4%] Built target IlmImf
[  4%] Built target opencv_cudev
[  4%] Built target opencv_core_pch_dephelp
[  4%] Built target pch_Generate_opencv_core
[  4%] Building NVCC (Device) object modules/core/CMakeFiles/cuda_compile.dir/src/cuda/cuda_compile_generated_gpu_mat.cu.o
/usr/include/string.h: In function ‘void* __mempcpy_inline(void*, const void*, size_t)’:
/usr/include/string.h:652:42: error: ‘memcpy’ was not declared in this scope
   return (char *) memcpy (__dest, __src, __n) + __n;
                                          ^
CMake Error at cuda_compile_generated_gpu_mat.cu.o.cmake:266 (message):
  Error generating file
  /home/quxutao/opencv-3.1.0/build/modules/core/CMakeFiles/cuda_compile.dir/src/cuda/./cuda_compile_generated_gpu_mat.cu.o


modules/core/CMakeFiles/opencv_core.dir/build.make:399: recipe for target 'modules/core/CMakeFiles/cuda_compile.dir/src/cuda/cuda_compile_generated_gpu_mat.cu.o' failed
make[2]: *** [modules/core/CMakeFiles/cuda_compile.dir/src/cuda/cuda_compile_generated_gpu_mat.cu.o] Error 1
CMakeFiles/Makefile2:2307: recipe for target 'modules/core/CMakeFiles/opencv_core.dir/all' failed
make[1]: *** [modules/core/CMakeFiles/opencv_core.dir/all] Error 2
Makefile:160: recipe for target 'all' failed
make: *** [all] Error 2

弄了一下午了,没有找到相关的解决办法。我的cuda是7.5,其实不用GPU也可以的,我只是想用KAZE滤波。。。跪求大神帮忙。。。

Csdn user default icon
上传中...
上传图片
插入图片
抄袭、复制答案,以达到刷声望分或其他目的的行为,在CSDN问答是严格禁止的,一经发现立刻封号。是时候展现真正的技术了!
立即提问
相关内容推荐