ubuntu14 下 Caffe编译问题 出错

.build_release/lib/libcaffe.so: undefined reference to cudnnConvolutionBackwardData_v3'.build_release/lib/libcaffe.so: undefined reference tocudnnConvolutionBackwardData_v3'

.build_release/lib/libcaffe.so: undefined reference to cudnnConvolutionBackwardFilter_v3'
collect2: error: ld returned 1 exit status
make: *** [.build_release/tools/upgrade_solver_proto_text.bin] Error 1
make: *** Waiting for unfinished jobs....
.build_release/lib/libcaffe.so: undefined reference to
cudnnConvolutionBackwardData_v3'
.build_release/lib/libcaffe.so: undefined reference to cudnnConvolutionBackwardFilter_v3'
collect2: error: ld returned 1 exit status
make: *** [.build_release/tools/upgrade_net_proto_binary.bin] Error 1
.build_release/lib/libcaffe.so: undefined reference to
cudnnConvolutionBackwardData_v3'
.build_release/lib/libcaffe.so: undefined reference to cudnnConvolutionBackwardFilter_v3'
collect2: error: ld returned 1 exit status
.build_release/lib/make: libcaffe.so: undefined reference to *** [.build_release/tools/compute_image_mean.bin] Error 1
cudnnConvolutionBackwardData_v3
'
.build_release/lib/libcaffe.so: undefined reference to cudnnConvolutionBackwardFilter_v3'
collect2: error: ld returned 1 exit status
make: *** [.build_release/tools/caffe.bin] Error 1
.build_release/lib/libcaffe.so: undefined reference to
cudnnConvolutionBackwardData_v3'
.build_release/lib/libcaffe.so: undefined reference to cudnnConvolutionBackwardFilter_v3'
collect2: error: ld returned 1 exit status
make: *** [.build_release/examples/cifar10/convert_cifar_data.bin] Error 1
.build_release/lib/libcaffe.so: undefined reference to
cudnnConvolutionBackwardData_v3'
.build_release/lib/libcaffe.so: undefined reference to cudnnConvolutionBackwardFilter_v3'
collect2: error: ld returned 1 exit status
make: *** [.build_release/tools/convert_imageset.bin] Error 1
.build_release/lib/libcaffe.so: undefined reference to
cudnnConvolutionBackwardData_v3'
.build_release/lib/libcaffe.so: undefined reference to cudnnConvolutionBackwardFilter_v3'
collect2: error: ld returned 1 exit status
make: *** [.build_release/tools/extract_features.bin] Error 1
.build_release/lib/libcaffe.so: undefined reference to
cudnnConvolutionBackwardData_v3'
.build_release/lib/libcaffe.so: undefined reference to `cudnnConvolutionBackwardFilter_v3'
collect2: error: ld returned 1 exit status
make: *** [.build_release/tools/upgrade_net_proto_text.bin] Error 1_**

2个回答

楼主问题解决了吗?我也遇到了这个问题

Csdn user default icon
上传中...
上传图片
插入图片
抄袭、复制答案,以达到刷声望分或其他目的的行为,在CSDN问答是严格禁止的,一经发现立刻封号。是时候展现真正的技术了!
立即提问
相关内容推荐