webpack4.x中mini-css-webpack-plugin的使用

webapck4.x中废弃了extract-text-webpack-plugin,说建议使用mini-css-webpack-plugin,当我在使用这个的时候发现这里面不能单独修改css文件的中引用图片的publicPath属性,然后打包后css文件中的url指向就出现了问题,我想知道webpack4.x中如何解决这一问题

1个回答

Csdn user default icon
上传中...
上传图片
插入图片
抄袭、复制答案,以达到刷声望分或其他目的的行为,在CSDN问答是严格禁止的,一经发现立刻封号。是时候展现真正的技术了!
其他相关推荐
npm run dev啟動項目時報錯 `webpack-dev-server --inline --progress --config build/webpack.dev.conf.js`

uotation@1.0.0 dev: `webpack-dev-server --inline --progress --config build/webpack.dev.conf.js` npm ERR! Exit status 1 npm ERR! npm ERR! Failed at the quotation@1.0.0 dev script. npm ERR! This is probably not a problem with npm. There is likely additional logging output above. ``` //webpack.dev.conf.js 'use strict' const utils = require('./utils') const webpack = require('webpack') const config = require('../config') const merge = require('webpack-merge') const path = require('path') const baseWebpackConfig = require('./webpack.base.conf') const CopyWebpackPlugin = require('copy-webpack-plugin') const HtmlWebpackPlugin = require('html-webpack-plugin') const FriendlyErrorsPlugin = require('friendly-errors-webpack-plugin') const portfinder = require('portfinder') const HOST = process.env.HOST const PORT = process.env.PORT && Number(process.env.PORT) const devWebpackConfig = merge(baseWebpackConfig, { module: { rules: utils.styleLoaders({ sourceMap: config.dev.cssSourceMap, usePostCSS: true }) }, // cheap-module-eval-source-map is faster for development devtool: config.dev.devtool, // these devServer options should be customized in /config/index.js devServer: { clientLogLevel: 'warning', historyApiFallback: { rewrites: [ { from: /.*/, to: path.posix.join(config.dev.assetsPublicPath, 'index.html') }, ], }, hot: true, contentBase: false, // since we use CopyWebpackPlugin. compress: true, host: HOST || config.dev.host, port: PORT || config.dev.port, open: config.dev.autoOpenBrowser, overlay: config.dev.errorOverlay ? { warnings: false, errors: true } : false, publicPath: config.dev.assetsPublicPath, proxy: config.dev.proxyTable, quiet: true, // necessary for FriendlyErrorsPlugin watchOptions: { poll: config.dev.poll, } }, plugins: [ new webpack.DefinePlugin({ 'process.env': require('../config/dev.env') }), new webpack.HotModuleReplacementPlugin(), new webpack.NamedModulesPlugin(), // HMR shows correct file names in console on update. new webpack.NoEmitOnErrorsPlugin(), // https://github.com/ampedandwired/html-webpack-plugin new HtmlWebpackPlugin({ filename: 'index.html', template: 'index.html', inject: true }), // copy custom static assets new CopyWebpackPlugin([ { from: path.resolve(__dirname, '../static'), to: config.dev.assetsSubDirectory, ignore: ['.*'] } ]) ] }) module.exports = new Promise((resolve, reject) => { portfinder.basePort = process.env.PORT || config.dev.port portfinder.getPort((err, port) => { if (err) { reject(err) } else { // publish the new Port, necessary for e2e tests process.env.PORT = port // add port to devServer config devWebpackConfig.devServer.port = port // Add FriendlyErrorsPlugin devWebpackConfig.plugins.push(new FriendlyErrorsPlugin({ compilationSuccessInfo: { messages: [`Your application is running here: http://${devWebpackConfig.devServer.host}:${port}`], }, onErrors: config.dev.notifyOnErrors ? utils.createNotifierCallback() : undefined })) resolve(devWebpackConfig) } }) }) ``` ``` //webpack.base.conf.js 'use strict' const path = require('path') const utils = require('./utils') const config = require('../config') const vueLoaderConfig = require('./vue-loader.conf') function resolve (dir) { return path.join(__dirname, '..', dir) } module.exports = { context: path.resolve(__dirname, '../'), entry: { app: './src/main.js' }, output: { path: config.build.assetsRoot, filename: '[name].js', publicPath: process.env.NODE_ENV === 'production' ? config.build.assetsPublicPath : config.dev.assetsPublicPath }, resolve: { extensions: ['.js', '.vue', '.json'], alias: { 'vue$': 'vue/dist/vue.esm.js', '@': resolve('src'), } }, module: { rules: [ { test: /\.vue$/, loader: 'vue-loader', options: vueLoaderConfig }, { test: /\.js$/, loader: 'babel-loader', include: [resolve('src'), resolve('test'), resolve('node_modules/webpack-dev-server/client')] }, { test: /\.(png|jpe?g|gif|svg)(\?.*)?$/, loader: 'url-loader', options: { limit: 10000, name: utils.assetsPath('img/[name].[hash:7].[ext]') } }, { test: /\.(mp4|webm|ogg|mp3|wav|flac|aac)(\?.*)?$/, loader: 'url-loader', options: { limit: 10000, name: utils.assetsPath('media/[name].[hash:7].[ext]') } }, { test: /\.(woff2?|eot|ttf|otf)(\?.*)?$/, loader: 'url-loader', options: { limit: 10000, name: utils.assetsPath('fonts/[name].[hash:7].[ext]') } } ] }, node: { // prevent webpack from injecting useless setImmediate polyfill because Vue // source contains it (although only uses it if it's native). setImmediate: false, // prevent webpack from injecting mocks to Node native modules // that does not make sense for the client dgram: 'empty', fs: 'empty', net: 'empty', tls: 'empty', child_process: 'empty' } } ```

html-webpack-plugin css 提取 动态的样式表变成Object怎么解决?

``` webpack HtmlWebpackPlugin配置 const htmlWebpackPlugin = new HtmlWebpackPlugin({ inject: false, template: resolveApp('./src/page/index.html'), favicon: resolveApp('./src/assets/favicon.png'), minify: { removeComments: true, collapseWhitespace: true, removeRedundantAttributes: true, useShortDoctype: true, removeEmptyAttributes: true, removeStyleLinkTypeAttributes: true, keepClosingSlash: true, minifyJS: true, minifyCSS: true, minifyURLs: true, minifyHTML: true } }); html 模板 <!DOCTYPE html> <html> <head> <meta charset="UTF-8" /> <title> <%= htmlWebpackPlugin.options.title %> </title> <% for (var css in htmlWebpackPlugin.files.css) { %> <link href="<%=htmlWebpackPlugin.files.css[css] %>" rel="stylesheet"> <% } %> </head> <body> <% for (var chunk in htmlWebpackPlugin.files.chunks) { %> <script type="text/javascript" src="<%=htmlWebpackPlugin.files.chunks[chunk].entry %>"></script> <% } %> </body> </html> 其中CSS代码遍历 <% for (var css in htmlWebpackPlugin.files.css) { %> <link href="<%=htmlWebpackPlugin.files.css[css] %>" rel="stylesheet"> <% } %> 最后得到结果是 <link rel="icon" type="image/png" href="/favicon.png"> <link href="[object Object]" rel="stylesheet"> 动态的样式表变成Object怎么解决? ```

请问 web-webpack-plugin 与 html-webpack-plugin 区别

如题,看到有的项目使用前者,有的项目使用后者进行 ,他们有什么区别,到底用哪个好。谢谢。

为什么这个purifycss-webpack会一直安装不上呢?

![图片说明](https://img-ask.csdn.net/upload/201908/25/1566739125_873195.png) 为什么这个purifycss-webpack会一直安装不上呢?

webpack2 在打包css时,css引用图片报错

ERROR in ./src/imgs/left.png Module parse failed: C:\Users\Administrator\Desktop\test\src\imgs\left.png Unexpected character '�' (1:0) You may need an appropriate loader to handle this file type. (Source code omitted for this binary file) @ ./~/css-loader!./src/css/banner.css 6:570-597 @ ./src/css/banner.css @ ./src/js/index.js ERROR in ./src/imgs/right.png Module parse failed: C:\Users\Administrator\Desktop\test\src\imgs\right.png Unexpected character '�' (1:0) You may need an appropriate loader to handle this file type. (Source code omitted for this binary file) @ ./~/css-loader!./src/css/banner.css 6:737-765 @ ./src/css/banner.css @ ./src/js/index.js 我的webpack.config.js配置如下 var webpack=require('webpack'); module.exports={ entry:'./src/js/index.js', output:{ path:__dirname+'/bundle', filename:'[name].js' }, module: { rules: [ { test: /\.css$/, use: ['style-loader','css-loader'] }, { test:'/\.(png|jpg|gif)$/', use: [ { loader: 'url-loader', options: { name: 'assets/[name]-[hash:5].[ext]', limit: 4000 } }, 'image-webpack-loader' ] } ] } } 请问大神为什么会报那样的错误 求指教

webpack build报错 ERROR in 1.ea409344b3c6c7fd1ccf.chunk.js from UglifyJs

项目可以正常运行,突然打包报错,有没有大神指点一下 ``` ERROR in 1.ea409344b3c6c7fd1ccf.chunk.js from UglifyJs Unexpected token: operator (>) [1.ea409344b3c6c7fd1ccf.chunk.js:4739,34] Child html-webpack-plugin for "..\index.html": 1 asset Child extract-text-webpack-plugin node_modules/_extract-text-webpack-plugin@3.0.2@extract-text-webpack-plugin/dist node_modules/_css-loader@0.28.11@css-loader/index.js?minimize!node_modules/_autoprefixer-loader@3.2.0@autoprefixer-loader/index.js!node_modules/_iview@3.3.3@iview/dist/styles/iview.css: 3 assets Child extract-text-webpack-plugin node_modules/_extract-text-webpack-plugin@3.0.2@extract-text-webpack-plugin/dist node_modules/_css-loader@0.28.11@css-loader/index.js?minimize!node_modules/_autoprefixer-loader@3.2.0@autoprefixer-loader/index.js!node_modules/_less-loader@4.1.0@less-loader/dist/cjs.js!src/styles/my-theme.less: Asset Size Chunks Chunk Names d535a25a79fb1365ae814b61e88fae71.ttf 198 kB [emitted] 99ac3308dd8ee14f749f51538d0d5b9e.woff 198 kB [emitted] a2c4a261a239aa84463dc70e4bac9b9a.svg 555 kB [emitted] [big] npm ERR! code ELIFECYCLE npm ERR! errno 2 npm ERR! smart-lock@1.2.3 build: `webpack --progress --hide-modules --config build/webpack.prod.config.js` npm ERR! Exit status 2 npm ERR! npm ERR! Failed at the smart-lock@1.2.3 build script. npm ERR! This is probably not a problem with npm. There is likely additional logging output above. ```

webpack运营时候出错了

D:\xampp\htdocs\webpacktesst>webpack Hash: 09b87ca2b2cef434796f Version: webpack 1.13.2 Time: 3713ms Asset Size Chunks Chunk Names bundle.js 508 kB 0 [emitted] main bundle.css 7.75 kB 0 [emitted] main bundle.js.map 866 kB 0 [emitted] main bundle.css.map 87 bytes 0 [emitted] main [0] multi main 40 bytes {0} [built] + 116 hidden modules ERROR in ./~/react-style-webpack-plugin/lib/emptyLoader.js!./~/extract-text-webpack-plugin/loader.js?{"remove":true}!./~/react-style-webpack-plugin/lib/entry.js!./index.js Module build failed: Child extract-text-webpack-plugin: + 2 hidden modules Child extract-text-webpack-plugin: + 111 hidden modules

webpack4.0中引入app.vue出现报错

**webpack4.0中引入app.vue出现报错** 我正在学vue.js实战,但是这本书事两年前写的,书中的vue配置有些已经不能用了, 我在配置完webpack.config.js后创建了个app.vue,然后就报错了,百度过,没找到合适的答案,请问各位大佬有遇到过吗。求解答,谢谢,下面是报错截图,以及webpack.config.js的截图,谢谢 ![图片说明](https://img-ask.csdn.net/upload/201909/16/1568602107_212983.png) ![图片说明](https://img-ask.csdn.net/upload/201909/16/1568602131_486744.png) **webpack.config.js:** var path = require('path'); var ExtractTextPlugin = require('extract-text-webpack-plugin'); var config = { entry : { main : './main' }, output : { path : path.join(__dirname, './dist'), publicPath : '/dist/', filename : 'main.js' }, module: { rules: [ { test: /\.vue$/, loader : 'vue-loader', options : { loaders : { css : ExtractTextPlugin.extract({ use : 'css-loader', fallback : 'vue-style-loader' }) } } }, { test : /\.js$/, loader : 'babel-loader', exclude : /node_modules/ }, { test : /\.css$/, use : ExtractTextPlugin.extract({ use : 'css-loader', fallback : 'style-loader' }) } ] }, plugins : [ //重命名提取后的css文件 new ExtractTextPlugin("main.css") ] }; module.exports = config; **package.json:** { "name": "vuedemo04", "version": "1.0.0", "description": "", "main": "index.js", "scripts": { "test": "echo \"Error: no test specified\" && exit 1", "dev": "webpack-dev-server --host 192.168.0.114 --port 8888 --open --config webpack.config.js" }, "author": "", "license": "ISC", "devDependencies": { "@babel/core": "^7.6.0", "@babel/plugin-proposal-class-properties": "^7.5.5", "@babel/plugin-transform-runtime": "^7.6.0", "@babel/preset-env": "^7.6.0", "@babel/runtime": "^7.6.0", "babel": "^6.23.0", "babel-core": "^6.26.3", "babel-loader": "^8.0.6", "babel-plugin-transform-runtime": "^6.23.0", "babel-preset-env": "^1.7.0", "babel-preset-es2015": "^6.24.1", "babel-runtime": "^6.26.0", "css-loader": "^3.2.0", "extract-text-webpack-plugin": "^4.0.0-beta.0", "style-loader": "^1.0.0", "vue-hot-reload-api": "^2.3.3", "vue-loader": "^15.7.1", "vue-style-loader": "^4.1.2", "vue-template-compiler": "^2.6.10", "webpack": "^4.39.3", "webpack-cli": "^3.3.8", "webpack-dev-server": "^3.8.0" }, "dependencies": { "vue": "^2.6.10" } } **main.js:** import Vue from 'vue'; import App from './app.vue'; new Vue({ el:'#app', render : h => h(App) }); **app.vue:** ![图片说明](https://img-ask.csdn.net/upload/201909/16/1568602350_668161.png) **style.css:** ![图片说明](https://img-ask.csdn.net/upload/201909/16/1568602435_444026.png) **index.html:** ![图片说明](https://img-ask.csdn.net/upload/201909/16/1568602485_888515.png) **vue项目结构:**

关于vue的cli里面package.json文件?

求大神指教一下这里面的东西都是啥?特别是scripts里面的,我发现我家里电脑的scripts里面的东西跟公司里scripts里面的东西是不一样的? ``` { "name": "zhiliao.0", "version": "1.0.0", "description": "A Vue.js project", "author": "momo <552488648@qq.com>", "private": true, "scripts": { "dev": "node build/dev-server.js", "build": "npm run build-prod", "start": "cross-env node build/webpack.dll.js && cross-env TYPE=local node build/dev-server.js", "start-dev": "node build/webpack.dll.js && cross-env TYPE=dev node build/dev-server.js", "start-test": "node build/webpack.dll.js && cross-env TYPE=test node build/dev-server.js", "start-prod": "node build/webpack.dll.js && cross-env TYPE=prod node build/dev-server.js", "build-local": "cross-env TYPE=local model=dev node build/webpack.dll.js && cross-env TYPE=local node build/build.js", "build-dev": "cross-env TYPE=dev model=build node build/webpack.dll.js && cross-env TYPE=dev node build/build.js", "build-test": "cross-env TYPE=test model=build node build/webpack.dll.js && cross-env TYPE=test node build/build.js", "build-prod": "cross-env TYPE=prod model=build node build/webpack.dll.js && cross-env TYPE=prod node build/build.js" }, "dependencies": { "axios": "^0.15.3", "blueimp-md5": "^2.7.0", "es6-promise": "^4.1.0", "mint-ui": "^2.2.1", "qs": "^6.4.0", "vue": "^2.2.2", "vue-baidu-map": "^0.10.5", "vue-router": "^2.2.0", "vuex": "^2.2.1", "weixin-js-sdk": "^1.2.0" }, "devDependencies": { "add-asset-html-webpack-plugin": "^2.1.2", "autoprefixer": "^6.7.2", "babel-core": "^6.22.1", "babel-eslint": "^8.0.3", "babel-loader": "^6.2.10", "babel-plugin-syntax-jsx": "^6.18.0", "babel-plugin-transform-runtime": "^6.22.0", "babel-plugin-transform-vue-jsx": "^3.5.0", "babel-preset-env": "^1.2.1", "babel-preset-es2015": "^6.24.1", "babel-preset-stage-2": "^6.22.0", "babel-register": "^6.22.0", "babel-runtime": "^6.26.0", "chalk": "^1.1.3", "connect-history-api-fallback": "^1.3.0", "copy-webpack-plugin": "^4.0.1", "cross-env": "^5.1.1", "css-loader": "^0.26.4", "eslint": "4.4.1", "eslint-config-standard": "10.2.1", "eslint-friendly-formatter": "3.0.0", "eslint-loader": "1.9.0", "eslint-plugin-html": "3.1.1", "eslint-plugin-import": "2.7.0", "eslint-plugin-node": "5.1.1", "eslint-plugin-promise": "3.5.0", "eslint-plugin-standard": "3.0.1", "eventsource-polyfill": "^0.9.6", "express": "^4.14.1", "extract-text-webpack-plugin": "^2.0.0", "file-loader": "^0.10.0", "form-data": "^0.2.0", "friendly-errors-webpack-plugin": "^1.1.3", "function-bind": "^1.1.0", "happypack": "^4.0.0", "html-webpack-plugin": "^2.28.0", "http-proxy-middleware": "^0.17.3", "iconv-lite": "^0.4.7", "mime": "~1.3.4", "node-sass": "^4.9.3", "opn": "^4.0.2", "optimize-css-assets-webpack-plugin": "^1.3.0", "ora": "^1.3.0", "portfinder": "^1.0.13", "request": "~2.72.0", "rimraf": "^2.6.0", "sass-loader": "^6.0.6", "semver": "^5.3.0", "shelljs": "^0.8.1", "url-loader": "^0.5.7", "urlencode": "^1.1.0", "verification-code": "^1.0.0", "vue-loader": "^11.1.4", "vue-style-loader": "^2.0.5", "vue-template-compiler": "^2.2.4", "webpack": "^2.2.1", "webpack-bundle-analyzer": "^2.2.1", "webpack-dev-middleware": "^1.10.0", "webpack-hot-middleware": "^2.16.1", "webpack-merge": "^2.6.1", "webpack-parallel-uglify-plugin": "^1.0.2", "workbox-webpack-plugin": "^2.1.2", "ws": "^0.4.32" }, "engines": { "node": ">= 4.0.0", "npm": ">= 3.0.0" }, "publishConfig": { "registry": "http://registry.npm.alibaba-inc.com" }, "browserslist": [ "> 1%", "last 2 versions", "not ie <= 8" ] } ```

自己用webpack构建vue项目报错,求帮助万分感谢

神烦怎么也解决不了问题,用localhost能访问到的是目录 用node:{ fs: 'empty', net: 'empty', tls: 'empty', child_process: 'empty' }能减少几个报错信息 以下是我的配置 ``` const path = require('path'); const HTMLPlugin = require('html-webpack-plugin'); const VueLoaderPlugin = require('vue-loader/lib/plugin'); const webpack = require('webpack'); const isDev = process.env.NODE_ENV === 'development'; //package.json设置的对象全部存在process.env里面 const config = { target: 'web', entry: path.join(__dirname, 'src/index.js'),//设置入口,__dirname代表本文件所在的地址,也就是根目录 output: { filename: 'bundle.js', //打包的名字 path: path.join(__dirname, 'dist') //打包路径 }, plugins: [ // make sure to include the plugin for the magic new VueLoaderPlugin(), new webpack.DefinePlugin({ 'process.env': { NODE_ENV: isDev ? '"development"' : '"production"' //调用process.env.NODE_ENV 可以获取 环境 } }), new HTMLPlugin() ], module: { rules: [ { test: /\.vue$/, loader: 'vue-loader' }, { test: /\.css$/, use: [ 'style-loader', 'css-loader' ] }, { test: /\.styl$/, use: [ 'style-loader', 'css-loader', 'stylus-loader' ] }, { test: /\.(jpg|gif|jpeg|png|svg)$/, use: [{ loader: 'url-loader', options: { limit: 1024,//可以帮小于1024的图片转换base-64代码直接写在js里面,减少http请求 name: '[name].[ext]' //重命名 name图片原来的名字 ext文件扩展名 } }] } ] } }; if (isDev) { config.devServer = { port: '8200', host: '0.0.0.0', overlay: { errors: true, } } } module.exports = config; ``` 下面是报错信息 ERROR in ./node_modules/_fsevents@1.2.4@fsevents/node_modules/node-pre-gyp/lib/testbinary.js Module not found: Error: Can't resolve 'child_process' in 'D:\java\JetBrains\module\vue-app\vue-todo\node_modules\_fsevents@1.2.4@fsevents\node_modules\node-pre-gyp\lib' @ ./node_modules/_fsevents@1.2.4@fsevents/node_modules/node-pre-gyp/lib/testbinary.js 10:9-33 @ ./node_modules/_fsevents@1.2.4@fsevents/node_modules/node-pre-gyp/lib sync ^\.\/.*$ @ ./node_modules/_fsevents@1.2.4@fsevents/node_modules/node-pre-gyp/lib/node-pre-gyp.js @ ./node_modules/_fsevents@1.2.4@fsevents/fsevents.js @ ./node_modules/_chokidar@2.0.4@chokidar/lib/fsevents-handler.js @ ./node_modules/_chokidar@2.0.4@chokidar/index.js @ ./node_modules/_watchpack@1.6.0@watchpack/lib/DirectoryWatcher.js @ ./node_modules/_watchpack@1.6.0@watchpack/lib/watcherManager.js @ ./node_modules/_watchpack@1.6.0@watchpack/lib/watchpack.js @ (webpack)/lib/node/NodeWatchFileSystem.js @ (webpack)/lib/node/NodeEnvironmentPlugin.js @ (webpack)/lib/webpack.js @ multi ./node_modules/_webpack-dev-server@3.1.9@webpack-dev-server/client?http://0.0.0.0:8200 webpack ERROR in ./node_modules/_fsevents@1.2.4@fsevents/node_modules/node-pre-gyp/lib/util/compile.js Module not found: Error: Can't resolve 'child_process' in 'D:\java\JetBrains\module\vue-app\vue-todo\node_modules\_fsevents@1.2.4@fsevents\node_modules\node-pre-gyp\lib\util' @ ./node_modules/_fsevents@1.2.4@fsevents/node_modules/node-pre-gyp/lib/util/compile.js 9:9-33 @ ./node_modules/_fsevents@1.2.4@fsevents/node_modules/node-pre-gyp/lib sync ^\.\/.*$ @ ./node_modules/_fsevents@1.2.4@fsevents/node_modules/node-pre-gyp/lib/node-pre-gyp.js @ ./node_modules/_fsevents@1.2.4@fsevents/fsevents.js @ ./node_modules/_chokidar@2.0.4@chokidar/lib/fsevents-handler.js @ ./node_modules/_chokidar@2.0.4@chokidar/index.js @ ./node_modules/_watchpack@1.6.0@watchpack/lib/DirectoryWatcher.js @ ./node_modules/_watchpack@1.6.0@watchpack/lib/watcherManager.js @ ./node_modules/_watchpack@1.6.0@watchpack/lib/watchpack.js @ (webpack)/lib/node/NodeWatchFileSystem.js @ (webpack)/lib/node/NodeEnvironmentPlugin.js @ (webpack)/lib/webpack.js @ multi ./node_modules/_webpack-dev-server@3.1.9@webpack-dev-server/client?http://0.0.0.0:8200 webpack ERROR in ./node_modules/_fsevents@1.2.4@fsevents/node_modules/osenv/osenv.js Module not found: Error: Can't resolve 'child_process' in 'D:\java\JetBrains\module\vue-app\vue-todo\node_modules\_fsevents@1.2.4@fsevents\node_modules\osenv' @ ./node_modules/_fsevents@1.2.4@fsevents/node_modules/osenv/osenv.js 3:11-35 @ ./node_modules/_fsevents@1.2.4@fsevents/node_modules/nopt/lib/nopt.js @ ./node_modules/_fsevents@1.2.4@fsevents/node_modules/node-pre-gyp/lib/node-pre-gyp.js @ ./node_modules/_fsevents@1.2.4@fsevents/fsevents.js @ ./node_modules/_chokidar@2.0.4@chokidar/lib/fsevents-handler.js @ ./node_modules/_chokidar@2.0.4@chokidar/index.js @ ./node_modules/_watchpack@1.6.0@watchpack/lib/DirectoryWatcher.js @ ./node_modules/_watchpack@1.6.0@watchpack/lib/watcherManager.js @ ./node_modules/_watchpack@1.6.0@watchpack/lib/watchpack.js @ (webpack)/lib/node/NodeWatchFileSystem.js @ (webpack)/lib/node/NodeEnvironmentPlugin.js @ (webpack)/lib/webpack.js @ multi ./node_modules/_webpack-dev-server@3.1.9@webpack-dev-server/client?http://0.0.0.0:8200 webpack ERROR in ./node_modules/_worker-farm@1.6.0@worker-farm/lib/fork.js Module not found: Error: Can't resolve 'child_process' in 'D:\java\JetBrains\module\vue-app\vue-todo\node_modules\_worker-farm@1.6.0@worker-farm\lib' @ ./node_modules/_worker-farm@1.6.0@worker-farm/lib/fork.js 3:21-45 @ ./node_modules/_worker-farm@1.6.0@worker-farm/lib/farm.js @ ./node_modules/_worker-farm@1.6.0@worker-farm/lib/index.js @ ./node_modules/_uglifyjs-webpack-plugin@1.3.0@uglifyjs-webpack-plugin/dist/uglify/Runner.js @ ./node_modules/_uglifyjs-webpack-plugin@1.3.0@uglifyjs-webpack-plugin/dist/index.js @ ./node_modules/_uglifyjs-webpack-plugin@1.3.0@uglifyjs-webpack-plugin/dist/cjs.js @ (webpack)/lib/WebpackOptionsDefaulter.js @ (webpack)/lib/webpack.js @ multi ./node_modules/_webpack-dev-server@3.1.9@webpack-dev-server/client?http://0.0.0.0:8200 webpack ERROR in ./node_modules/_cacache@10.0.4@cacache/get.js Module not found: Error: Can't resolve 'fs' in 'D:\java\JetBrains\module\vue-app\vue-todo\node_modules\_cacache@10.0.4@cacache' @ ./node_modules/_cacache@10.0.4@cacache/get.js 5:11-24 @ ./node_modules/_cacache@10.0.4@cacache/locales/en.js @ ./node_modules/_cacache@10.0.4@cacache/index.js @ ./node_modules/_uglifyjs-webpack-plugin@1.3.0@uglifyjs-webpack-plugin/dist/uglify/Runner.js @ ./node_modules/_uglifyjs-webpack-plugin@1.3.0@uglifyjs-webpack-plugin/dist/index.js @ ./node_modules/_uglifyjs-webpack-plugin@1.3.0@uglifyjs-webpack-plugin/dist/cjs.js @ (webpack)/lib/WebpackOptionsDefaulter.js @ (webpack)/lib/webpack.js @ multi ./node_modules/_webpack-dev-server@3.1.9@webpack-dev-server/client?http://0.0.0.0:8200 webpack ERROR in ./node_modules/_chokidar@2.0.4@chokidar/index.js Module not found: Error: Can't resolve 'fs' in 'D:\java\JetBrains\module\vue-app\vue-todo\node_modules\_chokidar@2.0.4@chokidar' @ ./node_modules/_chokidar@2.0.4@chokidar/index.js 3:9-22 @ ./node_modules/_watchpack@1.6.0@watchpack/lib/DirectoryWatcher.js @ ./node_modules/_watchpack@1.6.0@watchpack/lib/watcherManager.js @ ./node_modules/_watchpack@1.6.0@watchpack/lib/watchpack.js @ (webpack)/lib/node/NodeWatchFileSystem.js @ (webpack)/lib/node/NodeEnvironmentPlugin.js @ (webpack)/lib/webpack.js @ multi ./node_modules/_webpack-dev-server@3.1.9@webpack-dev-server/client?http://0.0.0.0:8200 webpack ERROR in ./node_modules/_chokidar@2.0.4@chokidar/lib/fsevents-handler.js Module not found: Error: Can't resolve 'fs' in 'D:\java\JetBrains\module\vue-app\vue-todo\node_modules\_chokidar@2.0.4@chokidar\lib' @ ./node_modules/_chokidar@2.0.4@chokidar/lib/fsevents-handler.js 3:9-22 @ ./node_modules/_chokidar@2.0.4@chokidar/index.js @ ./node_modules/_watchpack@1.6.0@watchpack/lib/DirectoryWatcher.js @ ./node_modules/_watchpack@1.6.0@watchpack/lib/watcherManager.js @ ./node_modules/_watchpack@1.6.0@watchpack/lib/watchpack.js @ (webpack)/lib/node/NodeWatchFileSystem.js @ (webpack)/lib/node/NodeEnvironmentPlugin.js @ (webpack)/lib/webpack.js @ multi ./node_modules/_webpack-dev-server@3.1.9@webpack-dev-server/client?http://0.0.0.0:8200 webpack ERROR in ./node_modules/_chokidar@2.0.4@chokidar/lib/nodefs-handler.js Module not found: Error: Can't resolve 'fs' in 'D:\java\JetBrains\module\vue-app\vue-todo\node_modules\_chokidar@2.0.4@chokidar\lib' @ ./node_modules/_chokidar@2.0.4@chokidar/lib/nodefs-handler.js 3:9-22 @ ./node_modules/_chokidar@2.0.4@chokidar/index.js @ ./node_modules/_watchpack@1.6.0@watchpack/lib/DirectoryWatcher.js @ ./node_modules/_watchpack@1.6.0@watchpack/lib/watcherManager.js @ ./node_modules/_watchpack@1.6.0@watchpack/lib/watchpack.js @ (webpack)/lib/node/NodeWatchFileSystem.js @ (webpack)/lib/node/NodeEnvironmentPlugin.js @ (webpack)/lib/webpack.js @ multi ./node_modules/_webpack-dev-server@3.1.9@webpack-dev-server/client?http://0.0.0.0:8200 webpack ERROR in ./node_modules/_chownr@1.1.1@chownr/chownr.js Module not found: Error: Can't resolve 'fs' in 'D:\java\JetBrains\module\vue-app\vue-todo\node_modules\_chownr@1.1.1@chownr' @ ./node_modules/_chownr@1.1.1@chownr/chownr.js 2:11-24 @ ./node_modules/_cacache@10.0.4@cacache/lib/util/fix-owner.js @ ./node_modules/_cacache@10.0.4@cacache/lib/util/tmp.js @ ./node_modules/_cacache@10.0.4@cacache/locales/en.js @ ./node_modules/_cacache@10.0.4@cacache/index.js @ ./node_modules/_uglifyjs-webpack-plugin@1.3.0@uglifyjs-webpack-plugin/dist/uglify/Runner.js @ ./node_modules/_uglifyjs-webpack-plugin@1.3.0@uglifyjs-webpack-plugin/dist/index.js @ ./node_modules/_uglifyjs-webpack-plugin@1.3.0@uglifyjs-webpack-plugin/dist/cjs.js @ (webpack)/lib/WebpackOptionsDefaulter.js @ (webpack)/lib/webpack.js @ multi ./node_modules/_webpack-dev-server@3.1.9@webpack-dev-server/client?http://0.0.0.0:8200 webpack ERROR in ./node_modules/_copy-concurrently@1.0.5@copy-concurrently/copy.js Module not found: Error: Can't resolve 'fs' in 'D:\java\JetBrains\module\vue-app\vue-todo\node_modules\_copy-concurrently@1.0.5@copy-concurrently' @ ./node_modules/_copy-concurrently@1.0.5@copy-concurrently/copy.js 8:13-26 @ ./node_modules/_move-concurrently@1.0.1@move-concurrently/move.js @ ./node_modules/_cacache@10.0.4@cacache/lib/util/move-file.js @ ./node_modules/_cacache@10.0.4@cacache/lib/content/write.js @ ./node_modules/_cacache@10.0.4@cacache/put.js @ ./node_modules/_cacache@10.0.4@cacache/locales/en.js @ ./node_modules/_cacache@10.0.4@cacache/index.js @ ./node_modules/_uglifyjs-webpack-plugin@1.3.0@uglifyjs-webpack-plugin/dist/uglify/Runner.js @ ./node_modules/_uglifyjs-webpack-plugin@1.3.0@uglifyjs-webpack-plugin/dist/index.js @ ./node_modules/_uglifyjs-webpack-plugin@1.3.0@uglifyjs-webpack-plugin/dist/cjs.js @ (webpack)/lib/WebpackOptionsDefaulter.js @ (webpack)/lib/webpack.js @ multi ./node_modules/_webpack-dev-server@3.1.9@webpack-dev-server/client?http://0.0.0.0:8200 webpack ERROR in ./node_modules/_fs.realpath@1.0.0@fs.realpath/old.js Module not found: Error: Can't resolve 'fs' in 'D:\java\JetBrains\module\vue-app\vue-todo\node_modules\_fs.realpath@1.0.0@fs.realpath' @ ./node_modules/_fs.realpath@1.0.0@fs.realpath/old.js 24:9-22 @ ./node_modules/_fs.realpath@1.0.0@fs.realpath/index.js @ ./node_modules/_glob@7.1.3@glob/glob.js @ ./node_modules/_cacache@10.0.4@cacache/lib/verify.js @ ./node_modules/_cacache@10.0.4@cacache/verify.js @ ./node_modules/_cacache@10.0.4@cacache/locales/en.js @ ./node_modules/_cacache@10.0.4@cacache/index.js @ ./node_modules/_uglifyjs-webpack-plugin@1.3.0@uglifyjs-webpack-plugin/dist/uglify/Runner.js @ ./node_modules/_uglifyjs-webpack-plugin@1.3.0@uglifyjs-webpack-plugin/dist/index.js @ ./node_modules/_uglifyjs-webpack-plugin@1.3.0@uglifyjs-webpack-plugin/dist/cjs.js @ (webpack)/lib/WebpackOptionsDefaulter.js @ (webpack)/lib/webpack.js @ multi ./node_modules/_webpack-dev-server@3.1.9@webpack-dev-server/client?http://0.0.0.0:8200 webpack ERROR in ./node_modules/_fs.realpath@1.0.0@fs.realpath/index.js Module not found: Error: Can't resolve 'fs' in 'D:\java\JetBrains\module\vue-app\vue-todo\node_modules\_fs.realpath@1.0.0@fs.realpath' @ ./node_modules/_fs.realpath@1.0.0@fs.realpath/index.js 8:9-22 @ ./node_modules/_glob@7.1.3@glob/glob.js @ ./node_modules/_cacache@10.0.4@cacache/lib/verify.js @ ./node_modules/_cacache@10.0.4@cacache/verify.js @ ./node_modules/_cacache@10.0.4@cacache/locales/en.js @ ./node_modules/_cacache@10.0.4@cacache/index.js @ ./node_modules/_uglifyjs-webpack-plugin@1.3.0@uglifyjs-webpack-plugin/dist/uglify/Runner.js @ ./node_modules/_uglifyjs-webpack-plugin@1.3.0@uglifyjs-webpack-plugin/dist/index.js @ ./node_modules/_uglifyjs-webpack-plugin@1.3.0@uglifyjs-webpack-plugin/dist/cjs.js @ (webpack)/lib/WebpackOptionsDefaulter.js @ (webpack)/lib/webpack.js @ multi ./node_modules/_webpack-dev-server@3.1.9@webpack-dev-server/client?http://0.0.0.0:8200 webpack ERROR in ./node_modules/_fsevents@1.2.4@fsevents/fsevents.js Module not found: Error: Can't resolve 'fs' in 'D:\java\JetBrains\module\vue-app\vue-todo\node_modules\_fsevents@1.2.4@fsevents' @ ./node_modules/_fsevents@1.2.4@fsevents/fsevents.js 17:9-22 @ ./node_modules/_chokidar@2.0.4@chokidar/lib/fsevents-handler.js @ ./node_modules/_chokidar@2.0.4@chokidar/index.js @ ./node_modules/_watchpack@1.6.0@watchpack/lib/DirectoryWatcher.js @ ./node_modules/_watchpack@1.6.0@watchpack/lib/watcherManager.js @ ./node_modules/_watchpack@1.6.0@watchpack/lib/watchpack.js @ (webpack)/lib/node/NodeWatchFileSystem.js @ (webpack)/lib/node/NodeEnvironmentPlugin.js @ (webpack)/lib/webpack.js @ multi ./node_modules/_webpack-dev-server@3.1.9@webpack-dev-server/client?http://0.0.0.0:8200 webpack ERROR in ./node_modules/_fsevents@1.2.4@fsevents/node_modules/chownr/chownr.js Module not found: Error: Can't resolve 'fs' in 'D:\java\JetBrains\module\vue-app\vue-todo\node_modules\_fsevents@1.2.4@fsevents\node_modules\chownr' @ ./node_modules/_fsevents@1.2.4@fsevents/node_modules/chownr/chownr.js 4:9-22 @ ./node_modules/_fsevents@1.2.4@fsevents/node_modules/tar/lib/mkdir.js @ ./node_modules/_fsevents@1.2.4@fsevents/node_modules/tar/lib/unpack.js @ ./node_modules/_fsevents@1.2.4@fsevents/node_modules/tar/index.js @ ./node_modules/_fsevents@1.2.4@fsevents/node_modules/node-pre-gyp/lib/package.js @ ./node_modules/_fsevents@1.2.4@fsevents/node_modules/node-pre-gyp/lib sync ^\.\/.*$ @ ./node_modules/_fsevents@1.2.4@fsevents/node_modules/node-pre-gyp/lib/node-pre-gyp.js @ ./node_modules/_fsevents@1.2.4@fsevents/fsevents.js @ ./node_modules/_chokidar@2.0.4@chokidar/lib/fsevents-handler.js @ ./node_modules/_chokidar@2.0.4@chokidar/index.js @ ./node_modules/_watchpack@1.6.0@watchpack/lib/DirectoryWatcher.js @ ./node_modules/_watchpack@1.6.0@watchpack/lib/watcherManager.js @ ./node_modules/_watchpack@1.6.0@watchpack/lib/watchpack.js @ (webpack)/lib/node/NodeWatchFileSystem.js @ (webpack)/lib/node/NodeEnvironmentPlugin.js @ (webpack)/lib/webpack.js @ multi ./node_modules/_webpack-dev-server@3.1.9@webpack-dev-server/client?http://0.0.0.0:8200 webpack ERROR in ./node_modules/_fsevents@1.2.4@fsevents/node_modules/detect-libc/lib/detect-libc.js Module not found: Error: Can't resolve 'fs' in 'D:\java\JetBrains\module\vue-app\vue-todo\node_modules\_fsevents@1.2.4@fsevents\node_modules\detect-libc\lib' @ ./node_modules/_fsevents@1.2.4@fsevents/node_modules/detect-libc/lib/detect-libc.js 5:18-31 @ ./node_modules/_fsevents@1.2.4@fsevents/node_modules/node-pre-gyp/lib/util/versioning.js @ ./node_modules/_fsevents@1.2.4@fsevents/node_modules/node-pre-gyp/lib sync ^\.\/.*$ @ ./node_modules/_fsevents@1.2.4@fsevents/node_modules/node-pre-gyp/lib/node-pre-gyp.js @ ./node_modules/_fsevents@1.2.4@fsevents/fsevents.js @ ./node_modules/_chokidar@2.0.4@chokidar/lib/fsevents-handler.js @ ./node_modules/_chokidar@2.0.4@chokidar/index.js @ ./node_modules/_watchpack@1.6.0@watchpack/lib/DirectoryWatcher.js @ ./node_modules/_watchpack@1.6.0@watchpack/lib/watcherManager.js @ ./node_modules/_watchpack@1.6.0@watchpack/lib/watchpack.js @ (webpack)/lib/node/NodeWatchFileSystem.js @ (webpack)/lib/node/NodeEnvironmentPlugin.js @ (webpack)/lib/webpack.js @ multi ./node_modules/_webpack-dev-server@3.1.9@webpack-dev-server/client?http://0.0.0.0:8200 webpack ERROR in ./node_modules/_fsevents@1.2.4@fsevents/node_modules/fs-minipass/index.js Module not found: Error: Can't resolve 'fs' in 'D:\java\JetBrains\module\vue-app\vue-todo\node_modules\_fsevents@1.2.4@fsevents\node_modules\fs-minipass' @ ./node_modules/_fsevents@1.2.4@fsevents/node_modules/fs-minipass/index.js 4:11-24 @ ./node_modules/_fsevents@1.2.4@fsevents/node_modules/tar/lib/create.js @ ./node_modules/_fsevents@1.2.4@fsevents/node_modules/tar/index.js @ ./node_modules/_fsevents@1.2.4@fsevents/node_modules/node-pre-gyp/lib/package.js @ ./node_modules/_fsevents@1.2.4@fsevents/node_modules/node-pre-gyp/lib sync ^\.\/.*$ @ ./node_modules/_fsevents@1.2.4@fsevents/node_modules/node-pre-gyp/lib/node-pre-gyp.js @ ./node_modules/_fsevents@1.2.4@fsevents/fsevents.js @ ./node_modules/_chokidar@2.0.4@chokidar/lib/fsevents-handler.js @ ./node_modules/_chokidar@2.0.4@chokidar/index.js @ ./node_modules/_watchpack@1.6.0@watchpack/lib/DirectoryWatcher.js @ ./node_modules/_watchpack@1.6.0@watchpack/lib/watcherManager.js @ ./node_modules/_watchpack@1.6.0@watchpack/lib/watchpack.js @ (webpack)/lib/node/NodeWatchFileSystem.js @ (webpack)/lib/node/NodeEnvironmentPlugin.js @ (webpack)/lib/webpack.js @ multi ./node_modules/_webpack-dev-server@3.1.9@webpack-dev-server/client?http://0.0.0.0:8200 webpack ERROR in ./node_modules/_fsevents@1.2.4@fsevents/node_modules/fs.realpath/old.js Module not found: Error: Can't resolve 'fs' in 'D:\java\JetBrains\module\vue-app\vue-todo\node_modules\_fsevents@1.2.4@fsevents\node_modules\fs.realpath' @ ./node_modules/_fsevents@1.2.4@fsevents/node_modules/fs.realpath/old.js 24:9-22 @ ./node_modules/_fsevents@1.2.4@fsevents/node_modules/fs.realpath/index.js @ ./node_modules/_fsevents@1.2.4@fsevents/node_modules/glob/glob.js @ ./node_modules/_fsevents@1.2.4@fsevents/node_modules/rimraf/rimraf.js @ ./node_modules/_fsevents@1.2.4@fsevents/node_modules/node-pre-gyp/lib/util/napi.js @ ./node_modules/_fsevents@1.2.4@fsevents/node_modules/node-pre-gyp/lib/node-pre-gyp.js @ ./node_modules/_fsevents@1.2.4@fsevents/fsevents.js @ ./node_modules/_chokidar@2.0.4@chokidar/lib/fsevents-handler.js @ ./node_modules/_chokidar@2.0.4@chokidar/index.js @ ./node_modules/_watchpack@1.6.0@watchpack/lib/DirectoryWatcher.js @ ./node_modules/_watchpack@1.6.0@watchpack/lib/watcherManager.js @ ./node_modules/_watchpack@1.6.0@watchpack/lib/watchpack.js @ (webpack)/lib/node/NodeWatchFileSystem.js @ (webpack)/lib/node/NodeEnvironmentPlugin.js @ (webpack)/lib/webpack.js @ multi ./node_modules/_webpack-dev-server@3.1.9@webpack-dev-server/client?http://0.0.0.0:8200 webpack ERROR in ./node_modules/_fsevents@1.2.4@fsevents/node_modules/fs.realpath/index.js Module not found: Error: Can't resolve 'fs' in 'D:\java\JetBrains\module\vue-app\vue-todo\node_modules\_fsevents@1.2.4@fsevents\node_modules\fs.realpath' @ ./node_modules/_fsevents@1.2.4@fsevents/node_modules/fs.realpath/index.js 8:9-22 @ ./node_modules/_fsevents@1.2.4@fsevents/node_modules/glob/glob.js @ ./node_modules/_fsevents@1.2.4@fsevents/node_modules/rimraf/rimraf.js @ ./node_modules/_fsevents@1.2.4@fsevents/node_modules/node-pre-gyp/lib/util/napi.js @ ./node_modules/_fsevents@1.2.4@fsevents/node_modules/node-pre-gyp/lib/node-pre-gyp.js @ ./node_modules/_fsevents@1.2.4@fsevents/fsevents.js @ ./node_modules/_chokidar@2.0.4@chokidar/lib/fsevents-handler.js @ ./node_modules/_chokidar@2.0.4@chokidar/index.js @ ./node_modules/_watchpack@1.6.0@watchpack/lib/DirectoryWatcher.js @ ./node_modules/_watchpack@1.6.0@watchpack/lib/watcherManager.js @ ./node_modules/_watchpack@1.6.0@watchpack/lib/watchpack.js @ (webpack)/lib/node/NodeWatchFileSystem.js @ (webpack)/lib/node/NodeEnvironmentPlugin.js @ (webpack)/lib/webpack.js @ multi ./node_modules/_webpack-dev-server@3.1.9@webpack-dev-server/client?http://0.0.0.0:8200 webpack ERROR in ./node_modules/_fsevents@1.2.4@fsevents/node_modules/glob/glob.js Module not found: Error: Can't resolve 'fs' in 'D:\java\JetBrains\module\vue-app\vue-todo\node_modules\_fsevents@1.2.4@fsevents\node_modules\glob' @ ./node_modules/_fsevents@1.2.4@fsevents/node_modules/glob/glob.js 43:9-22 @ ./node_modules/_fsevents@1.2.4@fsevents/node_modules/rimraf/rimraf.js @ ./node_modules/_fsevents@1.2.4@fsevents/node_modules/node-pre-gyp/lib/util/napi.js @ ./node_modules/_fsevents@1.2.4@fsevents/node_modules/node-pre-gyp/lib/node-pre-gyp.js @ ./node_modules/_fsevents@1.2.4@fsevents/fsevents.js @ ./node_modules/_chokidar@2.0.4@chokidar/lib/fsevents-handler.js @ ./node_modules/_chokidar@2.0.4@chokidar/index.js @ ./node_modules/_watchpack@1.6.0@watchpack/lib/DirectoryWatcher.js @ ./node_modules/_watchpack@1.6.0@watchpack/lib/watcherManager.js @ ./node_modules/_watchpack@1.6.0@watchpack/lib/watchpack.js @ (webpack)/lib/node/NodeWatchFileSystem.js @ (webpack)/lib/node/NodeEnvironmentPlugin.js @ (webpack)/lib/webpack.js @ multi ./node_modules/_webpack-dev-server@3.1.9@webpack-dev-server/client?http://0.0.0.0:8200 webpack ERROR in ./node_modules/_fsevents@1.2.4@fsevents/node_modules/glob/sync.js Module not found: Error: Can't resolve 'fs' in 'D:\java\JetBrains\module\vue-app\vue-todo\node_modules\_fsevents@1.2.4@fsevents\node_modules\glob' @ ./node_modules/_fsevents@1.2.4@fsevents/node_modules/glob/sync.js 4:9-22 @ ./node_modules/_fsevents@1.2.4@fsevents/node_modules/glob/glob.js @ ./node_modules/_fsevents@1.2.4@fsevents/node_modules/rimraf/rimraf.js @ ./node_modules/_fsevents@1.2.4@fsevents/node_modules/node-pre-gyp/lib/util/napi.js @ ./node_modules/_fsevents@1.2.4@fsevents/node_modules/node-pre-gyp/lib/node-pre-gyp.js @ ./node_modules/_fsevents@1.2.4@fsevents/fsevents.js @ ./node_modules/_chokidar@2.0.4@chokidar/lib/fsevents-handler.js @ ./node_modules/_chokidar@2.0.4@chokidar/index.js @ ./node_modules/_watchpack@1.6.0@watchpack/lib/DirectoryWatcher.js @ ./node_modules/_watchpack@1.6.0@watchpack/lib/watcherManager.js @ ./node_modules/_watchpack@1.6.0@watchpack/lib/watchpack.js @ (webpack)/lib/node/NodeWatchFileSystem.js @ (webpack)/lib/node/NodeEnvironmentPlugin.js @ (webpack)/lib/webpack.js @ multi ./node_modules/_webpack-dev-server@3.1.9@webpack-dev-server/client?http://0.0.0.0:8200 webpack ERROR in ./node_modules/_fsevents@1.2.4@fsevents/node_modules/ignore-walk/index.js Module not found: Error: Can't resolve 'fs' in 'D:\java\JetBrains\module\vue-app\vue-todo\node_modules\_fsevents@1.2.4@fsevents\node_modules\ignore-walk' @ ./node_modules/_fsevents@1.2.4@fsevents/node_modules/ignore-walk/index.js 3:11-24 @ ./node_modules/_fsevents@1.2.4@fsevents/node_modules/npm-packlist/index.js @ ./node_modules/_fsevents@1.2.4@fsevents/node_modules/node-pre-gyp/lib/package.js @ ./node_modules/_fsevents@1.2.4@fsevents/node_modules/node-pre-gyp/lib sync ^\.\/.*$ @ ./node_modules/_fsevents@1.2.4@fsevents/node_modules/node-pre-gyp/lib/node-pre-gyp.js @ ./node_modules/_fsevents@1.2.4@fsevents/fsevents.js @ ./node_modules/_chokidar@2.0.4@chokidar/lib/fsevents-handler.js @ ./node_modules/_chokidar@2.0.4@chokidar/index.js @ ./node_modules/_watchpack@1.6.0@watchpack/lib/DirectoryWatcher.js @ ./node_modules/_watchpack@1.6.0@watchpack/lib/watcherManager.js @ ./node_modules/_watchpack@1.6.0@watchpack/lib/watchpack.js @ (webpack)/lib/node/NodeWatchFileSystem.js @ (webpack)/lib/node/NodeEnvironmentPlugin.js @ (webpack)/lib/webpack.js @ multi ./node_modules/_webpack-dev-server@3.1.9@webpack-dev-server/client?http://0.0.0.0:8200 webpack ERROR in ./node_modules/_fsevents@1.2.4@fsevents/node_modules/mkdirp/index.js Module not found: Error: Can't resolve 'fs' in 'D:\java\JetBrains\module\vue-app\vue-todo\node_modules\_fsevents@1.2.4@fsevents\node_modules\mkdirp' @ ./node_modules/_fsevents@1.2.4@fsevents/node_modules/mkdirp/index.js 2:9-22 @ ./node_modules/_fsevents@1.2.4@fsevents/node_modules/node-pre-gyp/lib/testpackage.js @ ./node_modules/_fsevents@1.2.4@fsevents/node_modules/node-pre-gyp/lib sync ^\.\/.*$ @ ./node_modules/_fsevents@1.2.4@fsevents/node_modules/node-pre-gyp/lib/node-pre-gyp.js @ ./node_modules/_fsevents@1.2.4@fsevents/fsevents.js @ ./node_modules/_chokidar@2.0.4@chokidar/lib/fsevents-handler.js @ ./node_modules/_chokidar@2.0.4@chokidar/index.js @ ./node_modules/_watchpack@1.6.0@watchpack/lib/DirectoryWatcher.js @ ./node_modules/_watchpack@1.6.0@watchpack/lib/watcherManager.js @ ./node_modules/_watchpack@1.6.0@watchpack/lib/watchpack.js @ (webpack)/lib/node/NodeWatchFileSystem.js @ (webpack)/lib/node/NodeEnvironmentPlugin.js @ (webpack)/lib/webpack.js @ multi ./node_modules/_webpack-dev-server@3.1.9@webpack-dev-server/client?http://0.0.0.0:8200 webpack ERROR in ./node_modules/_fsevents@1.2.4@fsevents/node_modules/needle/lib/multipart.js Module not found: Error: Can't resolve 'fs' in 'D:\java\JetBrains\module\vue-app\vue-todo\node_modules\_fsevents@1.2.4@fsevents\node_modules\needle\lib' @ ./node_modules/_fsevents@1.2.4@fsevents/node_modules/needle/lib/multipart.js 1:15-28 @ ./node_modules/_fsevents@1.2.4@fsevents/node_modules/needle/lib/needle.js @ ./node_modules/_fsevents@1.2.4@fsevents/node_modules/node-pre-gyp/lib/install.js @ ./node_modules/_fsevents@1.2.4@fsevents/node_modules/node-pre-gyp/lib sync ^\.\/.*$ @ ./node_modules/_fsevents@1.2.4@fsevents/node_modules/node-pre-gyp/lib/node-pre-gyp.js @ ./node_modules/_fsevents@1.2.4@fsevents/fsevents.js @ ./node_modules/_chokidar@2.0.4@chokidar/lib/fsevents-handler.js @ ./node_modules/_chokidar@2.0.4@chokidar/index.js @ ./node_modules/_watchpack@1.6.0@watchpack/lib/DirectoryWatcher.js @ ./node_modules/_watchpack@1.6.0@watchpack/lib/watcherManager.js @ ./node_modules/_watchpack@1.6.0@watchpack/lib/watchpack.js @ (webpack)/lib/node/NodeWatchFileSystem.js @ (webpack)/lib/node/NodeEnvironmentPlugin.js @ (webpack)/lib/webpack.js @ multi ./node_modules/_webpack-dev-server@3.1.9@webpack-dev-server/client?http://0.0.0.0:8200 webpack ERROR in ./node_modules/_fsevents@1.2.4@fsevents/node_modules/needle/lib/needle.js Module not found: Error: Can't resolve 'fs' in 'D:\java\JetBrains\module\vue-app\vue-todo\node_modules\_fsevents@1.2.4@fsevents\node_modules\needle\lib' @ ./node_modules/_fsevents@1.2.4@fsevents/node_modules/needle/lib/needle.js 8:18-31 @ ./node_modules/_fsevents@1.2.4@fsevents/node_modules/node-pre-gyp/lib/install.js @ ./node_modules/_fsevents@1.2.4@fsevents/node_modules/node-pre-gyp/lib sync ^\.\/.*$ @ ./node_modules/_fsevents@1.2.4@fsevents/node_modules/node-pre-gyp/lib/node-pre-gyp.js @ ./node_modules/_fsevents@1.2.4@fsevents/fsevents.js @ ./node_modules/_chokidar@2.0.4@chokidar/lib/fsevents-handler.js @ ./node_modules/_chokidar@2.0.4@chokidar/index.js @ ./node_modules/_watchpack@1.6.0@watchpack/lib/DirectoryWatcher.js @ ./node_modules/_watchpack@1.6.0@watchpack/lib/watcherManager.js @ ./node_modules/_watchpack@1.6.0@watchpack/lib/watchpack.js @ (webpack)/lib/node/NodeWatchFileSystem.js @ (webpack)/lib/node/NodeEnvironmentPlugin.js @ (webpack)/lib/webpack.js @ multi ./node_modules/_webpack-dev-server@3.1.9@webpack-dev-server/client?http://0.0.0.0:8200 webpack ERROR in ./node_modules/_fsevents@1.2.4@fsevents/node_modules/node-pre-gyp/lib/testbinary.js Module not found: Error: Can't resolve 'fs' in 'D:\java\JetBrains\module\vue-app\vue-todo\node_modules\_fsevents@1.2.4@fsevents\node_modules\node-pre-gyp\lib' @ ./node_modules/_fsevents@1.2.4@fsevents/node_modules/node-pre-gyp/lib/testbinary.js 7:9-22 @ ./node_modules/_fsevents@1.2.4@fsevents/node_modules/node-pre-gyp/lib sync ^\.\/.*$ @ ./node_modules/_fsevents@1.2.4@fsevents/node_modules/node-pre-gyp/lib/node-pre-gyp.js @ ./node_modules/_fsevents@1.2.4@fsevents/fsevents.js @ ./node_modules/_chokidar@2.0.4@chokidar/lib/fsevents-handler.js @ ./node_modules/_chokidar@2.0.4@chokidar/index.js @ ./node_modules/_watchpack@1.6.0@watchpack/lib/DirectoryWatcher.js @ ./node_modules/_watchpack@1.6.0@watchpack/lib/watcherManager.js @ ./node_modules/_watchpack@1.6.0@watchpack/lib/watchpack.js @ (webpack)/lib/node/NodeWatchFileSystem.js @ (webpack)/lib/node/NodeEnvironmentPlugin.js @ (webpack)/lib/webpack.js @ multi ./node_modules/_webpack-dev-server@3.1.9@webpack-dev-server/client?http://0.0.0.0:8200 webpack ERROR in ./node_modules/_fsevents@1.2.4@fsevents/node_modules/node-pre-gyp/lib/testpackage.js Module not found: Error: Can't resolve 'fs' in 'D:\java\JetBrains\module\vue-app\vue-todo\node_modules\_fsevents@1.2.4@fsevents\node_modules\node-pre-gyp\lib' @ ./node_modules/_fsevents@1.2.4@fsevents/node_modules/node-pre-gyp/lib/testpackage.js 7:9-22 @ ./node_modules/_fsevents@1.2.4@fsevents/node_modules/node-pre-gyp/lib sync ^\.\/.*$ @ ./node_modules/_fsevents@1.2.4@fsevents/node_modules/node-pre-gyp/lib/node-pre-gyp.js @ ./node_modules/_fsevents@1.2.4@fsevents/fsevents.js @ ./node_modules/_chokidar@2.0.4@chokidar/lib/fsevents-handler.js @ ./node_modules/_chokidar@2.0.4@chokidar/index.js @ ./node_modules/_watchpack@1.6.0@watchpack/lib/DirectoryWatcher.js @ ./node_modules/_watchpack@1.6.0@watchpack/lib/watcherManager.js @ ./node_modules/_watchpack@1.6.0@watchpack/lib/watchpack.js @ (webpack)/lib/node/NodeWatchFileSystem.js @ (webpack)/lib/node/NodeEnvironmentPlugin.js @ (webpack)/lib/webpack.js @ multi ./node_modules/_webpack-dev-server@3.1.9@webpack-dev-server/client?http://0.0.0.0:8200 webpack ERROR in ./node_modules/_fsevents@1.2.4@fsevents/node_modules/node-pre-gyp/lib/node-pre-gyp.js Module not found: Error: Can't resolve 'fs' in 'D:\java\JetBrains\module\vue-app\vue-todo\node_modules\_fsevents@1.2.4@fsevents\node_modules\node-pre-gyp\lib' @ ./node_modules/_fsevents@1.2.4@fsevents/node_modules/node-pre-gyp/lib/node-pre-gyp.js 13:9-22 @ ./node_modules/_fsevents@1.2.4@fsevents/fsevents.js @ ./node_modules/_chokidar@2.0.4@chokidar/lib/fsevents-handler.js @ ./node_modules/_chokidar@2.0.4@chokidar/index.js @ ./node_modules/_watchpack@1.6.0@watchpack/lib/DirectoryWatcher.js @ ./node_modules/_watchpack@1.6.0@watchpack/lib/watcherManager.js @ ./node_modules/_watchpack@1.6.0@watchpack/lib/watchpack.js @ (webpack)/lib/node/NodeWatchFileSystem.js @ (webpack)/lib/node/NodeEnvironmentPlugin.js @ (webpack)/lib/webpack.js @ multi ./node_modules/_webpack-dev-server@3.1.9@webpack-dev-server/client?http://0.0.0.0:8200 webpack ERROR in ./node_modules/_fsevents@1.2.4@fsevents/node_modules/node-pre-gyp/lib/pre-binding.js Module not found: Error: Can't resolve 'fs' in 'D:\java\JetBrains\module\vue-app\vue-todo\node_modules\_fsevents@1.2.4@fsevents\node_modules\node-pre-gyp\lib' @ ./node_modules/_fsevents@1.2.4@fsevents/node_modules/node-pre-gyp/lib/pre-binding.js 5:17-30 @ ./node_modules/_fsevents@1.2.4@fsevents/node_modules/node-pre-gyp/lib/node-pre-gyp.js @ ./node_modules/_fsevents@1.2.4@fsevents/fsevents.js @ ./node_modules/_chokidar@2.0.4@chokidar/lib/fsevents-handler.js @ ./node_modules/_chokidar@2.0.4@chokidar/index.js @ ./node_modules/_watchpack@1.6.0@watchpack/lib/DirectoryWatcher.js @ ./node_modules/_watchpack@1.6.0@watchpack/lib/watcherManager.js @ ./node_modules/_watchpack@1.6.0@watchpack/lib/watchpack.js @ (webpack)/lib/node/NodeWatchFileSystem.js @ (webpack)/lib/node/NodeEnvironmentPlugin.js @ (webpack)/lib/webpack.js @ multi ./node_modules/_webpack-dev-server@3.1.9@webpack-dev-server/client?http://0.0.0.0:8200 webpack ERROR in ./node_modules/_fsevents@1.2.4@fsevents/node_modules/node-pre-gyp/lib/clean.js Module not found: Error: Can't resolve 'fs' in 'D:\java\JetBrains\module\vue-app\vue-todo\node_modules\_fsevents@1.2.4@fsevents\node_modules\node-pre-gyp\lib' @ ./node_modules/_fsevents@1.2.4@fsevents/node_modules/node-pre-gyp/lib/clean.js 7:9-22 9:13-26 @ ./node_modules/_fsevents@1.2.4@fsevents/node_modules/node-pre-gyp/lib sync ^\.\/.*$ @ ./node_modules/_fsevents@1.2.4@fsevents/node_modules/node-pre-gyp/lib/node-pre-gyp.js @ ./node_modules/_fsevents@1.2.4@fsevents/fsevents.js @ ./node_modules/_chokidar@2.0.4@chokidar/lib/fsevents-handler.js @ ./node_modules/_chokidar@2.0.4@chokidar/index.js @ ./node_modules/_watchpack@1.6.0@watchpack/lib/DirectoryWatcher.js @ ./node_modules/_watchpack@1.6.0@watchpack/lib/watcherManager.js @ ./node_modules/_watchpack@1.6.0@watchpack/lib/watchpack.js @ (webpack)/lib/node/NodeWatchFileSystem.js @ (webpack)/lib/node/NodeEnvironmentPlugin.js @ (webpack)/lib/webpack.js @ multi ./node_modules/_webpack-dev-server@3.1.9@webpack-dev-server/client?http://0.0.0.0:8200 webpack ERROR in ./node_modules/_fsevents@1.2.4@fsevents/node_modules/node-pre-gyp/lib/unpublish.js Module not found: Error: Can't resolve 'fs' in 'D:\java\JetBrains\module\vue-app\vue-todo\node_modules\_fsevents@1.2.4@fsevents\node_modules\node-pre-gyp\lib' @ ./node_modules/_fsevents@1.2.4@fsevents/node_modules/node-pre-gyp/lib/unpublish.js 7:9-22 @ ./node_modules/_fsevents@1.2.4@fsevents/node_modules/node-pre-gyp/lib sync ^\.\/.*$ @ ./node_modules/_fsevents@1.2.4@fsevents/node_modules/node-pre-gyp/lib/node-pre-gyp.js @ ./node_modules/_fsevents@1.2.4@fsevents/fsevents.js @ ./node_modules/_chokidar@2.0.4@chokidar/lib/fsevents-handler.js @ ./node_modules/_chokidar@2.0.4@chokidar/index.js @ ./node_modules/_watchpack@1.6.0@watchpack/lib/DirectoryWatcher.js @ ./node_modules/_watchpack@1.6.0@watchpack/lib/watcherManager.js @ ./node_modules/_watchpack@1.6.0@watchpack/lib/watchpack.js @ (webpack)/lib/node/NodeWatchFileSystem.js @ (webpack)/lib/node/NodeEnvironmentPlugin.js @ (webpack)/lib/webpack.js @ multi ./node_modules/_webpack-dev-server@3.1.9@webpack-dev-server/client?http://0.0.0.0:8200 webpack ERROR in ./node_modules/_fsevents@1.2.4@fsevents/node_modules/node-pre-gyp/lib/package.js Module not found: Error: Can't resolve 'fs' in 'D:\java\JetBrains\module\vue-app\vue-todo\node_modules\_fsevents@1.2.4@fsevents\node_modules\node-pre-gyp\lib' @ ./node_modules/_fsevents@1.2.4@fsevents/node_modules/node-pre-gyp/lib/package.js 7:9-22 12:12-25 @ ./node_modules/_fsevents@1.2.4@fsevents/node_modules/node-pre-gyp/lib sync ^\.\/.*$ @ ./node_modules/_fsevents@1.2.4@fsevents/node_modules/node-pre-gyp/lib/node-pre-gyp.js @ ./node_modules/_fsevents@1.2.4@fsevents/fsevents.js @ ./node_modules/_chokidar@2.0.4@chokidar/lib/fsevents-handler.js @ ./node_modules/_chokidar@2.0.4@chokidar/index.js @ ./node_modules/_watchpack@1.6.0@watchpack/lib/DirectoryWatcher.js @ ./node_modules/_watchpack@1.6.0@watchpack/lib/watcherManager.js @ ./node_modules/_watchpack@1.6.0@watchpack/lib/watchpack.js @ (webpack)/lib/node/NodeWatchFileSystem.js @ (webpack)/lib/node/NodeEnvironmentPlugin.js @ (webpack)/lib/webpack.js @ multi ./node_modules/_webpack-dev-server@3.1.9@webpack-dev-server/client?http://0.0.0.0:8200 webpack ERROR in ./node_modules/_fsevents@1.2.4@fsevents/node_modules/npm-bundled/index.js Module not found: Error: Can't resolve 'fs' in 'D:\java\JetBrains\module\vue-app\vue-todo\node_modules\_fsevents@1.2.4@fsevents\node_modules\npm-bundled' @ ./node_modules/_fsevents@1.2.4@fsevents/node_modules/npm-bundled/index.js 10:11-24 @ ./node_modules/_fsevents@1.2.4@fsevents/node_modules/npm-packlist/index.js @ ./node_modules/_fsevents@1.2.4@fsevents/node_modules/node-pre-gyp/lib/package.js @ ./node_modules/_fsevents@1.2.4@fsevents/node_modules/node-pre-gyp/lib sync ^\.\/.*$ @ ./node_modules/_fsevents@1.2.4@fsevents/node_modules/node-pre-gyp/lib/node-pre-gyp.js @ ./node_modules/_fsevents@1.2.4@fsevents/fsevents.js @ ./node_modules/_chokidar@2.0.4@chokidar/lib/fsevents-handler.js @ ./node_modules/_chokidar@2.0.4@chokidar/index.js @ ./node_modules/_watchpack@1.6.0@watchpack/lib/DirectoryWatcher.js @ ./node_modules/_watchpack@1.6.0@watchpack/lib/watcherManager.js @ ./node_modules/_watchpack@1.6.0@watchpack/lib/watchpack.js @ (webpack)/lib/node/NodeWatchFileSystem.js @ (webpack)/lib/node/NodeEnvironmentPlugin.js @ (webpack)/lib/webpack.js @ multi ./node_modules/_webpack-dev-server@3.1.9@webpack-dev-server/client?http://0.0.0.0:8200 webpack ERROR in ./node_modules/_fsevents@1.2.4@fsevents/node_modules/rimraf/rimraf.js Module not found: Error: Can't resolve 'fs' in 'D:\java\JetBrains\module\vue-app\vue-todo\node_modules\_fsevents@1.2.4@fsevents\node_modules\rimraf' @ ./node_modules/_fsevents@1.2.4@fsevents/node_modules/rimraf/rimraf.js 6:9-22 @ ./node_modules/_fsevents@1.2.4@fsevents/node_modules/node-pre-gyp/lib/util/napi.js @ ./node_modules/_fsevents@1.2.4@fsevents/node_modules/node-pre-gyp/lib/node-pre-gyp.js @ ./node_modules/_fsevents@1.2.4@fsevents/fsevents.js @ ./node_modules/_chokidar@2.0.4@chokidar/lib/fsevents-handler.js @ ./node_modules/_chokidar@2.0.4@chokidar/index.js @ ./node_modules/_watchpack@1.6.0@watchpack/lib/DirectoryWatcher.js @ ./node_modules/_watchpack@1.6.0@watchpack/lib/watcherManager.js @ ./node_modules/_watchpack@1.6.0@watchpack/lib/watchpack.js @ (webpack)/lib/node/NodeWatchFileSystem.js @ (webpack)/lib/node/NodeEnvironmentPlugin.js @ (webpack)/lib/webpack.js @ multi ./node_modules/_webpack-dev-server@3.1.9@webpack-dev-server/client?http://0.0.0.0:8200 webpack ERROR in ./node_modules/_fsevents@1.2.4@fsevents/node_modules/tar/lib/replace.js Module not found: Error: Can't resolve 'fs' in 'D:\java\JetBrains\module\vue-app\vue-todo\node_modules\_fsevents@1.2.4@fsevents\node_modules\tar\lib' @ ./node_modules/_fsevents@1.2.4@fsevents/node_modules/tar/lib/replace.js 8:11-24 @ ./node_modules/_fsevents@1.2.4@fsevents/node_modules/tar/index.js @ ./node_modules/_fsevents@1.2.4@fsevents/node_modules/node-pre-gyp/lib/package.js @ ./node_modules/_fsevents@1.2.4@fsevents/node_modules/node-pre-gyp/lib sync ^\.\/.*$ @ ./node_modules/_fsevents@1.2.4@fsevents/node_modules/node-pre-gyp/lib/node-pre-gyp.js @ ./node_modules/_fsevents@1.2.4@fsevents/fsevents.js @ ./node_modules/_chokidar@2.0.4@chokidar/lib/fsevents-handler.js @ ./node_modules/_chokidar@2.0.4@chokidar/index.js @ ./node_modules/_watchpack@1.6.0@watchpack/lib/DirectoryWatcher.js @ ./node_modules/_watchpack@1.6.0@watchpack/lib/watcherManager.js @ ./node_modules/_watchpack@1.6.0@watchpack/lib/watchpack.js @ (webpack)/lib/node/NodeWatchFileSystem.js @ (webpack)/lib/node/NodeEnvironmentPlugin.js @ (webpack)/lib/webpack.js @ multi ./node_modules/_webpack-dev-server@3.1.9@webpack-dev-server/client?http://0.0.0.0:8200 webpack ERROR in ./node_modules/_fsevents@1.2.4@fsevents/node_modules/tar/lib/mkdir.js Module not found: Error: Can't resolve 'fs' in 'D:\java\JetBrains\module\vue-app\vue-todo\node_modules\_fsevents@1.2.4@fsevents\node_modules\tar\lib' @ ./node_modules/_fsevents@1.2.4@fsevents/node_modules/tar/lib/mkdir.js 8:11-24 @ ./node_modules/_fsevents@1.2.4@fsevents/node_modules/tar/lib/unpack.js @ ./node_modules/_fsevents@1.2.4@fsevents/node_modules/tar/index.js @ ./node_modules/_fsevents@1.2.4@fsevents/node_modules/node-pre-gyp/lib/package.js @ ./node_modules/_fsevents@1.2.4@fsevents/node_modules/node-pre-gyp/lib sync ^\.\/.*$ @ ./node_modules/_fsevents@1.2.4@fsevents/node_modules/node-pre-gyp/lib/node-pre-gyp.js @ ./node_modules/_fsevents@1.2.4@fsevents/fsevents.js @ ./node_modules/_chokidar@2.0.4@chokidar/lib/fsevents-handler.js @ ./node_modules/_chokidar@2.0.4@chokidar/index.js @ ./node_modules/_watchpack@1.6.0@watchpack/lib/DirectoryWatcher.js @ ./node_modules/_watchpack@1.6.0@watchpack/lib/watcherManager.js @ ./node_modules/_watchpack@1.6.0@watchpack/lib/watchpack.js @ (webpack)/lib/node/NodeWatchFileSystem.js @ (webpack)/lib/node/NodeEnvironmentPlugin.js @ (webpack)/lib/webpack.js @ multi ./node_modules/_webpack-dev-server@3.1.9@webpack-dev-server/client?http://0.0.0.0:8200 webpack ERROR in ./node_modules/_fsevents@1.2.4@fsevents/node_modules/tar/lib/write-entry.js Module not found: Error: Can't resolve 'fs' in 'D:\java\JetBrains\module\vue-app\vue-todo\node_modules\_fsevents@1.2.4@fsevents\node_modules\tar\lib' @ ./node_modules/_fsevents@1.2.4@fsevents/node_modules/tar/lib/write-entry.js 7:11-24 @ ./node_modules/_fsevents@1.2.4@fsevents/node_modules/tar/index.js @ ./node_modules/_fsevents@1.2.4@fsevents/node_modules/node-pre-gyp/lib/package.js @ ./node_modules/_fsevents@1.2.4@fsevents/node_modules/node-pre-gyp/lib sync ^\.\/.*$ @ ./node_modules/_fsevents@1.2.4@fsevents/node_modules/node-pre-gyp/lib/node-pre-gyp.js @ ./node_modules/_fsevents@1.2.4@fsevents/fsevents.js @ ./node_modules/_chokidar@2.0.4@chokidar/lib/fsevents-handler.js @ ./node_modules/_chokidar@2.0.4@chokidar/index.js @ ./node_modules/_watchpack@1.6.0@watchpack/lib/DirectoryWatcher.js @ ./node_modules/_watchpack@1.6.0@watchpack/lib/watcherManager.js @ ./node_modules/_watchpack@1.6.0@watchpack/lib/watchpack.js @ (webpack)/lib/node/NodeWatchFileSystem.js @ (webpack)/lib/node/NodeEnvironmentPlugin.js @ (webpack)/lib/webpack.js @ multi ./node_modules/_webpack-dev-server@3.1.9@webpack-dev-server/client?http://0.0.0.0:8200 webpack ERROR in ./node_modules/_fsevents@1.2.4@fsevents/node_modules/tar/lib/unpack.js Module not found: Error: Can't resolve 'fs' in 'D:\java\JetBrains\module\vue-app\vue-todo\node_modules\_fsevents@1.2.4@fsevents\node_modules\tar\lib' @ ./node_modules/_fsevents@1.2.4@fsevents/node_modules/tar/lib/unpack.js 6:11-24 @ ./node_modules/_fsevents@1.2.4@fsevents/node_modules/tar/index.js @ ./node_modules/_fsevents@1.2.4@fsevents/node_modules/node-pre-gyp/lib/package.js @ ./node_modules/_fsevents@1.2.4@fsevents/node_modules/node-pre-gyp/lib sync ^\.\/.*$ @ ./node_modules/_fsevents@1.2.4@fsevents/node_modules/node-pre-gyp/lib/node-pre-gyp.js @ ./node_modules/_fsevents@1.2.4@fsevents/fsevents.js @ ./node_modules/_chokidar@2.0.4@chokidar/lib/fsevents-handler.js @ ./node_modules/_chokidar@2.0.4@chokidar/index.js @ ./node_modules/_watchpack@1.6.0@watchpack/lib/DirectoryWatcher.js @ ./node_modules/_watchpack@1.6.0@watchpack/lib/watcherManager.js @ ./node_modules/_watchpack@1.6.0@watchpack/lib/watchpack.js @ (webpack)/lib/node/NodeWatchFileSystem.js @ (webpack)/lib/node/NodeEnvironmentPlugin.js @ (webpack)/lib/webpack.js @ multi ./node_modules/_webpack-dev-server@3.1.9@webpack-dev-server/client?http://0.0.0.0:8200 webpack ERROR in ./node_modules/_fsevents@1.2.4@fsevents/node_modules/tar/lib/pack.js Module not found: Error: Can't resolve 'fs' in 'D:\java\JetBrains\module\vue-app\vue-todo\node_modules\_fsevents@1.2.4@fsevents\node_modules\tar\lib' @ ./node_modules/_fsevents@1.2.4@fsevents/node_modules/tar/lib/pack.js 56:11-24 @ ./node_modules/_fsevents@1.2.4@fsevents/node_modules/tar/index.js @ ./node_modules/_fsevents@1.2.4@fsevents/node_modules/node-pre-gyp/lib/package.js @ ./node_modules/_fsevents@1.2.4@fsevents/node_modules/node-pre-gyp/lib sync ^\.\/.*$ @ ./node_modules/_fsevents@1.2.4@fsevents/node_modules/node-pre-gyp/lib/node-pre-gyp.js @ ./node_modules/_fsevents@1.2.4@fsevents/fsevents.js @ ./node_modules/_chokidar@2.0.4@chokidar/lib/fsevents-handler.js @ ./node_modules/_chokidar@2.0.4@chokidar/index.js @ ./node_modules/_watchpack@1.6.0@watchpack/lib/DirectoryWatcher.js @ ./node_modules/_watchpack@1.6.0@watchpack/lib/watcherManager.js @ ./node_modules/_watchpack@1.6.0@watchpack/lib/watchpack.js @ (webpack)/lib/node/NodeWatchFileSystem.js @ (webpack)/lib/node/NodeEnvironmentPlugin.js @ (webpack)/lib/webpack.js @ multi ./node_modules/_webpack-dev-server@3.1.9@webpack-dev-server/client?http://0.0.0.0:8200 webpack ERROR in ./node_modules/_fsevents@1.2.4@fsevents/node_modules/tar/lib/extract.js Module not found: Error: Can't resolve 'fs' in 'D:\java\JetBrains\module\vue-app\vue-todo\node_modules\_fsevents@1.2.4@fsevents\node_modules\tar\lib' @ ./node_modules/_fsevents@1.2.4@fsevents/node_modules/tar/lib/extract.js 6:11-24 @ ./node_modules/_fsevents@1.2.4@fsevents/node_modules/tar/index.js @ ./node_modules/_fsevents@1.2.4@fsevents/node_modules/node-pre-gyp/lib/package.js @ ./node_modules/_fsevents@1.2.4@fsevents/node_modules/node-pre-gyp/lib sync ^\.\/.*$ @ ./node_modules/_fsevents@1.2.4@fsevents/node_modules/node-pre-gyp/lib/node-pre-gyp.js @ ./node_modules/_fsevents@1.2.4@fsevents/fsevents.js @ ./node_modules/_chokidar@2.0.4@chokidar/lib/fsevents-handler.js @ ./node_modules/_chokidar@2.0.4@chokidar/index.js @ ./node_modules/_watchpack@1.6.0@watchpack/lib/DirectoryWatcher.js @ ./node_modules/_watchpack@1.6.0@watchpack/lib/watcherManager.js @ ./node_modules/_watchpack@1.6.0@watchpack/lib/watchpack.js @ (webpack)/lib/node/NodeWatchFileSystem.js @ (webpack)/lib/node/NodeEnvironmentPlugin.js @ (webpack)/lib/webpack.js @ multi ./node_modules/_webpack-dev-server@3.1.9@webpack-dev-server/client?http://0.0.0.0:8200 webpack ERROR in ./node_modules/_fsevents@1.2.4@fsevents/node_modules/tar/lib/list.js Module not found: Error: Can't resolve 'fs' in 'D:\java\JetBrains\module\vue-app\vue-todo\node_modules\_fsevents@1.2.4@fsevents\node_modules\tar\lib' @ ./node_modules/_fsevents@1.2.4@fsevents/node_modules/tar/lib/list.js 11:11-24 @ ./node_modules/_fsevents@1.2.4@fsevents/node_modules/tar/index.js @ ./node_modules/_fsevents@1.2.4@fsevents/node_modules/node-pre-gyp/lib/package.js @ ./node_modules/_fsevents@1.2.4@fsevents/node_modules/node-pre-gyp/lib sync ^\.\/.*$ @ ./node_modules/_fsevents@1.2.4@fsevents/node_modules/node-pre-gyp/lib/node-pre-gyp.js @ ./node_modules/_fsevents@1.2.4@fsevents/fsevents.js @ ./node_modules/_chokidar@2.0.4@chokidar/lib/fsevents-handler.js @ ./node_modules/_chokidar@2.0.4@chokidar/index.js @ ./node_modules/_watchpack@1.6.0@watchpack/lib/DirectoryWatcher.js @ ./node_modules/_watchpack@1.6.0@watchpack/lib/watcherManager.js @ ./node_modules/_watchpack@1.6.0@watchpack/lib/watchpack.js @ (webpack)/lib/node/NodeWatchFileSystem.js @ (webpack)/lib/node/NodeEnvironmentPlugin.js @ (webpack)/lib/webpack.js @ multi ./node_modules/_webpack-dev-server@3.1.9@webpack-dev-server/client?http://0.0.0.0:8200 webpack ERROR in ./node_modules/_fsevents@1.2.4@fsevents/node_modules/tar/lib/create.js Module not found: Error: Can't resolve 'fs' in 'D:\java\JetBrains\module\vue-app\vue-todo\node_modules\_fsevents@1.2.4@fsevents\node_modules\tar\lib' @ ./node_modules/_fsevents@1.2.4@fsevents/node_modules/tar/lib/create.js 7:11-24 @ ./node_modules/_fsevents@1.2.4@fsevents/node_modules/tar/index.js @ ./node_modules/_fsevents@1.2.4@fsevents/node_modules/node-pre-gyp/lib/package.js @ ./node_modules/_fsevents@1.2.4@fsevents/node_modules/node-pre-gyp/lib sync ^\.\/.*$ @ ./node_modules/_fsevents@1.2.4@fsevents/node_modules/node-pre-gyp/lib/node-pre-gyp.js @ ./node_modules/_fsevents@1.2.4@fsevents/fsevents.js @ ./node_modules/_chokidar@2.0.4@chokidar/lib/fsevents-handler.js @ ./node_modules/_chokidar@2.0.4@chokidar/index.js @ ./node_modules/_watchpack@1.6.0@watchpack/lib/DirectoryWatcher.js @ ./node_modules/_watchpack@1.6.0@watchpack/lib/watcherManager.js @ ./node_modules/_watchpack@1.6.0@watchpack/lib/watchpack.js @ (webpack)/lib/node/NodeWatchFileSystem.js @ (webpack)/lib/node/NodeEnvironmentPlugin.js @ (webpack)/lib/webpack.js @ multi ./node_modules/_webpack-dev-server@3.1.9@webpack-dev-server/client?http://0.0.0.0:8200 webpack ERROR in ./node_modules/_glob@7.1.3@glob/sync.js Module not found: Error: Can't resolve 'fs' in 'D:\java\JetBrains\module\vue-app\vue-todo\node_modules\_glob@7.1.3@glob' @ ./node_modules/_glob@7.1.3@glob/sync.js 4:9-22 @ ./node_modules/_glob@7.1.3@glob/glob.js @ ./node_modules/_cacache@10.0.4@cacache/lib/verify.js @ ./node_modules/_cacache@10.0.4@cacache/verify.js @ ./node_modules/_cacache@10.0.4@cacache/locales/en.js @ ./node_modules/_cacache@10.0.4@cacache/index.js @ ./node_modules/_uglifyjs-webpack-plugin@1.3.0@uglifyjs-webpack-plugin/dist/uglify/Runner.js @ ./node_modules/_uglifyjs-webpack-plugin@1.3.0@uglifyjs-webpack-plugin/dist/index.js @ ./node_modules/_uglifyjs-webpack-plugin@1.3.0@uglifyjs-webpack-plugin/dist/cjs.js @ (webpack)/lib/WebpackOptionsDefaulter.js @ (webpack)/lib/webpack.js @ multi ./node_modules/_webpack-dev-server@3.1.9@webpack-dev-server/client?http://0.0.0.0:8200 webpack ERROR in ./node_modules/_glob@7.1.3@glob/glob.js Module not found: Error: Can't resolve 'fs' in 'D:\java\JetBrains\module\vue-app\vue-todo\node_modules\_glob@7.1.3@glob' @ ./node_modules/_glob@7.1.3@glob/glob.js 43:9-22 @ ./node_modules/_cacache@10.0.4@cacache/lib/verify.js @ ./node_modules/_cacache@10.0.4@cacache/verify.js @ ./node_modules/_cacache@10.0.4@cacache/locales/en.js @ ./node_modules/_cacache@10.0.4@cacache/index.js @ ./node_modules/_uglifyjs-webpack-plugin@1.3.0@uglifyjs-webpack-plugin/dist/uglify/Runner.js @ ./node_modules/_uglifyjs-webpack-plugin@1.3.0@uglifyjs-webpack-plugin/dist/index.js @ ./node_modules/_uglifyjs-webpack-plugin@1.3.0@uglifyjs-webpack-plugin/dist/cjs.js @ (webpack)/lib/WebpackOptionsDefaulter.js @ (webpack)/lib/webpack.js @ multi ./node_modules/_webpack-dev-server@3.1.9@webpack-dev-server/client?http://0.0.0.0:8200 webpack ERROR in ./node_modules/_graceful-fs@4.1.11@graceful-fs/graceful-fs.js Module not found: Error: Can't resolve 'fs' in 'D:\java\JetBrains\module\vue-app\vue-todo\node_modules\_graceful-fs@4.1.11@graceful-fs' @ ./node_modules/_graceful-fs@4.1.11@graceful-fs/graceful-fs.js 1:9-22 @ ./node_modules/_enhanced-resolve@4.1.0@enhanced-resolve/lib/NodeJsInputFileSystem.js @ (webpack)/lib/node/NodeEnvironmentPlugin.js @ (webpack)/lib/webpack.js @ multi ./node_modules/_webpack-dev-server@3.1.9@webpack-dev-server/client?http://0.0.0.0:8200 webpack ERROR in ./node_modules/_graceful-fs@4.1.11@graceful-fs/fs.js Module not found: Error: Can't resolve 'fs' in 'D:\java\JetBrains\module\vue-app\vue-todo\node_modules\_graceful-fs@4.1.11@graceful-fs' @ ./node_modules/_graceful-fs@4.1.11@graceful-fs/fs.js 3:9-22 @ ./node_modules/_graceful-fs@4.1.11@graceful-fs/graceful-fs.js @ ./node_modules/_enhanced-resolve@4.1.0@enhanced-resolve/lib/NodeJsInputFileSystem.js @ (webpack)/lib/node/NodeEnvironmentPlugin.js @ (webpack)/lib/webpack.js @ multi ./node_modules/_webpack-dev-server@3.1.9@webpack-dev-server/client?http://0.0.0.0:8200 webpack ERROR in ./node_modules/_loader-runner@2.3.1@loader-runner/lib/LoaderRunner.js Module not found: Error: Can't resolve 'fs' in 'D:\java\JetBrains\module\vue-app\vue-todo\node_modules\_loader-runner@2.3.1@loader-runner\lib' @ ./node_modules/_loader-runner@2.3.1@loader-runner/lib/LoaderRunner.js 5:9-22 @ (webpack)/lib/NormalModule.js @ (webpack)/lib/AutomaticPrefetchPlugin.js @ (webpack)/lib/webpack.js @ multi ./node_modules/_webpack-dev-server@3.1.9@webpack-dev-server/client?http://0.0.0.0:8200 webpack ERROR in ./node_modules/_make-dir@1.3.0@make-dir/index.js Module not found: Error: Can't resolve 'fs' in 'D:\java\JetBrains\module\vue-app\vue-todo\node_modules\_make-dir@1.3.0@make-dir' @ ./node_modules/_make-dir@1.3.0@make-dir/index.js 2:11-24 @ ./node_modules/_find-cache-dir@1.0.0@find-cache-dir/index.js @ ./node_modules/_uglifyjs-webpack-plugin@1.3.0@uglifyjs-webpack-plugin/dist/uglify/Runner.js @ ./node_modules/_uglifyjs-webpack-plugin@1.3.0@uglifyjs-webpack-plugin/dist/index.js @ ./node_modules/_uglifyjs-webpack-plugin@1.3.0@uglifyjs-webpack-plugin/dist/cjs.js @ (webpack)/lib/WebpackOptionsDefaulter.js @ (webpack)/lib/webpack.js @ multi ./node_modules/_webpack-dev-server@3.1.9@webpack-dev-server/client?http://0.0.0.0:8200 webpack ERROR in ./node_modules/_mkdirp@0.5.1@mkdirp/index.js Module not found: Error: Can't resolve 'fs' in 'D:\java\JetBrains\module\vue-app\vue-todo\node_modules\_mkdirp@0.5.1@mkdirp' @ ./node_modules/_mkdirp@0.5.1@mkdirp/index.js 2:9-22 @ (webpack)/lib/node/NodeOutputFileSystem.js @ (webpack)/lib/node/NodeEnvironmentPlugin.js @ (webpack)/lib/webpack.js @ multi ./node_modules/_webpack-dev-server@3.1.9@webpack-dev-server/client?http://0.0.0.0:8200 webpack ERROR in ./node_modules/_move-concurrently@1.0.1@move-concurrently/move.js Module not found: Error: Can't resolve 'fs' in 'D:\java\JetBrains\module\vue-app\vue-todo\node_modules\_move-concurrently@1.0.1@move-concurrently' @ ./node_modules/_move-concurrently@1.0.1@move-concurrently/move.js 4:13-26 @ ./node_modules/_cacache@10.0.4@cacache/lib/util/move-file.js @ ./node_modules/_cacache@10.0.4@cacache/lib/content/write.js @ ./node_modules/_cacache@10.0.4@cacache/put.js @ ./node_modules/_cacache@10.0.4@cacache/locales/en.js @ ./node_modules/_cacache@10.0.4@cacache/index.js @ ./node_modules/_uglifyjs-webpack-plugin@1.3.0@uglifyjs-webpack-plugin/dist/uglify/Runner.js @ ./node_modules/_uglifyjs-webpack-plugin@1.3.0@uglifyjs-webpack-plugin/dist/index.js @ ./node_modules/_uglifyjs-webpack-plugin@1.3.0@uglifyjs-webpack-plugin/dist/cjs.js @ (webpack)/lib/WebpackOptionsDefaulter.js @ (webpack)/lib/webpack.js @ multi ./node_modules/_webpack-dev-server@3.1.9@webpack-dev-server/client?http://0.0.0.0:8200 webpack ERROR in ./node_modules/_path-exists@3.0.0@path-exists/index.js Module not found: Error: Can't resolve 'fs' in 'D:\java\JetBrains\module\vue-app\vue-todo\node_modules\_path-exists@3.0.0@path-exists' @ ./node_modules/_path-exists@3.0.0@path-exists/index.js 2:11-24 @ ./node_modules/_locate-path@2.0.0@locate-path/index.js @ ./node_modules/_find-up@2.1.0@find-up/index.js @ ./node_modules/_pkg-dir@2.0.0@pkg-dir/index.js @ ./node_modules/_find-cache-dir@1.0.0@find-cache-dir/index.js @ ./node_modules/_uglifyjs-webpack-plugin@1.3.0@uglifyjs-webpack-plugin/dist/uglify/Runner.js @ ./node_modules/_uglifyjs-webpack-plugin@1.3.0@uglifyjs-webpack-plugin/dist/index.js @ ./node_modules/_uglifyjs-webpack-plugin@1.3.0@uglifyjs-webpack-plugin/dist/cjs.js @ (webpack)/lib/WebpackOptionsDefaulter.js @ (webpack)/lib/webpack.js @ multi ./node_modules/_webpack-dev-server@3.1.9@webpack-dev-server/client?http://0.0.0.0:8200 webpack ERROR in ./node_modules/_rimraf@2.6.2@rimraf/rimraf.js Module not found: Error: Can't resolve 'fs' in 'D:\java\JetBrains\module\vue-app\vue-todo\node_modules\_rimraf@2.6.2@rimraf' @ ./node_modules/_rimraf@2.6.2@rimraf/rimraf.js 6:9-22 @ ./node_modules/_cacache@10.0.4@cacache/lib/util/tmp.js @ ./node_modules/_cacache@10.0.4@cacache/locales/en.js @ ./node_modules/_cacache@10.0.4@cacache/index.js @ ./node_modules/_uglifyjs-webpack-plugin@1.3.0@uglifyjs-webpack-plugin/dist/uglify/Runner.js @ ./node_modules/_uglifyjs-webpack-plugin@1.3.0@uglifyjs-webpack-plugin/dist/index.js @ ./node_modules/_uglifyjs-webpack-plugin@1.3.0@uglifyjs-webpack-plugin/dist/cjs.js @ (webpack)/lib/WebpackOptionsDefaulter.js @ (webpack)/lib/webpack.js @ multi ./node_modules/_webpack-dev-server@3.1.9@webpack-dev-server/client?http://0.0.0.0:8200 webpack ERROR in ./node_modules/_schema-utils@0.4.7@schema-utils/src/validateOptions.js Module not found: Error: Can't resolve 'fs' in 'D:\java\JetBrains\module\vue-app\vue-todo\node_modules\_schema-utils@0.4.7@schema-utils\src' @ ./node_modules/_schema-utils@0.4.7@schema-utils/src/validateOptions.js 8:11-24 @ ./node_modules/_schema-utils@0.4.7@schema-utils/src/index.js @ (webpack)/lib/BannerPlugin.js @ (webpack)/lib/webpack.js @ multi ./node_modules/_webpack-dev-server@3.1.9@webpack-dev-server/client?http://0.0.0.0:8200 webpack ERROR in ./node_modules/_snapdragon@0.8.2@snapdragon/lib/source-maps.js Module not found: Error: Can't resolve 'fs' in 'D:\java\JetBrains\module\vue-app\vue-todo\node_modules\_snapdragon@0.8.2@snapdragon\lib' @ ./node_modules/_snapdragon@0.8.2@snapdragon/lib/source-maps.js 3:9-22 @ ./node_modules/_snapdragon@0.8.2@snapdragon/lib/compiler.js @ ./node_modules/_snapdragon@0.8.2@snapdragon/index.js @ ./node_modules/_micromatch@3.1.10@micromatch/lib/utils.js @ ./node_modules/_micromatch@3.1.10@micromatch/index.js @ (webpack)/lib/optimize/SideEffectsFlagPlugin.js @ (webpack)/lib/webpack.js @ multi ./node_modules/_webpack-dev-server@3.1.9@webpack-dev-server/client?http://0.0.0.0:8200 webpack ERROR in ./node_modules/_uglify-es@3.3.9@uglify-es/tools/node.js Module not found: Error: Can't resolve 'fs' in 'D:\java\JetBrains\module\vue-app\vue-todo\node_modules\_uglify-es@3.3.9@uglify-es\tools' @ ./node_modules/_uglify-es@3.3.9@uglify-es/tools/node.js 1:9-22 @ ./node_modules/_uglifyjs-webpack-plugin@1.3.0@uglifyjs-webpack-plugin/dist/uglify/minify.js @ ./node_modules/_uglifyjs-webpack-plugin@1.3.0@uglifyjs-webpack-plugin/dist/uglify/Runner.js @ ./node_modules/_uglifyjs-webpack-plugin@1.3.0@uglifyjs-webpack-plugin/dist/index.js @ ./node_modules/_uglifyjs-webpack-plugin@1.3.0@uglifyjs-webpack-plugin/dist/cjs.js @ (webpack)/lib/WebpackOptionsDefaulter.js @ (webpack)/lib/webpack.js @ multi ./node_modules/_webpack-dev-server@3.1.9@webpack-dev-server/client?http://0.0.0.0:8200 webpack ERROR in (webpack)/lib/debug/ProfilingPlugin.js Module not found: Error: Can't resolve 'fs' in 'D:\java\JetBrains\module\vue-app\vue-todo\node_modules\_webpack@4.20.2@webpack\lib\debug' @ (webpack)/lib/debug/ProfilingPlugin.js 1:11-24 @ (webpack)/lib/webpack.js @ multi ./node_modules/_webpack-dev-server@3.1.9@webpack-dev-server/client?http://0.0.0.0:8200 webpack ERROR in (webpack)/lib/node/NodeMainTemplateAsync.runtime.js Module not found: Error: Can't resolve 'fs' in 'D:\java\JetBrains\module\vue-app\vue-todo\node_modules\_webpack@4.20.2@webpack\lib\node' @ (webpack)/lib/node/NodeMainTemplateAsync.runtime.js 10:2-15 28:3-16 @ (webpack)/lib/node/NodeMainTemplatePlugin.js @ (webpack)/lib/node/NodeTemplatePlugin.js @ (webpack)/lib/webpack.js @ multi ./node_modules/_webpack-dev-server@3.1.9@webpack-dev-server/client?http://0.0.0.0:8200 webpack ERROR in (webpack)/lib/node/NodeOutputFileSystem.js Module not found: Error: Can't resolve 'fs' in 'D:\java\JetBrains\module\vue-app\vue-todo\node_modules\_webpack@4.20.2@webpack\lib\node' @ (webpack)/lib/node/NodeOutputFileSystem.js 7:11-24 @ (webpack)/lib/node/NodeEnvironmentPlugin.js @ (webpack)/lib/webpack.js @ multi ./node_modules/_webpack-dev-server@3.1.9@webpack-dev-server/client?http://0.0.0.0:8200 webpack ERROR in ./node_modules/_y18n@4.0.0@y18n/index.js Module not found: Error: Can't resolve 'fs' in 'D:\java\JetBrains\module\vue-app\vue-todo\node_modules\_y18n@4.0.0@y18n' @ ./node_modules/_y18n@4.0.0@y18n/index.js 1:9-22 @ ./node_modules/_cacache@10.0.4@cacache/lib/util/y.js @ ./node_modules/_cacache@10.0.4@cacache/locales/en.js @ ./node_modules/_cacache@10.0.4@cacache/index.js @ ./node_modules/_uglifyjs-webpack-plugin@1.3.0@uglifyjs-webpack-plugin/dist/uglify/Runner.js @ ./node_modules/_uglifyjs-webpack-plugin@1.3.0@uglifyjs-webpack-plugin/dist/index.js @ ./node_modules/_uglifyjs-webpack-plugin@1.3.0@uglifyjs-webpack-plugin/dist/cjs.js @ (webpack)/lib/WebpackOptionsDefaulter.js @ (webpack)/lib/webpack.js @ multi ./node_modules/_webpack-dev-server@3.1.9@webpack-dev-server/client?http://0.0.0.0:8200 webpack ERROR in (webpack)/lib/NormalModule.js Module not found: Error: Can't resolve 'module' in 'D:\java\JetBrains\module\vue-app\vue-todo\node_modules\_webpack@4.20.2@webpack\lib' @ (webpack)/lib/NormalModule.js 7:21-38 @ (webpack)/lib/AutomaticPrefetchPlugin.js @ (webpack)/lib/webpack.js @ multi ./node_modules/_webpack-dev-server@3.1.9@webpack-dev-server/client?http://0.0.0.0:8200 webpack ERROR in (webpack)/lib/node/NodeTargetPlugin.js Module not found: Error: Can't resolve 'module' in 'D:\java\JetBrains\module\vue-app\vue-todo\node_modules\_webpack@4.20.2@webpack\lib\node' @ (webpack)/lib/node/NodeTargetPlugin.js 11:1-18 @ (webpack)/lib/WebpackOptionsApply.js @ (webpack)/lib/webpack.js @ multi ./node_modules/_webpack-dev-server@3.1.9@webpack-dev-server/client?http://0.0.0.0:8200 webpack Child html-webpack-plugin for "index.html": 1 asset Entrypoint undefined = index.html [0] ./node_modules/_html-webpack-plugin@3.2.0@html-webpack-plugin/lib/loader.js!./node_modules/_html-webpack-plugin@3.2.0@html-webpack-plugin/default_index.ejs 392 bytes {0} [b uilt] [1] ./node_modules/_lodash@4.17.11@lodash/lodash.js 527 KiB {0} [built] [2] (webpack)/buildin/global.js 509 bytes {0} [built] [3] (webpack)/buildin/module.js 519 bytes {0} [built] i 「wdm」: Failed to compile.

使用npm 执行package.json 里面的脚本报错,但是 脚本单独拿出来执行不报错

# package.json { "name": "fe", "version": "1.0.0", "description": "前端代码", "main": "index.js", "scripts": { "test": "echo \"Error: no test specified\" && exit 1", "dev" : "WEBPACK_ENV=dev webpack-dev-server --inline --port 8088" }, "repository": { "type": "git", "url": "git@gitee.com:。。。。。。" }, "author": "tomxfei", "license": "ISC", "devDependencies": { "css-loader": "^0.28.7", "extract-text-webpack-plugin": "^3.0.2", "file-loader": "^1.1.5", "html-loader": "^0.5.1", "html-webpack-plugin": "^2.30.1", "style-loader": "^0.19.0", "url-loader": "^0.6.2", "webpack": "^3.8.1", "webpack-dev-server": "^2.9.4" }, "dependencies": {} } # 执行 npm run dev报如下错误 ```Liuxf@DESKTOP-D3UCHLD MINGW64 /d/fe (fe_v1.0) $ npm run dev > fe@1.0.0 dev D:\fe > WEBPACK_ENV=dev webpack-dev-server --inline --port 8088 'WEBPACK_ENV' ▒▒▒▒▒ڲ▒▒▒▒ⲿ▒▒▒Ҳ▒▒▒ǿ▒▒▒▒еij▒▒▒ ▒▒▒▒▒▒▒▒▒ļ▒▒▒ npm ERR! code ELIFECYCLE npm ERR! errno 1 npm ERR! fe@1.0.0 dev: `WEBPACK_ENV=dev webpack-dev-server --inline --port 8088` npm ERR! Exit status 1 npm ERR! npm ERR! Failed at the fe@1.0.0 dev script. npm ERR! This is probably not a problem with npm. There is likely additional logging output above. npm ERR! A complete log of this run can be found in: npm ERR! C:\Users\75056\AppData\Roaming\npm-cache\_logs\2017-11-25T12_16_13_958Z-debug.log # 直接执行 WEBPACK_ENV=dev webpack-dev-server --inline --port 8088` 没有问题``` ``` ```

如何让webpack-dev-server与现有应用程序一起使用?

<div class="post-text" itemprop="text"> <p>In my setup, we develop on our local machines and then rsync our code to a vagrant box.</p> <p>I got this working by running <code>webpack -w</code> and an rsync daemon together -- webpack builds the files and then rsync immediately picks up the changes and uploads them.</p> <p>However, this won't work with live/hot-reloading. So what I was hoping to do was to swap out these two lines in my HTML:</p> <pre><code>&lt;script src="/assets/bundle-ba00eb4a9c20608dbf97.js" charset="utf-8"&gt;&lt;/script&gt; &lt;link href="/assets/bundle-f6d909a555852937509481b27fc2ce5d.css" rel="stylesheet" type="text/css; charset=utf-8" /&gt; </code></pre> <p>With something like:</p> <pre><code>&lt;script src="http://localhost:8080/bundle.js" charset="utf-8"&gt;&lt;/script&gt; </code></pre> <p>And then live/hot reloading would magically work.</p> <p>I can't run my whole app under the webpack-dev-server because nginx still needs to serve up the rest of the PHP app, including some non-webpacked assets.</p> <p>Right now the the above 2 lines of HTML are generated by this function:</p> <pre><code>function($chunkName) { static $stats; if($stats === null) { $stats = WxJson::loadFile(WX::$path.'/webpack.stats.json'); } $paths = WXU::array_get($stats,['assetsByChunkName',$chunkName],false); if($paths === false) { throw new \Exception("webpack asset not found: $chunkName"); } $html = []; foreach((array)$paths as $p) { $ext = WXU::GetFileExt($p); switch($ext) { case 'js': $html[] = WXU::html_tag('script',['src'=&gt;WXU::join_path($stats['publicPath'],$p),'charset'=&gt;'utf-8'],''); break; case 'css': $html[] = WXU::html_tag('link',['href'=&gt;WXU::join_path($stats['publicPath'],$p),'rel'=&gt;'stylesheet','type'=&gt;'text/css; charset=utf-8'],null); break; } } return implode(PHP_EOL, $html); } </code></pre> <p>I was hoping to have the webpack-dev-server simply replace the bundle path in the <a href="https://www.npmjs.com/package/stats-webpack-plugin" rel="nofollow">webpack.stats.json file</a> with the "live" version, and then I wouldn't even need to make any code changes.</p> <p>However, the stats file doesn't seem to get written to disk at all when I use webpack-dev-server, I guess because it's treated like an asset like any other, which means that I can no longer read it with PHP.</p> <p>So now I don't know what to do. To make this more answerable, here's a couple of questions:</p> <ol> <li><p>Can I get hot-loading to work without changing our web URL? i.e., can I keep the URL the same but link to a bundle served by webpack-dev-server rather than visiting webpack-dev-server and have it proxy the rest of our site?</p></li> <li><p>Is there another way for me to retrieve the bundle name in PHP rather than trying to parse this stats file which doesn't exist when using the webpack-dev-server?</p></li> </ol> <p>Here's my <a href="https://gist.github.com/mnpenner/d10fd2dd2088bffa739d" rel="nofollow">webpack.config.js</a> if you need to see it.</p> <hr> <p>If I put </p> <pre><code>'webpack-dev-server/client?http://localhost:5584/assets/', 'webpack/hot/only-dev-server', </code></pre> <p>And <code>new webpack.HotModuleReplacementPlugin()</code> in my <code>webpack.config.json</code> and compile it (with <code>webpack</code> not <code>webpack-dev-server</code>) then I see this in my Chrome dev tools:</p> <pre><code>GET http://localhost:5584/assets/info?t=1450478928633 net::ERR_CONNECTION_REFUSEDAbstractXHRObject._start @ abstract-xhr.js:128(anonymous function) @ abstract-xhr.js:21 [WDS] Disconnected! </code></pre> <p>Which is good. It looks like the bundle <em>does</em> contain the necessary code, now I just have to figure out how get the URL for the bundle from PHP and fix the CORS issue.</p> </div>

如何将React(Frontend)和Go(BE)部署到heroku?

<div class="post-text" itemprop="text"> <p>I'm trying to deploy a React + Go application to Heroku, but I'm struggling to understand what I'm doing wrong. </p> <p>The application structure is as follows:</p> <pre><code>my-app | |__ build | |___ public | |-- manifest.json | |-- index.html | |-- favicon.ico | |___ server (Go) | |__ api | |__ db | |__ utils | |___ src (React) | |__ assets | |__ components | |__app | | |-- app.js | |-- index.js | |-- .babelrc |-- go.mod (Go modules) |-- go.sum |-- index.go |-- package.json |-- Procfile |-- webpack.config |-- webpack.development.js |-- webpack.production.js </code></pre> <p><em>index.go</em></p> <pre class="lang-golang prettyprint-override"><code>package main import ( "fmt" "net/http" "os" ) func main() { http.Handle("/", http.FileServer(http.Dir("./build"))) } func GetPort() string { var port = os.Getenv("PORT") // Set a default port if there is nothing in the environment if port == "" { port = "4000" fmt.Println("INFO: No PORT environment variable detected, defaulting to " + port) } return ":" + port } </code></pre> <p>As can be seen, the backend is very simple which serves the static frontend pages in the build directory.</p> <p><em>package.json</em></p> <p></p><div class="snippet" data-lang="js" data-hide="false" data-console="true" data-babel="false"> <div class="snippet-code"> <pre class="snippet-code-js lang-js prettyprint-override"><code>{ "name": "fullstack-course", "main": "index.go", "scripts": { "client": "rm -rf build/ &amp;&amp; webpack --env.mode production", "server": "rm -rf index &amp;&amp; go build -o index", "start": "./index", "heroku-postbuild": "yarn run client &amp;&amp; yarn run server" }, "engines": { "node": "10.x", "npm": "6.9.x", "yarn": "1.x" }, "dependencies": {...} }</code></pre> </div> </div> <p>As for:</p> <pre><code>"client": "rm -rf build/ &amp;&amp; webpack --env.mode production", </code></pre> <p>The <code>client</code> script clears the build, and then runs webpack.producton.js to bundle the frontend</p> <p>As for:</p> <pre><code>"server": "rm -rf index &amp;&amp; go build -o index", </code></pre> <p>The <code>server</code> removes the compiled file called index and builds the index again.</p> <p>To run the server, we simply do <code>"start": "./index",</code></p> <h1>Heroku Buildpacks</h1> <ol> <li>heroku/nodejs</li> <li>heroku/go</li> </ol> <h1>Heroku log</h1> <p>When pushing this to Heroku, It fails the build with the following log</p> <pre><code>-----&gt; Node.js app detected -----&gt; Creating runtime environment NPM_CONFIG_LOGLEVEL=error NODE_ENV=production NODE_MODULES_CACHE=false NODE_VERBOSE=false -----&gt; Installing binaries engines.node (package.json): 10.x engines.npm (package.json): 6.9.x engines.yarn (package.json): 1.x Resolving node version 10.x... Downloading and installing node 10.16.0... Bootstrapping npm 6.9.x (replacing 6.9.0)... npm 6.9.x installed Resolving yarn version 1.x... Downloading and installing yarn (1.16.0)... Installed yarn 1.16.0 -----&gt; Restoring cache Caching has been disabled because NODE_MODULES_CACHE=false -----&gt; Installing dependencies Installing node modules (yarn.lock) yarn install v1.16.0 [1/4] Resolving packages... [2/4] Fetching packages... info fsevents@1.2.9: The platform "linux" is incompatible with this module. info "fsevents@1.2.9" is an optional dependency and failed compatibility check. Excluding it from installation. [3/4] Linking dependencies... [4/4] Building fresh packages... Done in 21.23s. -----&gt; Build Running heroku-postbuild (yarn) yarn run v1.16.0 $ yarn run client &amp;&amp; yarn run server $ rm -rf build/ &amp;&amp; webpack --env.mode production Hash: e3957a7f35b32ffdafe0 Version: webpack 4.34.0 Time: 6283ms Built at: 06/14/2019 4:43:46 PM Asset Size Chunks Chunk Names favicon.ico 3.78 KiB [emitted] index.html 582 bytes [emitted] manifest.json 306 bytes [emitted] resources-manifest.json 147 bytes [emitted] service-worker.js 21 bytes [emitted] static/css/main.b3bdf9a060b617f0a8a6.css 56 bytes 0 [emitted] main static/js/main.2404dde5082f7f65e664.js 3.21 KiB 0 [emitted] main static/js/vendors~main.64517854689ee0e9248d.js 135 KiB 1 [emitted] vendors~main Entrypoint main = static/js/vendors~main.64517854689ee0e9248d.js static/css/main.b3bdf9a060b617f0a8a6.css static/js/main.2404dde5082f7f65e664.js [8] (webpack)/buildin/global.js 472 bytes {1} [built] [12] ./node_modules/react-redux/es/index.js + 18 modules 29.8 KiB {1} [built] | 19 modules [20] (webpack)/buildin/harmony-module.js 573 bytes {1} [built] [22] ./src/index.js + 5 modules 5.26 KiB {0} [built] | ./src/index.js 483 bytes [built] | ./src/store.js 1.29 KiB [built] | ./src/reducers/index.js 274 bytes [built] | ./src/reducers/initial.js 607 bytes [built] | + 2 hidden modules + 20 hidden modules Child html-webpack-plugin for "index.html": 1 asset Entrypoint undefined = index.html [0] ./node_modules/html-webpack-plugin/lib/loader.js!./public/index.html 1.9 KiB {0} [built] [2] (webpack)/buildin/global.js 472 bytes {0} [built] [3] (webpack)/buildin/module.js 497 bytes {0} [built] + 1 hidden module Child mini-css-extract-plugin node_modules/css-loader/dist/cjs.js!src/components/app/App.css: Entrypoint mini-css-extract-plugin = * 2 modules $ rm -rf index &amp;&amp; go build -o index /bin/sh: 1: go: not found error Command failed with exit code 127. info Visit https://yarnpkg.com/en/docs/cli/run for documentation about this command. error Command failed with exit code 127. info Visit https://yarnpkg.com/en/docs/cli/run for documentation about this command. -----&gt; Build failed We're sorry this build is failing! You can troubleshoot common issues here: https://devcenter.heroku.com/articles/troubleshooting-node-deploys If you're stuck, please submit a ticket so we can help: https://help.heroku.com/ Love, Heroku ! Push rejected, failed to compile Node.js app. ! Push failed </code></pre> <p>I have no idea why Heroku can't run the go command. Please, can someone help?</p> </div>

VUE build的时候app css CssSyntaxError错误

vue build的时候app css CssSyntaxError错误,run dev可以正常启动 错误信息如下 ``` - building for production...Error processing file: static/css/app.97c058584faa589ff57590333e2787e8.css (node:3172) UnhandledPromiseRejectionWarning: CssSyntaxError: G:\vue\recms-adminVue\static\css\app.97c058584faa589ff57590333e2787e8.css:1293:8: Unknown word at Input.error (G:\vue\recms-adminVue\node_modules\_postcss@7.0.17@postcss\lib\input.js:130:16) at Parser.unknownWord (G:\vue\recms-adminVue\node_modules\_postcss@7.0.17@postcss\lib\parser.js:563:22) at Parser.decl (G:\vue\recms-adminVue\node_modules\_postcss@7.0.17@postcss\lib\parser.js:235:16) at Parser.other (G:\vue\recms-adminVue\node_modules\_postcss@7.0.17@postcss\lib\parser.js:133:18) at Parser.parse (G:\vue\recms-adminVue\node_modules\_postcss@7.0.17@postcss\lib\parser.js:77:16) at parse (G:\vue\recms-adminVue\node_modules\_postcss@7.0.17@postcss\lib\parse.js:17:12) at new LazyResult (G:\vue\recms-adminVue\node_modules\_postcss@7.0.17@postcss\lib\lazy-result.js:60:16) at Processor.<anonymous> (G:\vue\recms-adminVue\node_modules\_postcss@7.0.17@postcss\lib\processor.js:138:12) at Processor.process (G:\vue\recms-adminVue\node_modules\_postcss@7.0.17@postcss\lib\processor.js:117:23) at Function.creator.process (G:\vue\recms-adminVue\node_modules\_postcss@7.0.17@postcss\lib\postcss.js:148:43) at OptimizeCssAssetsPlugin.processCss (G:\vue\recms-adminVue\node_modules\_optimize-css-assets-webpack-plugin@3.2.1@optimize-css-assets-webpack-plugin\index.js :63:19) at Object.processor (G:\vue\recms-adminVue\node_modules\_optimize-css-assets-webpack-plugin@3.2.1@optimize-css-assets-webpack-plugin\index.js:29:23) at G:\vue\recms-adminVue\node_modules\_last-call-webpack-plugin@2.1.2@last-call-webpack-plugin\index.js:139:8 at arrayEach (G:\vue\recms-adminVue\node_modules\_lodash@4.17.14@lodash\_arrayEach.js:15:9) at forEach (G:\vue\recms-adminVue\node_modules\_lodash@4.17.14@lodash\forEach.js:38:10) at LastCallWebpackPlugin.process (G:\vue\recms-adminVue\node_modules\_last-call-webpack-plugin@2.1.2@last-call-webpack-plugin\index.js:136:3) (node:3172) UnhandledPromiseRejectionWarning: Unhandled promise rejection. This error originated either by throwing inside of an async function without a catch blo ck, or by rejecting a promise which was not handled with .catch(). (rejection id: 2) (node:3172) [DEP0018] DeprecationWarning: Unhandled promise rejections are deprecated. In the future, promise rejections that are not handled will terminate the No de.js process with a non-zero exit code. ``` build.js的代码 ``` const ora = require('ora') const rm = require('rimraf') const path = require('path') const chalk = require('chalk') const webpack = require('webpack') const config = require('../config') const webpackConfig = require('./webpack.prod.conf') const spinner = ora('building for production...') spinner.start() rm(path.join(config.build.assetsRoot, config.build.assetsSubDirectory), err => { if (err) throw err webpack(webpackConfig, function (err, stats) { spinner.stop() if (err) throw err process.stdout.write(stats.toString({ colors: true, modules: false, children: false, chunks: false, chunkModules: false }) + '\n\n') if (stats.hasErrors()) { console.log(chalk.red(' Build failed with errors.\n')) process.exit(1) } console.log(chalk.cyan(' Build complete.\n')) console.log(chalk.yellow( ' Tip: built files are meant to be served over an HTTP server.\n' + ' Opening index.html over file:// won\'t work.\n' )) }) }) ``` webpack.prod.conf.js的配置 ``` const env = require('../config/prod.env') const webpackConfig = merge(baseWebpackConfig, { module: { rules: utils.styleLoaders({ sourceMap: config.build.productionSourceMap, extract: true, usePostCSS: true }) }, devtool: config.build.productionSourceMap ? config.build.devtool : false, output: { path: config.build.assetsRoot, filename: utils.assetsPath('js/[name].[chunkhash].js'), chunkFilename: utils.assetsPath('js/[id].[chunkhash].js') }, plugins: [ // http://vuejs.github.io/vue-loader/en/workflow/production.html new webpack.DefinePlugin({ 'process.env': env }), // UglifyJs do not support ES6+, you can also use babel-minify for better treeshaking: https://github.com/babel/minify new webpack.optimize.UglifyJsPlugin({ compress: { warnings: false }, sourceMap: config.build.productionSourceMap, parallel: true }), // extract css into its own file new ExtractTextPlugin({ filename: utils.assetsPath('css/[name].[contenthash].css'), // set the following option to `true` if you want to extract CSS from // codesplit chunks into this main css file as well. // This will result in *all* of your app's CSS being loaded upfront. allChunks: false, }), // Compress extracted CSS. We are using this plugin so that possible // duplicated CSS from different components can be deduped. new OptimizeCSSPlugin({ cssProcessorOptions: config.build.productionSourceMap ? { safe: true, map: { inline: false } } : { safe: true } }), // generate dist index.html with correct asset hash for caching. // you can customize output by editing /index.html // see https://github.com/ampedandwired/html-webpack-plugin new HtmlWebpackPlugin({ filename: config.build.index, template: 'index.html', inject: true, minify: { removeComments: true, collapseWhitespace: true, removeAttributeQuotes: true // more options: // https://github.com/kangax/html-minifier#options-quick-reference }, // necessary to consistently work with multiple chunks via CommonsChunkPlugin chunksSortMode: 'dependency' }), // keep module.id stable when vender modules does not change new webpack.HashedModuleIdsPlugin(), // enable scope hoisting new webpack.optimize.ModuleConcatenationPlugin(), // split vendor js into its own file new webpack.optimize.CommonsChunkPlugin({ name: 'vendor', minChunks: function (module) { // any required modules inside node_modules are extracted to vendor return ( module.resource && /\.js$/.test(module.resource) && module.resource.indexOf( path.join(__dirname, '../node_modules') ) === 0 ) } }), // extract webpack runtime and module manifest to its own file in order to // prevent vendor hash from being updated whenever app bundle is updated new webpack.optimize.CommonsChunkPlugin({ name: 'manifest', minChunks: Infinity }), // This instance extracts shared chunks from code splitted chunks and bundles them // in a separate chunk, similar to the vendor chunk // see: https://webpack.js.org/plugins/commons-chunk-plugin/#extra-async-commons-chunk new webpack.optimize.CommonsChunkPlugin({ name: 'app', async: 'vendor-async', children: true, minChunks: 3 }), // copy custom static assets new CopyWebpackPlugin([ { from: path.resolve(__dirname, '../static'), to: config.build.assetsSubDirectory, ignore: ['.*'] } ]) ] }) if (config.build.productionGzip) { const CompressionWebpackPlugin = require('compression-webpack-plugin') webpackConfig.plugins.push( new CompressionWebpackPlugin({ asset: '[path].gz[query]', algorithm: 'gzip', test: new RegExp( '\\.(' + config.build.productionGzipExtensions.join('|') + ')$' ), threshold: 10240, minRatio: 0.8 }) ) } if (config.build.bundleAnalyzerReport) { const BundleAnalyzerPlugin = require('webpack-bundle-analyzer').BundleAnalyzerPlugin webpackConfig.plugins.push(new BundleAnalyzerPlugin()) } module.exports = webpackConfig ```

webpack问题(将能正常运行的项目除了node_modules文件复制了一份,然后cnpm i之后装完之后不能运行)

# 将能正常运行的项目除了node_modules文件外复制了一份,然后cnpm i之后装完之后不能运行 ![图片说明](https://img-ask.csdn.net/upload/201902/10/1549782353_446187.png) # npm run dev之后结果如下 package.json ``` { "name": "re", "version": "1.0.0", "description": "", "main": "index.js", "scripts": { "test": "echo \"Error: no test specified\" && exit 1", "dev": "webpack-dev-server --open --port 3001 --hot --mode development" }, "keywords": [], "author": "", "license": "ISC", "devDependencies": { "@babel/core": "^7.2.2", "@babel/runtime": "^7.3.1", "babel-loader": "^8.0.5", "babel-plugin-component": "^1.1.1", "css-loader": "^2.1.0", "file-loader": "^3.0.1", "html-webpack-plugin": "^3.2.0", "jquery": "^3.3.1", "popper.js": "^1.14.7", "style-loader": "^0.23.1", "url-loader": "^1.1.2", "vue-loader": "^15.6.2", "vue-template-compiler": "^2.6.2", "webpack": "^4.29.0", "webpack-cli": "^3.2.1", "webpack-dev-server": "^3.1.14" }, "dependencies": { "@babel/plugin-proposal-class-properties": "^7.3.0", "@babel/plugin-transform-runtime": "^7.2.0", "@babel/preset-env": "^7.3.1", "babel-cli": "^6.26.0", "mint-ui": "^2.2.13", "vue": "^2.6.2", "vue-router": "^3.0.2" } } ``` 求大神帮忙看看,小弟感激不尽

Vue2.0使用ElementUI的组件报错

问题截图: ![图片说明](https://img-ask.csdn.net/upload/201903/29/1553828313_461442.png) 问题描述: 编译工具webstorm,使用npm命令 dev运行项目报错。 搭建过程: 按照官方教程执行了 1.使用命令安装element组件 ``` npm i element-ui -S ``` 2.安装babel组件 ``` npm install babel-plugin-component -S ``` 3.main.js引用 ``` import ElementUI from 'element-ui' import 'element-ui/lib/theme-chalk/index.css' Vue.config.productionTip = false Vue.use(ElementUI); ``` 4.页面中使用element组件 ``` <template> <div>2</div> <el-row> <el-button>默认按钮</el-button> <el-button type="primary">主要按钮</el-button> <el-button type="success">成功按钮</el-button> <el-button type="info">信息按钮</el-button> <el-button type="warning">警告按钮</el-button> <el-button type="danger">危险按钮</el-button> </el-row> </template> ``` .babelrc文件修改后报错,es2015,安装后无法使用,还原成系统默认配置。 以下为相关文件的具体内容: package.json ``` { "name": "vuetest3", "version": "1.0.0", "description": "A Vue.js project", "author": "811204266@qq.com <123456>", "private": true, "scripts": { "dev": "webpack-dev-server --inline --progress --config build/webpack.dev.conf.js", "start": "npm run dev", "unit": "jest --config test/unit/jest.conf.js --coverage", "e2e": "node test/e2e/runner.js", "test": "npm run unit && npm run e2e", "lint": "eslint --ext .js,.vue src test/unit test/e2e/specs", "build": "node build/build.js" }, "dependencies": { "axios": "^0.18.0", "babel-polyfill": "^6.26.0", "vue": "^2.5.2", "vue-router": "^3.0.1" }, "devDependencies": { "autoprefixer": "^7.1.2", "babel-core": "^6.22.1", "babel-eslint": "^8.2.1", "babel-helper-vue-jsx-merge-props": "^2.0.3", "babel-jest": "^21.0.2", "babel-loader": "^7.1.1", "babel-plugin-component": "^1.1.1", "babel-plugin-dynamic-import-node": "^1.2.0", "babel-plugin-syntax-jsx": "^6.18.0", "babel-plugin-transform-es2015-modules-commonjs": "^6.26.0", "babel-plugin-transform-runtime": "^6.22.0", "babel-plugin-transform-vue-jsx": "^3.5.0", "babel-preset-env": "^1.3.2", "babel-preset-es2015": "^6.24.1", "babel-preset-stage-2": "^6.22.0", "babel-register": "^6.22.0", "chalk": "^2.0.1", "chromedriver": "^2.27.2", "copy-webpack-plugin": "^4.0.1", "cross-spawn": "^5.0.1", "css-loader": "^0.28.0", "eslint": "^4.15.0", "eslint-config-standard": "^10.2.1", "eslint-friendly-formatter": "^3.0.0", "eslint-loader": "^1.7.1", "eslint-plugin-import": "^2.7.0", "eslint-plugin-node": "^5.2.0", "eslint-plugin-promise": "^3.4.0", "eslint-plugin-standard": "^3.0.1", "eslint-plugin-vue": "^4.0.0", "extract-text-webpack-plugin": "^3.0.0", "file-loader": "^1.1.4", "friendly-errors-webpack-plugin": "^1.6.1", "html-webpack-plugin": "^2.30.1", "jest": "^22.0.4", "jest-serializer-vue": "^0.3.0", "nightwatch": "^0.9.12", "node-notifier": "^5.1.2", "optimize-css-assets-webpack-plugin": "^3.2.0", "ora": "^1.2.0", "portfinder": "^1.0.13", "postcss-import": "^11.0.0", "postcss-loader": "^2.0.8", "postcss-url": "^7.2.1", "rimraf": "^2.6.0", "selenium-server": "^3.0.1", "semver": "^5.3.0", "shelljs": "^0.7.6", "uglifyjs-webpack-plugin": "^1.1.1", "url-loader": "^0.5.8", "vue-jest": "^1.0.2", "vue-loader": "^13.3.0", "vue-style-loader": "^3.0.1", "vue-template-compiler": "^2.5.2", "webpack": "^3.6.0", "webpack-bundle-analyzer": "^2.9.0", "webpack-dev-server": "^2.9.1", "webpack-merge": "^4.1.0" }, "engines": { "node": ">= 6.0.0", "npm": ">= 3.0.0" }, "browserslist": [ "> 1%", "last 2 versions", "not ie <= 8" ] } ``` 页面文件home.vue ``` <template> <div>2</div> <el-row> <el-button>默认按钮</el-button> <el-button type="primary">主要按钮</el-button> <el-button type="success">成功按钮</el-button> <el-button type="info">信息按钮</el-button> <el-button type="warning">警告按钮</el-button> <el-button type="danger">危险按钮</el-button> </el-row> </template> <script> export default { name: 'home', data () { return { msg: 'Welcome to Your Vue.js App' } } } </script> <style scoped> </style> ``` main.js ``` // The Vue build version to load with the `import` command // (runtime-only or standalone) has been set in webpack.base.conf with an alias. import Vue from 'vue' import App from './App' import router from './router' import ElementUI from 'element-ui' import 'element-ui/lib/theme-chalk/index.css' Vue.config.productionTip = false Vue.use(ElementUI); /* eslint-disable no-new */ new Vue({ el: '#app', router, components: { App }, template: '<App/>' }) ``` router/index.js ``` import Vue from 'vue' import Router from 'vue-router' import Home from '@/page/Home' Vue.use(Router) export default new Router({ routes: [ { path: '/', name: 'Home', component: Home } ] }) ```

vue-loader安装后在.vue里的<style></style>里面写样式就报错?

提问:请问下,vue-loader也安装了为何在.vue的style标签了 还是不能写样式呢?webpack4,使用webpack-dev-server命令打包时就报错.应该如何解决? 我已经尝试卸载vue-loader重新安装,删除node-modules重新跑环境,但并没有解决掉.难到是某个加载器的版本的问题吗? main.js ``` import Vue from 'vue'; import app from './App.vue'; import { Header } from 'mint-ui'; Vue.component(Header.name, Header); var vm=new Vue({ el:'#app', render:c=>c(app) }); ``` App.vue ``` <template> <div class="box"> <!--header--> <mt-header fixed title="固定在顶部"></mt-header> <!--body--> <!--foot--> <h1>这是 App 组件</h1> </div> </template> <script> </script> <style lang="sass" scoped> .box{ padding-top:40px; } </style> ``` package.json ``` "devDependencies": { "babel-core": "^6.26.0", "babel-loader": "^7.1.2", "babel-plugin-component": "^0.10.1", "babel-plugin-transform-runtime": "^6.23.0", "babel-preset-env": "^1.6.1", "babel-preset-stage-0": "^6.24.1", "css-loader": "^0.28.7", "file-loader": "^1.1.5", "html-webpack-plugin": "^2.30.1", "less": "^2.7.3", "less-loader": "^4.0.5", "node-sass": "^4.5.3", "sass-loader": "^6.0.6", "style-loader": "^0.19.0", "url-loader": "^0.6.2", "vue-loader": "^13.3.0", "vue-template-compiler": "^2.5.2", "webpack": "^3.8.1", "webpack-dev-server": "^2.9.3" }, "dependencies": { "bootstrap": "^3.3.7", "mint-ui": "^2.2.9", "vue": "^2.5.2", "vue-router": "^3.0.1" } } ``` 错误提示: ``` ERROR in ./node_modules/css-loader!./node_modules/vue-loader/lib/style-compiler?{"vue":true,"id":"data-v-7ba5bd90","scoped": true,"hasInlineConfig":false}!./node_modules/sass-loader/lib/loader.js?indentedSyntax!./node_modules/vue-loader/lib/selector .js?type=styles&index=0!./src/App.vue Module build failed: .box{ ^ Invalid CSS after ".box{": expected "}", was "{" in F:\vuetest\day7\src\App.vue (line 19, column 6) @ ./node_modules/vue-style-loader!./node_modules/css-loader!./node_modules/vue-loader/lib/style-compiler?{"vue":true,"id":" data-v-7ba5bd90","scoped":true,"hasInlineConfig":false}!./node_modules/sass-loader/lib/loader.js?indentedSyntax!./node_modul es/vue-loader/lib/selector.js?type=styles&index=0!./src/App.vue 4:14-331 13:3-17:5 14:22-339 @ ./src/App.vue @ ./src/main.js @ multi (webpack)-dev-server/client?http://localhost:3000 webpack/hot/dev-server ./src/main.js

用npm安装package.json时出现错误

我是在win8 64bit上面操作,本来安装的nodejs是64位的, npm install时一直出现错误,上网查后有说要安装32位的,而且需要安装vs, 于是我卸载64的node又安装32的node,又安装vs2012, 然后又npm install 出现如下异常: ``` npm WARN optional dep failed, continuing fsevents@0.3.8 \ > spawn-sync@1.0.13 postinstall E:\project2\shijuan\node_modules\node-sass\node_modules\sas modules\spawn-sync > node postinstall \ > node-sass@3.2.0 install E:\project2\shijuan\node_modules\node-sass > node scripts/install.js Binary downloaded and installed at E:\project2\shijuan\node_modules\node-sass\vendor\win32- > node-sass@3.2.0 postinstall E:\project2\shijuan\node_modules\node-sass > node scripts/build.js ` E:\project2\shijuan\node_modules\node-sass\vendor\win32-ia32-14\binding.node ` exists. testing binary. Binary is fine; exiting. \ > bufferutil@1.1.0 install E:\project2\shijuan\node_modules\webpack-dev-server\node_modules > node-gyp rebuild | (venv) Think@RESEARCH E:\project2\shijuan\node_modules\webpack-dev-server\node_modules\sock > if not defined npm_config_node_gyp (node "C:\Program Files (x86)\nodejs\node_modules\npm\ e rebuild ) 在此解决方案中一次生成一个项目。若要启用并行生成,请添加“/m”开关。 bufferutil.cc 正在创建库 E:\project2\shijuan\node_modules\webpack-dev-server\node_modules\socket.io\ util .expb 和对象 E:\project2\shijuan\node_modules\webpack-dev-server\node_modules\socket.io\n 正在生成代码 已完成代码的生成 bufferutil.vcxproj -> E:\project2\shijuan\node_modules\webpack-dev-server\node_modules\so se\\bufferutil.node | > utf-8-validate@1.1.0 install E:\project2\shijuan\node_modules\webpack-dev-server\node_mod f-8-validate > node-gyp rebuild / (venv) Think@RESEARCH E:\project2\shijuan\node_modules\webpack-dev-server\node_modules\sock ate > if not defined npm_config_node_gyp (node "C:\Program Files (x86)\nodejs\node_modules\npm\ e rebuild ) 在此解决方案中一次生成一个项目。若要启用并行生成,请添加“/m”开关。 validation.cc 正在创建库 E:\project2\shijuan\node_modules\webpack-dev-server\node_modules\socket.io- ild\ Release\validation.lib 和对象 E:\project2\shijuan\node_modules\webpack-dev-server\node_mo tf -8-validate\build\Release\validation.exp 正在生成代码 已完成代码的生成 validation.vcxproj -> E:\project2\shijuan\node_modules\webpack-dev-server\node_modules\so lidate\build\Release\\validation.node > utf-8-validate@1.1.0 install E:\project2\shijuan\node_modules\webpack-dev-server\node_mod > node-gyp rebuild (venv) Think@RESEARCH E:\project2\shijuan\node_modules\webpack-dev-server\node_modules\sock > if not defined npm_config_node_gyp (node "C:\Program Files (x86)\nodejs\node_modules\npm\ e rebuild ) 在此解决方案中一次生成一个项目。若要启用并行生成,请添加“/m”开关。 validation.cc 正在创建库 E:\project2\shijuan\node_modules\webpack-dev-server\node_modules\socket.io\ lida tion.lib 和对象 E:\project2\shijuan\node_modules\webpack-dev-server\node_modules\socket.i va lidation.exp 正在生成代码 已完成代码的生成 validation.vcxproj -> E:\project2\shijuan\node_modules\webpack-dev-server\node_modules\so elease\\validation.node > bufferutil@1.1.0 install E:\project2\shijuan\node_modules\webpack-dev-server\node_modules util > node-gyp rebuild (venv) Think@RESEARCH E:\project2\shijuan\node_modules\webpack-dev-server\node_modules\sock > if not defined npm_config_node_gyp (node "C:\Program Files (x86)\nodejs\node_modules\npm\ e rebuild ) 在此解决方案中一次生成一个项目。若要启用并行生成,请添加“/m”开关。 bufferutil.cc 正在创建库 E:\project2\shijuan\node_modules\webpack-dev-server\node_modules\socket.io- Rele ase\bufferutil.lib 和对象 E:\project2\shijuan\node_modules\webpack-dev-server\node_module ru til\build\Release\bufferutil.exp 正在生成代码 已完成代码的生成 bufferutil.vcxproj -> E:\project2\shijuan\node_modules\webpack-dev-server\node_modules\so il\build\Release\\bufferutil.node vinyl-named@1.1.0 node_modules\vinyl-named └── through@2.3.8 manifest-revision-webpack-plugin@0.0.5 node_modules\manifest-revision-webpack-plugin └── walk@2.3.9 (foreachasync@3.0.0) coffee-script@1.9.3 node_modules\coffee-script superagent@1.3.0 node_modules\superagent ├── extend@1.2.1 ├── methods@1.0.1 ├── cookiejar@2.0.1 ├── component-emitter@1.1.2 ├── reduce-component@1.0.1 ├── mime@1.3.4 ├── qs@2.3.3 ├── debug@2.2.0 (ms@0.7.1) ├── readable-stream@1.0.27-1 (inherits@2.0.1, isarray@0.0.1, string_decoder@0.10.31, core-u ├── formidable@1.0.14 └── form-data@0.2.0 (async@0.9.2, combined-stream@0.0.7, mime-types@2.0.14) ``` 其实看上去也成功了很多,但是前面那几个异常怎么解决呢?谢谢各位 package.json如下 ``` { "repository": { "type": "git", "url": "" }, "license": "MIT", "description": "Project Shijuan", "scripts": { "start": "node_modules/.bin/webpack-dev-server --config conf/webpack.config.js --progress --colors --port 5001 --content-base build/public", "build": "node_modules/.bin/webpack --config conf/webpack.config.js --progress --profile --colors" }, "dependencies": { "amazeui": "^2.4.2", "babel-core": "^5.4.7", "babel-loader": "^5.1.3", "coffee-loader": "^0.7.2", "coffee-script": "^1.9.3", "css-loader": "^0.15.6", "echarts": "^2.2.7-beta7", "extract-text-webpack-plugin": "^0.8.1", "file-loader": "^0.8.4", "html-loader": "^0.3.0", "jquery": "^2.1.4", "manifest-revision-webpack-plugin": "^0.0.5", "node-sass": "^3.2.0", "postcss-loader": "^0.5.1", "sass-loader": "^2.0.0", "style-loader": "^0.12.3", "superagent": "^1.3.0", "url-loader": "^0.5.6", "vinyl-named": "^1.1.0", "vue": "^0.12.10", "vue-loader": "^2.1.1", "vue-validator": "^1.4.0", "webpack": "^1.10.0", "webpack-dev-server": "^1.9.0", "zrender": "ecomfe/zrender" } } ```

Uni-app sass无法编译成css,sass-loader错误

winodws平台下的uni-app项目,在使用了sass后模块无法加载,换成HbuilderX安装插件也不能运行。 求救! ``` 19:20:36.861 Module build failed (from ./node_modules/mini-css-extract-plugin/dist/loader.js): 19:20:36.862 ModuleBuildError: Module build failed (from ./node_modules/sass-loader/dist/cjs.js): 19:20:36.875 SassError: Invalid argument(s): Unsupported output style "nested". 19:20:36.876 at runLoaders (C:\Users\WI\Downloads\HBuilderX\plugins\uniapp-cli\node_modules\webpack\lib\NormalModule.js:301:20) 19:20:36.890 at C:\Users\WI\Downloads\HBuilderX\plugins\uniapp-cli\node_modules\loader-runner\lib\LoaderRunner.js:367:11 19:20:36.890 at C:\Users\WI\Downloads\HBuilderX\plugins\uniapp-cli\node_modules\loader-runner\lib\LoaderRunner.js:233:18 19:20:36.900 at context.callback (C:\Users\WI\Downloads\HBuilderX\plugins\uniapp-cli\node_modules\loader-runner\lib\LoaderRunner.js:111:13) 19:20:36.900 at render (C:\Users\WI\Downloads\HBuilderX\plugins\uniapp-cli\node_modules\sass-loader\dist\index.js:73:7) 19:20:36.914 at Function.call$2 (C:\Users\WI\node_modules\sass\sass.dart.js:54311:16) 19:20:36.915 at _render_closure1.call$2 (C:\Users\WI\node_modules\sass\sass.dart.js:33511:12) 19:20:36.933 at _RootZone.runBinary$3$3 (C:\Users\WI\node_modules\sass\sass.dart.js:19817:18) 19:20:36.934 at _RootZone.runBinary$3 (C:\Users\WI\node_modules\sass\sass.dart.js:19821:19) 19:20:36.955 at _FutureListener.handleError$1 (C:\Users\WI\node_modules\sass\sass.dart.js:18286:19) 19:20:36.956 at _Future__propagateToListeners_handleError.call$0 (C:\Users\WI\node_modules\sass\sass.dart.js:18574:40) 19:20:36.970 at Object._Future__propagateToListeners (C:\Users\WI\node_modules\sass\sass.dart.js:3484:88) 19:20:36.971 at _Future._completeError$2 (C:\Users\WI\node_modules\sass\sass.dart.js:18410:9) 19:20:36.990 at _Future__asyncCompleteError_closure.call$0 (C:\Users\WI\node_modules\sass\sass.dart.js:18500:18) 19:20:36.990 at Object._microtaskLoop (C:\Users\WI\node_modules\sass\sass.dart.js:3534:21) 19:20:37.009 at StaticClosure._startMicrotaskLoop (C:\Users\WI\node_modules\sass\sass.dart.js:3540:11) 19:20:37.010 ERROR Build failed with errors. ```

大学四年自学走来,这些私藏的实用工具/学习网站我贡献出来了

大学四年,看课本是不可能一直看课本的了,对于学习,特别是自学,善于搜索网上的一些资源来辅助,还是非常有必要的,下面我就把这几年私藏的各种资源,网站贡献出来给你们。主要有:电子书搜索、实用工具、在线视频学习网站、非视频学习网站、软件下载、面试/求职必备网站。 注意:文中提到的所有资源,文末我都给你整理好了,你们只管拿去,如果觉得不错,转发、分享就是最大的支持了。 一、电子书搜索 对于大部分程序员...

在中国程序员是青春饭吗?

今年,我也32了 ,为了不给大家误导,咨询了猎头、圈内好友,以及年过35岁的几位老程序员……舍了老脸去揭人家伤疤……希望能给大家以帮助,记得帮我点赞哦。 目录: 你以为的人生 一次又一次的伤害 猎头界的真相 如何应对互联网行业的「中年危机」 一、你以为的人生 刚入行时,拿着傲人的工资,想着好好干,以为我们的人生是这样的: 等真到了那一天,你会发现,你的人生很可能是这样的: ...

Java基础知识面试题(2020最新版)

文章目录Java概述何为编程什么是Javajdk1.5之后的三大版本JVM、JRE和JDK的关系什么是跨平台性?原理是什么Java语言有哪些特点什么是字节码?采用字节码的最大好处是什么什么是Java程序的主类?应用程序和小程序的主类有何不同?Java应用程序与小程序之间有那些差别?Java和C++的区别Oracle JDK 和 OpenJDK 的对比基础语法数据类型Java有哪些数据类型switc...

我以为我学懂了数据结构,直到看了这个导图才发现,我错了

数据结构与算法思维导图

技术大佬:我去,你写的 switch 语句也太老土了吧

昨天早上通过远程的方式 review 了两名新来同事的代码,大部分代码都写得很漂亮,严谨的同时注释也很到位,这令我非常满意。但当我看到他们当中有一个人写的 switch 语句时,还是忍不住破口大骂:“我擦,小王,你丫写的 switch 语句也太老土了吧!” 来看看小王写的代码吧,看完不要骂我装逼啊。 private static String createPlayer(PlayerTypes p...

和黑客斗争的 6 天!

互联网公司工作,很难避免不和黑客们打交道,我呆过的两家互联网公司,几乎每月每天每分钟都有黑客在公司网站上扫描。有的是寻找 Sql 注入的缺口,有的是寻找线上服务器可能存在的漏洞,大部分都...

Linux 会成为主流桌面操作系统吗?

整理 |屠敏出品 | CSDN(ID:CSDNnews)2020 年 1 月 14 日,微软正式停止了 Windows 7 系统的扩展支持,这意味着服役十年的 Windows 7,属于...

讲一个程序员如何副业月赚三万的真实故事

loonggg读完需要3分钟速读仅需 1 分钟大家好,我是你们的校长。我之前讲过,这年头,只要肯动脑,肯行动,程序员凭借自己的技术,赚钱的方式还是有很多种的。仅仅靠在公司出卖自己的劳动时...

学习总结之HTML5剑指前端(建议收藏,图文并茂)

前言学习《HTML5与CSS3权威指南》这本书很不错,学完之后我颇有感触,觉得web的世界开明了许多。这本书是需要有一定基础的web前端开发工程师。这本书主要学习HTML5和css3,看...

女程序员,为什么比男程序员少???

昨天看到一档综艺节目,讨论了两个话题:(1)中国学生的数学成绩,平均下来看,会比国外好?为什么?(2)男生的数学成绩,平均下来看,会比女生好?为什么?同时,我又联想到了一个技术圈经常讨...

搜狗输入法也在挑战国人的智商!

故事总是一个接着一个到来...上周写完《鲁大师已经彻底沦为一款垃圾流氓软件!》这篇文章之后,鲁大师的市场工作人员就找到了我,希望把这篇文章删除掉。经过一番沟通我先把这篇文章从公号中删除了...

副业收入是我做程序媛的3倍,工作外的B面人生是怎样的?

提到“程序员”,多数人脑海里首先想到的大约是:为人木讷、薪水超高、工作枯燥…… 然而,当离开工作岗位,撕去层层标签,脱下“程序员”这身外套,有的人生动又有趣,马上展现出了完全不同的A/B面人生! 不论是简单的爱好,还是正经的副业,他们都干得同样出色。偶尔,还能和程序员的特质结合,产生奇妙的“化学反应”。 @Charlotte:平日素颜示人,周末美妆博主 大家都以为程序媛也个个不修边幅,但我们也许...

MySQL数据库面试题(2020最新版)

文章目录数据库基础知识为什么要使用数据库什么是SQL?什么是MySQL?数据库三大范式是什么mysql有关权限的表都有哪几个MySQL的binlog有有几种录入格式?分别有什么区别?数据类型mysql有哪些数据类型引擎MySQL存储引擎MyISAM与InnoDB区别MyISAM索引与InnoDB索引的区别?InnoDB引擎的4大特性存储引擎选择索引什么是索引?索引有哪些优缺点?索引使用场景(重点)...

新一代神器STM32CubeMonitor介绍、下载、安装和使用教程

关注、星标公众号,不错过精彩内容作者:黄工公众号:strongerHuang最近ST官网悄悄新上线了一款比较强大的工具:STM32CubeMonitor V1.0.0。经过我研究和使用之...

记一次腾讯面试,我挂在了最熟悉不过的队列上……

腾讯后台面试,面试官问:如何自己实现队列?

如果你是老板,你会不会踢了这样的员工?

有个好朋友ZS,是技术总监,昨天问我:“有一个老下属,跟了我很多年,做事勤勤恳恳,主动性也很好。但随着公司的发展,他的进步速度,跟不上团队的步伐了,有点...

我入职阿里后,才知道原来简历这么写

私下里,有不少读者问我:“二哥,如何才能写出一份专业的技术简历呢?我总感觉自己写的简历太烂了,所以投了无数份,都石沉大海了。”说实话,我自己好多年没有写过简历了,但我认识的一个同行,他在阿里,给我说了一些他当年写简历的方法论,我感觉太牛逼了,实在是忍不住,就分享了出来,希望能够帮助到你。 01、简历的本质 作为简历的撰写者,你必须要搞清楚一点,简历的本质是什么,它就是为了来销售你的价值主张的。往深...

冒泡排序动画(基于python pygame实现)

本项目效果初始截图如下 动画见本人b站投稿:https://www.bilibili.com/video/av95491382 本项目对应github地址:https://github.com/BigShuang python版本:3.6,pygame版本:1.9.3。(python版本一致应该就没什么问题) 样例gif如下 ======================= 大爽歌作,mad

Redis核心原理与应用实践

Redis核心原理与应用实践 在很多场景下都会使用Redis,但是到了深层次的时候就了解的不是那么深刻,以至于在面试的时候经常会遇到卡壳的现象,学习知识要做到系统和深入,不要把Redis想象的过于复杂,和Mysql一样,是个读取数据的软件。 有一个理解是Redis是key value缓存服务器,更多的优点在于对value的操作更加丰富。 安装 yum install redis #yum安装 b...

现代的 “Hello, World”,可不仅仅是几行代码而已

作者 |Charles R. Martin译者 | 弯月,责编 | 夕颜头图 |付费下载自视觉中国出品 | CSDN(ID:CSDNnews)新手...

带了6个月的徒弟当了面试官,而身为高级工程师的我天天修Bug......

即将毕业的应届毕业生一枚,现在只拿到了两家offer,但最近听到一些消息,其中一个offer,我这个组据说客户很少,很有可能整组被裁掉。 想问大家: 如果我刚入职这个组就被裁了怎么办呢? 大家都是什么时候知道自己要被裁了的? 面试软技能指导: BQ/Project/Resume 试听内容: 除了刷题,还有哪些技能是拿到offer不可或缺的要素 如何提升面试软实力:简历, 行为面试,沟通能...

!大部分程序员只会写3年代码

如果世界上都是这种不思进取的软件公司,那别说大部分程序员只会写 3 年代码,恐怕就没有程序员这种职业。

离职半年了,老东家又发 offer,回不回?

有小伙伴问松哥这个问题,他在上海某公司,在离职了几个月后,前公司的领导联系到他,希望他能够返聘回去,他很纠结要不要回去? 俗话说好马不吃回头草,但是这个小伙伴既然感到纠结了,我觉得至少说明了两个问题:1.曾经的公司还不错;2.现在的日子也不是很如意。否则应该就不会纠结了。 老实说,松哥之前也有过类似的经历,今天就来和小伙伴们聊聊回头草到底吃不吃。 首先一个基本观点,就是离职了也没必要和老东家弄的苦...

2020阿里全球数学大赛:3万名高手、4道题、2天2夜未交卷

阿里巴巴全球数学竞赛( Alibaba Global Mathematics Competition)由马云发起,由中国科学技术协会、阿里巴巴基金会、阿里巴巴达摩院共同举办。大赛不设报名门槛,全世界爱好数学的人都可参与,不论是否出身数学专业、是否投身数学研究。 2020年阿里巴巴达摩院邀请北京大学、剑桥大学、浙江大学等高校的顶尖数学教师组建了出题组。中科院院士、美国艺术与科学院院士、北京国际数学...

为什么你不想学习?只想玩?人是如何一步一步废掉的

不知道是不是只有我这样子,还是你们也有过类似的经历。 上学的时候总有很多光辉历史,学年名列前茅,或者单科目大佬,但是虽然慢慢地长大了,你开始懈怠了,开始废掉了。。。 什么?你说不知道具体的情况是怎么样的? 我来告诉你: 你常常潜意识里或者心理觉得,自己真正的生活或者奋斗还没有开始。总是幻想着自己还拥有大把时间,还有无限的可能,自己还能逆风翻盘,只不是自己还没开始罢了,自己以后肯定会变得特别厉害...

HTTP与HTTPS的区别

面试官问HTTP与HTTPS的区别,我这样回答让他竖起大拇指!

程序员毕业去大公司好还是小公司好?

虽然大公司并不是人人都能进,但我仍建议还未毕业的同学,尽力地通过校招向大公司挤,但凡挤进去,你这一生会容易很多。 大公司哪里好?没能进大公司怎么办?答案都在这里了,记得帮我点赞哦。 目录: 技术氛围 内部晋升与跳槽 啥也没学会,公司倒闭了? 不同的人脉圈,注定会有不同的结果 没能去大厂怎么办? 一、技术氛围 纵观整个程序员技术领域,哪个在行业有所名气的大牛,不是在大厂? 而且众所...

男生更看重女生的身材脸蛋,还是思想?

往往,我们看不进去大段大段的逻辑。深刻的哲理,往往短而精悍,一阵见血。问:产品经理挺漂亮的,有点心动,但不知道合不合得来。男生更看重女生的身材脸蛋,还是...

程序员为什么千万不要瞎努力?

本文作者用对比非常鲜明的两个开发团队的故事,讲解了敏捷开发之道 —— 如果你的团队缺乏统一标准的环境,那么即使勤劳努力,不仅会极其耗时而且成果甚微,使用...

为什么程序员做外包会被瞧不起?

二哥,有个事想询问下您的意见,您觉得应届生值得去外包吗?公司虽然挺大的,中xx,但待遇感觉挺低,马上要报到,挺纠结的。

立即提问
相关内容推荐