python配置caffe,vs编译caffe遇到error 160C

想在anaconda(python3.6)下配置caffe,vs2013编译caffe的时候就遇到问题

错误 3 error LNK2001: 无法解析的外部符号 "struct object * __cdecl boost::python::detail::init_module(struct PyModuleDef &,void (_cdecl*)(void))" (?init_module@detail@python@boost@@YAPEAU_object@@AEAUPyModuleDef@@P6AXXZ@Z) C:\caffetest\caffe-master\windows\pycaffe_caffe.obj pycaffe
错误 4 error LNK1120: 1 个无法解析的外部命令 C:\caffetest\Bin\x64\Release_caffe.pyd 1 1 pycaffe

环境:win10,cuda9.2(2080显卡只支持9.2以上版本)

weixin_44271262
weixin_44271262 求问楼主问题解决了吗,我也遇到了相同问题
7 个月之前 回复

2个回答

在ubuntu里面搭caffe要快一些,如果需要的话,我的博客里面有在ubuntu搭建caffe的教程

Csdn user default icon
上传中...
上传图片
插入图片
抄袭、复制答案,以达到刷声望分或其他目的的行为,在CSDN问答是严格禁止的,一经发现立刻封号。是时候展现真正的技术了!
其他相关推荐
Caffe配置时提示LNK1104 无法打开python27.lib怎么办?

python接口是使用anaconda3配置的,换成anaconda2以后提示LNK1181:无法打开文件python3.lib VS2013+CUDA8.0+cuDNN5.1 求问原因 ![图片说明](https://img-ask.csdn.net/upload/201709/16/1505537745_2115.png)

windows环境下 caffe 配置 error lnk2001

windows环境下 caffe 配置在release x64下,编译每个项目时都会出现几百个无法解析的外部符号错误 error lnk2001 ,都是和caffe 有关的,如下图所示,编译通不过就无法使用gpu加速呀,求大神指点,为什么会这样![图片](https://img-ask.csdn.net/upload/201611/27/1480223647_527931.jpg)![图片](https://img-ask.csdn.net/upload/201611/27/1480223823_294153.jpg)

关于无法编译caffe中libcaffe的问题

caffe+vs2013+cuda7.5+cudnn4.0编译出现问题如下: I:\caffe-master\caffe-master\windows\libcaffe>"C:\Program Files\NVIDIA GPU Computing Toolkit\CUDA\v7.5\bin\nvcc.exe" -gencode=arch=compute_35,code=\"sm_35,compute_35\" -gencode=arch=compute_52,code=\"sm_52,compute_52\" --use-local-env --cl-version 2013 -ccbin "I:\VS2013\VC\bin\x86_amd64" -I"I:\caffe-master\NugetPackages\lmdb-v120-clean.0.9.14.0\build\native\..\..\lib\native\include" -I"I:\caffe-master\NugetPackages\LevelDB-vc120.1.2.0.0\build\native\../..//build/native/include/" -I"I:\caffe-master\NugetPackages\protobuf-v120.2.6.1\build\native\../..//build/native/include/" -I"I:\caffe-master\NugetPackages\glog.0.3.3.0\build\native\../..//build/native/include/" -I"I:\caffe-master\NugetPackages\gflags.2.1.2.1\build\native\../..///build/native/include/" -I"I:\caffe-master\NugetPackages\boost.1.59.0.0\build\native\..\..\lib\native\include\\" -I"I:\caffe-master\NugetPackages\hdf5-v120-complete.1.8.15.2\build\native\..\..\lib\native\include" -I"I:\caffe-master\NugetPackages\OpenBLAS.0.2.14.1\build\native\..\..\lib\native\include" -I"I:\caffe-master\NugetPackages\OpenCV.2.4.10\build\native\../../build/native/include/" -I"I:\caffe-master\caffe-master\windows\libcaffe\\..\..\src\\" -I"C:\Program Files\NVIDIA GPU Computing Toolkit\CUDA\v7.5\include" -I"C:\Program Files\NVIDIA GPU Computing Toolkit\CUDA\v7.5\include" --keep-dir I:\caffe-master\caffe-master\windows\..\Build\Int\libcaffe\x64\Release -maxrregcount=0 --machine 64 --compile -cudart static -Xcudafe "--diag_suppress=exception_spec_override_incompat --diag_suppress=useless_using_declaration --diag_suppress=field_without_dll_interface" -D_SCL_SECURE_NO_WARNINGS -DGFLAGS_DLL_DECL= -DHAS_LMDB -DHAS_HDF5 -DHAS_OPENBLAS -DHAS_OPENCV -DNDEBUG -D_SCL_SECURE_NO_WARNINGS -DUSE_OPENCV -DUSE_LEVELDB -DUSE_LMDB -DUSE_CUDNN -D_UNICODE -DUNICODE -Xcompiler "/EHsc /W1 /nologo /Ox /Zi /MD " -o I:\caffe-master\caffe-master\windows\..\Build\Int\libcaffe\x64\Release\absval_layer.cu.obj "I:\caffe-master\caffe-master\src\caffe\layers\absval_layer.cu" 1> nvcc fatal : Could not open output file 'C:\Users\huashuo\AppData\Local\Temp;H:\opencv\build\x64\vc10\bin;H:\opencv\build\x86\vc10\bin/tmpxft_000000d4_00000000' 1>C:\Program Files (x86)\MSBuild\Microsoft.Cpp\v4.0\V120\BuildCustomizations\CUDA 7.5.targets(604,9): error MSB3721: 命令“"C:\Program Files\NVIDIA GPU Computing Toolkit\CUDA\v7.5\bin\nvcc.exe" -gencode=arch=compute_35,code=\"sm_35,compute_35\" -gencode=arch=compute_52,code=\"sm_52,compute_52\" --use-local-env --cl-version 2013 -ccbin "I:\VS2013\VC\bin\x86_amd64" -I"I:\caffe-master\NugetPackages\lmdb-v120-clean.0.9.14.0\build\native\..\..\lib\native\include" -I"I:\caffe-master\NugetPackages\LevelDB-vc120.1.2.0.0\build\native\../..//build/native/include/" -I"I:\caffe-master\NugetPackages\protobuf-v120.2.6.1\build\native\../..//build/native/include/" -I"I:\caffe-master\NugetPackages\glog.0.3.3.0\build\native\../..//build/native/include/" -I"I:\caffe-master\NugetPackages\gflags.2.1.2.1\build\native\../..///build/native/include/" -I"I:\caffe-master\NugetPackages\boost.1.59.0.0\build\native\..\..\lib\native\include\\" -I"I:\caffe-master\NugetPackages\hdf5-v120-complete.1.8.15.2\build\native\..\..\lib\native\include" -I"I:\caffe-master\NugetPackages\OpenBLAS.0.2.14.1\build\native\..\..\lib\native\include" -I"I:\caffe-master\NugetPackages\OpenCV.2.4.10\build\native\../../build/native/include/" -I"I:\caffe-master\caffe-master\windows\libcaffe\\..\..\src\\" -I"C:\Program Files\NVIDIA GPU Computing Toolkit\CUDA\v7.5\include" -I"C:\Program Files\NVIDIA GPU Computing Toolkit\CUDA\v7.5\include" --keep-dir I:\caffe-master\caffe-master\windows\..\Build\Int\libcaffe\x64\Release -maxrregcount=0 --machine 64 --compile -cudart static -Xcudafe "--diag_suppress=exception_spec_override_incompat --diag_suppress=useless_using_declaration --diag_suppress=field_without_dll_interface" -D_SCL_SECURE_NO_WARNINGS -DGFLAGS_DLL_DECL= -DHAS_LMDB -DHAS_HDF5 -DHAS_OPENBLAS -DHAS_OPENCV -DNDEBUG -D_SCL_SECURE_NO_WARNINGS -DUSE_OPENCV -DUSE_LEVELDB -DUSE_LMDB -DUSE_CUDNN -D_UNICODE -DUNICODE -Xcompiler "/EHsc /W1 /nologo /Ox /Zi /MD " -o I:\caffe-master\caffe-master\windows\..\Build\Int\libcaffe\x64\Release\absval_layer.cu.obj "I:\caffe-master\caffe-master\src\caffe\layers\absval_layer.cu"”已退出,返回代码为 1。

windows版caffe的编译问题,弄了好几天,求大神看看。

Error 45 error MSB3721: The command ""C:\Program Files\NVIDIA GPU Computing Toolkit\CUDA\v9.0\bin\nvcc.exe" -ccbin "C:\Program Files (x86)\Microsoft Visual Studio 12.0\VC\bin\x86_amd64" -x cu -I"D:\NugetPackages\lmdb-v120-clean.0.9.14.0\build\native\..\..\lib\native\include" -I"D:\NugetPackages\LevelDB-vc120.1.2.0.0\build\native\../..//build/native/include/" -I"D:\NugetPackages\protobuf-v120.2.6.1\build\native\../..//build/native/include/" -ID:\NugetPackages\glog.0.3.3.0\build\native\../..//build/native/include/ -ID:\NugetPackages\gflags.2.1.2.1\build\native\../..///build/native/include/ -ID:\NugetPackages\boost.1.59.0.0\build\native\..\..\lib\native\include\ -I"D:\NugetPackages\hdf5-v120-complete.1.8.15.2\build\native\..\..\lib\native\include" -ID:\NugetPackages\OpenBLAS.0.2.14.1\build\native\..\..\lib\native\include -ID:\NugetPackages\OpenCV.2.4.10\build\native\../../build/native/include/ -I"D:\caffe-master\windows\libcaffe\\..\..\src\D:\Anaconda\python3.6\include" -I"C:\Program Files\NVIDIA GPU Computing Toolkit\CUDA\v9.0\include" -I"C:\Program Files\NVIDIA GPU Computing Toolkit\CUDA\v9.0\include" --keep-dir D:\caffe-master\windows\..\Build\Int\libcaffe\x64\Release -maxrregcount=0 --machine 64 --compile -Xcudafe "--diag_suppress=exception_spec_override_incompat --diag_suppress=useless_using_declaration --diag_suppress=field_without_dll_interface" -D_SCL_SECURE_NO_WARNINGS -DGFLAGS_DLL_DECL= -DHAS_LMDB -DHAS_HDF5 -DHAS_OPENBLAS -DHAS_OPENCV -DNDEBUG -D_SCL_SECURE_NO_WARNINGS -DUSE_OPENCV -DUSE_LEVELDB -DUSE_LMDB -DWITH_PYTHON_LAYER -DBOOST_PYTHON_STATIC_LIB -DUSE_CUDNN -D_UNICODE -DUNICODE -Xcompiler "/EHsc /W1 /nologo /Ox /FS /Zi /MD " -o D:\caffe-master\windows\..\Build\Int\libcaffe\x64\Release\absval_layer.cu.obj "D:\caffe-master\src\caffe\layers\absval_layer.cu" -clean" exited with code 1. C:\Program Files (x86)\MSBuild\Microsoft.Cpp\v4.0\V120\BuildCustomizations\CUDA 9.0.targets 883 9 libcaffe

caffe编译报错求助!!

ubuntu18.04+cuda9.1+opencv3.2.0+cuNDD7.1.3 make all报错make: *** [.build_release/tools/upgrade_net_proto_text.bin] Error 1 求助!!!!

求解无法用VS2015编译64位boost,无法生成64位bootstrap

在编译caffe的过程中,出现了缺少libboost python-1-mt-vc140_1_59.lib,于是去网上下载了boost1.59的文件。在用VS2015编译过程中遇到了问题。 ![图片说明](https://img-ask.csdn.net/upload/201611/21/1479703162_660130.png) 使用64位本地命令行提示符运行bootstrap会提示失败,log文件显示的是: ``` LIBCMTD.lib(_chkstk_.obj) : fatal error LNK1112: module machine type 'x64' conflicts with target machine type 'X86' ``` 使用其他的命令提示符运行可以成功,但是 D:\boost_1_59_0\tools\build\src\engine目录下只会生成bin.ntx86而没有x86_x64 将其生成的库加入项目,也会报错 ![图片说明](https://img-ask.csdn.net/upload/201611/21/1479703586_575880.png) 求解怎样才能解决这个错误?

caffe生成解决方案时出错

编译环境:win10 vs2017 15.5.6 boost_1_70_0 主要报错: Unknown compiler version - please run the configure tests and report the results 再次点生成解决方案时的主要报错: for each 语句不能在“std::array *”类型的变量上操作 ; “std::array”: 模板 参数太少 ; 无法打开文件“libboost_date_time-vc140-mt-gd-1_59.lib” 等等; 因为只能一条条复制,所以如有需要,可提供详细错误; 下面是重新生成解决方案的具体报错,有大佬来救救我吗,感激不尽!需要更详细信息可以直说。 报错:1>------ 已启动全部重新生成: 项目: libcaffe, 配置: Debug x64 ------ 1>ProtoCompile.cmd : Create proto temp directory "C:\Users\Kay Chow\Documents\caffe-master\windows\..\src\caffe\proto\temp" 1>ProtoCompile.cmd : Generating "C:\Users\Kay Chow\Documents\caffe-master\windows\..\src\caffe\proto\temp\caffe.pb.h" and "C:\Users\Kay Chow\Documents\caffe-master\windows\..\src\caffe\proto\temp\caffe.pb.cc" 1>ProtoCompile.cmd : Create proto include directory 1>子目录或文件 C:\Users\Kay Chow\Documents\caffe-master\windows\..\include\caffe\proto 已经存在。 1>ProtoCompile.cmd : Compare newly compiled caffe.pb.h with existing one 1>blob.cpp 1>common.cpp 1>data_reader.cpp 1>data_transformer.cpp 1>internal_thread.cpp 1>layer.cpp 1>absval_layer.cpp 1>accuracy_layer.cpp 1>Unknown compiler version - please run the configure tests and report the results 1>Unknown compiler version - please run the configure tests and report the results 1>Unknown compiler version - please run the configure tests and report the results 1>Unknown compiler version - please run the configure tests and report the results 1>Unknown compiler version - please run the configure tests and report the results 1>Unknown compiler version - please run the configure tests and report the results 1>Unknown compiler version - please run the configure tests and report the results 1>Unknown compiler version - please run the configure tests and report the results 1>argmax_layer.cpp 1>base_conv_layer.cpp 1>base_data_layer.cpp 1>Unknown compiler version - please run the configure tests and report the results 1>Unknown compiler version - please run the configure tests and report the results 1>Unknown compiler version - please run the configure tests and report the results 1>batch_norm_layer.cpp 1>Unknown compiler version - please run the configure tests and report the results 1>batch_reindex_layer.cpp 1>bias_layer.cpp 1>Unknown compiler version - please run the configure tests and report the results 1>Unknown compiler version - please run the configure tests and report the results 1>bnll_layer.cpp 1>box_annotator_ohem_layer.cpp 1>Unknown compiler version - please run the configure tests and report the results 1>concat_layer.cpp 1>contrastive_loss_layer.cpp 1>Unknown compiler version - please run the configure tests and report the results 1>Unknown compiler version - please run the configure tests and report the results 1>Unknown compiler version - please run the configure tests and report the results 1>conv_layer.cpp 1>Unknown compiler version - please run the configure tests and report the results 1>crop_layer.cpp 1>cudnn_conv_layer.cpp 1>cudnn_lcn_layer.cpp 1>cudnn_lrn_layer.cpp 1>cudnn_pooling_layer.cpp 1>Unknown compiler version - please run the configure tests and report the results 1>cudnn_relu_layer.cpp 1>cudnn_sigmoid_layer.cpp 1>cudnn_softmax_layer.cpp 1>cudnn_tanh_layer.cpp 1>data_layer.cpp 1>deconv_layer.cpp 1>dropout_layer.cpp 1>dummy_data_layer.cpp 1>eltwise_layer.cpp 1>elu_layer.cpp 1>Unknown compiler version - please run the configure tests and report the results 1>Unknown compiler version - please run the configure tests and report the results 1>Unknown compiler version - please run the configure tests and report the results 1>Unknown compiler version - please run the configure tests and report the results 1>Unknown compiler version - please run the configure tests and report the results 1>Unknown compiler version - please run the configure tests and report the results 1>embed_layer.cpp 1>Unknown compiler version - please run the configure tests and report the results 1>euclidean_loss_layer.cpp 1>Unknown compiler version - please run the configure tests and report the results 1>exp_layer.cpp 1>filter_layer.cpp 1>flatten_layer.cpp 1>hdf5_data_layer.cpp 1>Unknown compiler version - please run the configure tests and report the results 1>Unknown compiler version - please run the configure tests and report the results 1>hdf5_output_layer.cpp 1>Unknown compiler version - please run the configure tests and report the results 1>Unknown compiler version - please run the configure tests and report the results 1>Unknown compiler version - please run the configure tests and report the results 1>hinge_loss_layer.cpp 1>Unknown compiler version - please run the configure tests and report the results 1>im2col_layer.cpp 1>image_data_layer.cpp 1>infogain_loss_layer.cpp 1>inner_product_layer.cpp 1>Unknown compiler version - please run the configure tests and report the results 1>input_layer.cpp 1>Unknown compiler version - please run the configure tests and report the results 1>log_layer.cpp 1>loss_layer.cpp 1>Unknown compiler version - please run the configure tests and report the results 1>Unknown compiler version - please run the configure tests and report the results 1>Unknown compiler version - please run the configure tests and report the results 1>Unknown compiler version - please run the configure tests and report the results 1>Unknown compiler version - please run the configure tests and report the results 1>lrn_layer.cpp 1>Unknown compiler version - please run the configure tests and report the results 1>memory_data_layer.cpp 1>multinomial_logistic_loss_layer.cpp 1>mvn_layer.cpp 1>neuron_layer.cpp 1>Unknown compiler version - please run the configure tests and report the results 1>parameter_layer.cpp 1>Unknown compiler version - please run the configure tests and report the results 1>Unknown compiler version - please run the configure tests and report the results 1>pooling_layer.cpp 1>Unknown compiler version - please run the configure tests and report the results 1>Unknown compiler version - please run the configure tests and report the results 1>Unknown compiler version - please run the configure tests and report the results 1>power_layer.cpp 1>Unknown compiler version - please run the configure tests and report the results 1>prelu_layer.cpp 1>psroi_pooling_layer.cpp 1>reduction_layer.cpp 1>relu_layer.cpp 1>reshape_layer.cpp 1>scale_layer.cpp 1>sigmoid_cross_entropy_loss_layer.cpp 1>Unknown compiler version - please run the configure tests and report the results 1>Unknown compiler version - please run the configure tests and report the results 1>Unknown compiler version - please run the configure tests and report the results 1>Unknown compiler version - please run the configure tests and report the results 1>Unknown compiler version - please run the configure tests and report the results 1>Unknown compiler version - please run the configure tests and report the results 1>Unknown compiler version - please run the configure tests and report the results 1>sigmoid_layer.cpp 1>Unknown compiler version - please run the configure tests and report the results 1>silence_layer.cpp 1>slice_layer.cpp 1>smooth_l1_loss_layer.cpp 1>smooth_L1_loss_ohem_layer.cpp 1>Unknown compiler version - please run the configure tests and report the results 1>softmax_layer.cpp 1>Unknown compiler version - please run the configure tests and report the results 1>Unknown compiler version - please run the configure tests and report the results 1>softmax_loss_layer.cpp 1>Unknown compiler version - please run the configure tests and report the results 1>softmax_loss_ohem_layer.cpp 1>Unknown compiler version - please run the configure tests and report the results 1>split_layer.cpp 1>Unknown compiler version - please run the configure tests and report the results 1>Unknown compiler version - please run the configure tests and report the results 1>Unknown compiler version - please run the configure tests and report the results 1>spp_layer.cpp 1>tanh_layer.cpp 1>threshold_layer.cpp 1>tile_layer.cpp 1>window_data_layer.cpp 1>Unknown compiler version - please run the configure tests and report the results 1>Unknown compiler version - please run the configure tests and report the results 1>Unknown compiler version - please run the configure tests and report the results 1>Unknown compiler version - please run the configure tests and report the results 1>layer_factory.cpp 1>net.cpp 1>parallel.cpp 1>Unknown compiler version - please run the configure tests and report the results 1>Unknown compiler version - please run the configure tests and report the results 1>Unknown compiler version - please run the configure tests and report the results 1>Unknown compiler version - please run the configure tests and report the results 1>caffe.pb.cc 1>solver.cpp 1>adadelta_solver.cpp 1>adagrad_solver.cpp 1>Unknown compiler version - please run the configure tests and report the results 1>Unknown compiler version - please run the configure tests and report the results 1>Unknown compiler version - please run the configure tests and report the results 1>adam_solver.cpp 1>Unknown compiler version - please run the configure tests and report the results 1>nesterov_solver.cpp 1>Unknown compiler version - please run the configure tests and report the results 1>rmsprop_solver.cpp 1>sgd_solver.cpp 1>syncedmem.cpp 1>Unknown compiler version - please run the configure tests and report the results 1>Unknown compiler version - please run the configure tests and report the results 1>benchmark.cpp 1>Unknown compiler version - please run the configure tests and report the results 1>Unknown compiler version - please run the configure tests and report the results 1>blocking_queue.cpp 1>Unknown compiler version - please run the configure tests and report the results 1>cudnn.cpp 1>db.cpp 1>db_leveldb.cpp 1>Unknown compiler version - please run the configure tests and report the results 1>db_lmdb.cpp 1>Unknown compiler version - please run the configure tests and report the results 1>Unknown compiler version - please run the configure tests and report the results 1>hdf5.cpp 1>Unknown compiler version - please run the configure tests and report the results 1>im2col.cpp 1>insert_splits.cpp 1>io.cpp 1>Unknown compiler version - please run the configure tests and report the results 1>math_functions.cpp 1>signal_handler.cpp 1>Unknown compiler version - please run the configure tests and report the results 1>Unknown compiler version - please run the configure tests and report the results 1>Unknown compiler version - please run the configure tests and report the results 1>upgrade_proto.cpp 1>Unknown compiler version - please run the configure tests and report the results 1>Unknown compiler version - please run the configure tests and report the results 1>libcaffe.vcxproj -> C:\Users\Kay Chow\Documents\caffe-master\windows\..\Build\x64\Debug\libcaffe.lib 1>BinplaceCudaDependencies : CPU only build, don't copy cuda dependencies. 2>------ 已启动全部重新生成: 项目: caffe, 配置: Debug x64 ------ 3>------ 已启动全部重新生成: 项目: caffe.managed, 配置: Debug x64 ------ 4>------ 已启动全部重新生成: 项目: convert_cifar_data, 配置: Debug x64 ------ 5>------ 已启动全部重新生成: 项目: classification, 配置: Debug x64 ------ 6>------ 已启动全部重新生成: 项目: convert_mnist_data, 配置: Debug x64 ------ 7>------ 已启动全部重新生成: 项目: convert_mnist_siamese_data, 配置: Debug x64 ------ 8>------ 已启动全部重新生成: 项目: upgrade_net_proto_binary, 配置: Debug x64 ------ 9>------ 已启动全部重新生成: 项目: upgrade_net_proto_text, 配置: Debug x64 ------ 2>caffe.cpp 9>upgrade_net_proto_text.cpp 2>Unknown compiler version - please run the configure tests and report the results 4>convert_cifar_data.cpp 3>Stdafx.cpp 9>Unknown compiler version - please run the configure tests and report the results 5>classification.cpp 6>convert_mnist_data.cpp 7>convert_mnist_siamese_data.cpp 4>Unknown compiler version - please run the configure tests and report the results 5>Unknown compiler version - please run the configure tests and report the results 8>upgrade_net_proto_binary.cpp 6>Unknown compiler version - please run the configure tests and report the results 8>Unknown compiler version - please run the configure tests and report the results 7>Unknown compiler version - please run the configure tests and report the results 3>AssemblyInfo.cpp 3>caffelib.cpp 3>caffelib.cpp(61): error C2976: “std::array”: 模板 参数太少 3>D:\VS2017\VC\Tools\MSVC\14.12.25827\include\utility(474): note: 参见“std::array”的声明 3>caffelib.cpp(62): error C3699: “^”: 不能在类型“std::array”上使用此间接寻址 3>caffelib.cpp(62): note: 编译器将“^”替换为“*”以继续进行分析 3>caffelib.cpp(68): error C2976: “std::array”: 模板 参数太少 3>D:\VS2017\VC\Tools\MSVC\14.12.25827\include\utility(474): note: 参见“std::array”的声明 3>caffelib.cpp(68): error C3699: “^”: 不能在类型“std::array”上使用此间接寻址 3>caffelib.cpp(68): note: 编译器将“^”替换为“*”以继续进行分析 3>caffelib.cpp(69): error C3699: “^”: 不能在类型“std::array”上使用此间接寻址 3>caffelib.cpp(69): note: 编译器将“^”替换为“*”以继续进行分析 3>caffelib.cpp(127): error C2976: “std::array”: 模板 参数太少 3>D:\VS2017\VC\Tools\MSVC\14.12.25827\include\utility(474): note: 参见“std::array”的声明 3>caffelib.cpp(128): error C3699: “^”: 不能在类型“std::array”上使用此间接寻址 3>caffelib.cpp(128): note: 编译器将“^”替换为“*”以继续进行分析 3>caffelib.cpp(136): error C2976: “std::array”: 模板 参数太少 3>D:\VS2017\VC\Tools\MSVC\14.12.25827\include\utility(474): note: 参见“std::array”的声明 3>caffelib.cpp(136): error C3699: “^”: 不能在类型“std::array”上使用此间接寻址 3>caffelib.cpp(136): note: 编译器将“^”替换为“*”以继续进行分析 3>caffelib.cpp(137): error C3699: “^”: 不能在类型“std::array”上使用此间接寻址 3>caffelib.cpp(137): note: 编译器将“^”替换为“*”以继续进行分析 3>caffelib.cpp(64): error C2976: “std::array”: 模板 参数太少 3>D:\VS2017\VC\Tools\MSVC\14.12.25827\include\utility(474): note: 参见“std::array”的声明 3>caffelib.cpp(64): error C2027: 使用了未定义类型“std::array” 3>D:\VS2017\VC\Tools\MSVC\14.12.25827\include\utility(474): note: 参见“std::array”的声明 3>caffelib.cpp(64): error C3536: “outputs”: 初始化之前无法使用 3>caffelib.cpp(64): error C2109: 下标要求数组或指针类型 3>caffelib.cpp(65): error C2440: “return”: 无法从“int”转换为“std::array *” 3>caffelib.cpp(65): note: 从整型转换为指针类型要求 reinterpret_cast、C 样式转换或函数样式转换 3>caffelib.cpp(71): error C3285: for each 语句不能在“std::array *”类型的变量上操作 3>caffelib.cpp(72): error C2065: “name”: 未声明的标识符 3>caffelib.cpp(74): error C2976: “std::array”: 模板 参数太少 3>D:\VS2017\VC\Tools\MSVC\14.12.25827\include\utility(474): note: 参见“std::array”的声明 3>caffelib.cpp(74): error C3699: “^”: 不能在类型“std::array”上使用此间接寻址 3>caffelib.cpp(74): note: 编译器将“^”替换为“*”以继续进行分析 3>caffelib.cpp(74): error C2027: 使用了未定义类型“std::array” 3>D:\VS2017\VC\Tools\MSVC\14.12.25827\include\utility(474): note: 参见“std::array”的声明 3>caffelib.cpp(78): error C2976: “std::array”: 模板 参数太少 3>D:\VS2017\VC\Tools\MSVC\14.12.25827\include\utility(474): note: 参见“std::array”的声明 3>caffelib.cpp(78): error C2027: 使用了未定义类型“std::array” 3>D:\VS2017\VC\Tools\MSVC\14.12.25827\include\utility(474): note: 参见“std::array”的声明 3>caffelib.cpp(78): error C3536: “values”: 初始化之前无法使用 3>caffelib.cpp(78): error C2109: 下标要求数组或指针类型 3>caffelib.cpp(79): error C3536: “outputs”: 初始化之前无法使用 3>caffelib.cpp(79): error C2109: 下标要求数组或指针类型 3>caffelib.cpp(81): error C2440: “return”: 无法从“int”转换为“std::array *” 3>caffelib.cpp(81): note: 从整型转换为指针类型要求 reinterpret_cast、C 样式转换或函数样式转换 3>caffelib.cpp(132): error C2976: “std::array”: 模板 参数太少 3>D:\VS2017\VC\Tools\MSVC\14.12.25827\include\utility(474): note: 参见“std::array”的声明 3>caffelib.cpp(132): error C2027: 使用了未定义类型“std::array” 3>D:\VS2017\VC\Tools\MSVC\14.12.25827\include\utility(474): note: 参见“std::array”的声明 3>caffelib.cpp(132): error C3536: “outputs”: 初始化之前无法使用 3>caffelib.cpp(132): error C2109: 下标要求数组或指针类型 3>caffelib.cpp(133): error C2440: “return”: 无法从“int”转换为“std::array *” 3>caffelib.cpp(133): note: 从整型转换为指针类型要求 reinterpret_cast、C 样式转换或函数样式转换 3>caffelib.cpp(141): error C3285: for each 语句不能在“std::array *”类型的变量上操作 3>caffelib.cpp(142): error C2065: “name”: 未声明的标识符 3>caffelib.cpp(144): error C2976: “std::array”: 模板 参数太少 3>D:\VS2017\VC\Tools\MSVC\14.12.25827\include\utility(474): note: 参见“std::array”的声明 3>caffelib.cpp(144): error C3699: “^”: 不能在类型“std::array”上使用此间接寻址 3>caffelib.cpp(144): note: 编译器将“^”替换为“*”以继续进行分析 3>caffelib.cpp(144): error C2027: 使用了未定义类型“std::array” 3>D:\VS2017\VC\Tools\MSVC\14.12.25827\include\utility(474): note: 参见“std::array”的声明 3>caffelib.cpp(148): error C2976: “std::array”: 模板 参数太少 3>D:\VS2017\VC\Tools\MSVC\14.12.25827\include\utility(474): note: 参见“std::array”的声明 3>caffelib.cpp(148): error C2027: 使用了未定义类型“std::array” 3>D:\VS2017\VC\Tools\MSVC\14.12.25827\include\utility(474): note: 参见“std::array”的声明 3>caffelib.cpp(148): error C3536: “values”: 初始化之前无法使用 3>caffelib.cpp(148): error C2109: 下标要求数组或指针类型 3>caffelib.cpp(149): error C3536: “outputs”: 初始化之前无法使用 3>caffelib.cpp(149): error C2109: 下标要求数组或指针类型 3>caffelib.cpp(151): error C2440: “return”: 无法从“int”转换为“std::array *” 3>caffelib.cpp(151): note: 从整型转换为指针类型要求 reinterpret_cast、C 样式转换或函数样式转换 3>已完成生成项目“caffe.managed.vcxproj”的操作 - 失败。 4>LINK : fatal error LNK1104: 无法打开文件“libboost_thread-vc140-mt-gd-1_59.lib” 10>------ 已启动全部重新生成: 项目: upgrade_solver_proto_text, 配置: Debug x64 ------ 4>已完成生成项目“convert_cifar_data.vcxproj”的操作 - 失败。 6>LINK : fatal error LNK1104: 无法打开文件“libboost_thread-vc140-mt-gd-1_59.lib” 6>已完成生成项目“convert_mnist_data.vcxproj”的操作 - 失败。 10>upgrade_solver_proto_text.cpp 7>LINK : fatal error LNK1104: 无法打开文件“libboost_thread-vc140-mt-gd-1_59.lib” 7>已完成生成项目“convert_mnist_siamese_data.vcxproj”的操作 - 失败。 10>Unknown compiler version - please run the configure tests and report the results 9>LINK : fatal error LNK1104: 无法打开文件“libboost_date_time-vc140-mt-gd-1_59.lib” 9>已完成生成项目“upgrade_net_proto_text.vcxproj”的操作 - 失败。 8>LINK : fatal error LNK1104: 无法打开文件“libboost_date_time-vc140-mt-gd-1_59.lib” 8>已完成生成项目“upgrade_net_proto_binary.vcxproj”的操作 - 失败。 5>LINK : fatal error LNK1104: 无法打开文件“libboost_date_time-vc140-mt-gd-1_59.lib” 5>已完成生成项目“classification.vcxproj”的操作 - 失败。 2>LINK : fatal error LNK1104: 无法打开文件“libboost_date_time-vc140-mt-gd-1_59.lib” 2>已完成生成项目“caffe.vcxproj”的操作 - 失败。 11>------ 已启动全部重新生成: 项目: compute_image_mean, 配置: Debug x64 ------ 12>------ 已启动全部重新生成: 项目: convert_imageset, 配置: Debug x64 ------ 13>------ 已启动全部重新生成: 项目: extract_features, 配置: Debug x64 ------ 14>------ 已启动全部重新生成: 项目: test_all, 配置: Debug x64 ------ 15>------ 已启动全部重新生成: 项目: pycaffe, 配置: Debug x64 ------ 16>------ 已启动全部重新生成: 项目: matcaffe, 配置: Debug x64 ------ 15>Skipping project pycaffe, Python support is not enabled in CommonSettings.props. 16>Skipping project matcaffe, Matlab support is not enabled in CommonSettings.props. 12>convert_imageset.cpp 11>compute_image_mean.cpp 13>extract_features.cpp 14>test_accuracy_layer.cpp 14>test_argmax_layer.cpp 14>test_batch_norm_layer.cpp 14>test_batch_reindex_layer.cpp 14>test_benchmark.cpp 14>test_bias_layer.cpp 14>test_blob.cpp 14>test_caffe_main.cpp 14>Unknown compiler version - please run the configure tests and report the results 13>Unknown compiler version - please run the configure tests and report the results 12>Unknown compiler version - please run the configure tests and report the results 11>Unknown compiler version - please run the configure tests and report the results 14>Unknown compiler version - please run the configure tests and report the results 10>LINK : fatal error LNK1104: 无法打开文件“libboost_date_time-vc140-mt-gd-1_59.lib” 10>已完成生成项目“upgrade_solver_proto_text.vcxproj”的操作 - 失败。 14>Unknown compiler version - please run the configure tests and report the results 14>Unknown compiler version - please run the configure tests and report the results 14>Unknown compiler version - please run the configure tests and report the results 14>Unknown compiler version - please run the configure tests and report the results 14>Unknown compiler version - please run the configure tests and report the results 14>Unknown compiler version - please run the configure tests and report the results 11>LINK : fatal error LNK1104: 无法打开文件“libboost_filesystem-vc140-mt-gd-1_59.lib” 11>已完成生成项目“compute_image_mean.vcxproj”的操作 - 失败。 12>LINK : fatal error LNK1104: 无法打开文件“libboost_filesystem-vc140-mt-gd-1_59.lib” 12>已完成生成项目“convert_imageset.vcxproj”的操作 - 失败。 13>LINK : fatal error LNK1104: 无法打开文件“libboost_filesystem-vc140-mt-gd-1_59.lib” 13>已完成生成项目“extract_features.vcxproj”的操作 - 失败。 14>test_common.cpp 14>test_concat_layer.cpp 14>test_contrastive_loss_layer.cpp 14>test_convolution_layer.cpp 14>test_crop_layer.cpp 14>test_data_layer.cpp 14>Unknown compiler version - please run the configure tests and report the results 14>Unknown compiler version - please run the configure tests and report the results 14>Unknown compiler version - please run the configure tests and report the results 14>Unknown compiler version - please run the configure tests and report the results 14>Unknown compiler version - please run the configure tests and report the results 14>Unknown compiler version - please run the configure tests and report the results 14>test_data_transformer.cpp 14>Unknown compiler version - please run the configure tests and report the results 14>test_db.cpp 14>test_deconvolution_layer.cpp 14>Unknown compiler version - please run the configure tests and report the results 14>test_dummy_data_layer.cpp 14>test_eltwise_layer.cpp 14>Unknown compiler version - please run the configure tests and report the results 14>test_embed_layer.cpp 14>test_euclidean_loss_layer.cpp 14>test_filler.cpp 14>Unknown compiler version - please run the configure tests and report the results 14>Unknown compiler version - please run the configure tests and report the results 14>Unknown compiler version - please run the configure tests and report the results 14>Unknown compiler version - please run the configure tests and report the results 14>Unknown compiler version - please run the configure tests and report the results 14>test_filter_layer.cpp 14>Unknown compiler version - please run the configure tests and report the results 14>test_flatten_layer.cpp 14>test_gradient_based_solver.cpp 14>Unknown compiler version - please run the configure tests and report the results 14>test_hdf5data_layer.cpp 14>test_hdf5_output_layer.cpp 14>test_hinge_loss_layer.cpp 14>Unknown compiler version - please run the configure tests and report the results 14>test_im2col_layer.cpp 14>test_image_data_layer.cpp 14>Unknown compiler version - please run the configure tests and report the results 14>Unknown compiler version - please run the configure tests and report the results 14>Unknown compiler version - please run the configure tests and report the results 14>Unknown compiler version - please run the configure tests and report the results 14>Unknown compiler version - please run the configure tests and report the results 14>test_infogain_loss_layer.cpp 14>Unknown compiler version - please run the configure tests and report the results 14>test_inner_product_layer.cpp 14>Unknown compiler version - please run the configure tests and report the results 14>test_internal_thread.cpp 14>test_io.cpp 14>test_layer_factory.cpp 14>test_lrn_layer.cpp 14>Unknown compiler version - please run the configure tests and report the results 14>test_math_functions.cpp 14>Unknown compiler version - please run the configure tests and report the results 14>Unknown compiler version - please run the configure tests and report the results 14>Unknown compiler version - please run the configure tests and report the results 14>Unknown compiler version - please run the configure tests and report the results 14>test_maxpool_dropout_layers.cpp 14>Unknown compiler version - please run the configure tests and report the results 14>test_memory_data_layer.cpp 14>test_multinomial_logistic_loss_layer.cpp 14>test_mvn_layer.cpp 14>Unknown compiler version - please run the configure tests and report the results 14>Unknown compiler version - please run the configure tests and report the results 14>Unknown compiler version - please run the configure tests and report the results 14>test_net.cpp 14>test_neuron_layer.cpp 14>test_platform.cpp 14>test_pooling_layer.cpp 14>test_power_layer.cpp 14>Unknown compiler version - please run the configure tests and report the results 14>Unknown compiler version - please run the configure tests and report the results 14>Unknown compiler version - please run the configure tests and report the results 14>Unknown compiler version - please run the configure tests and report the results 14>test_protobuf.cpp 14>test_random_number_generator.cpp 14>Unknown compiler version - please run the configure tests and report the results 14>test_reduction_layer.cpp 14>c:\users\kay chow\documents\caffe-master\src\caffe\test\test_net.cpp(1010): error C2220: 警告被视为错误 - 没有生成“object”文件 14>c:\users\kay chow\documents\caffe-master\src\caffe\test\test_net.cpp(992): note: 编译 类 模板 成员函数 "void caffe::NetTest_TestLossWeightMidNet_Test<T>::TestBody(void)" 时 14> with 14> [ 14> T=Type 14> ] 14>c:\users\kay chow\documents\caffe-master\src\gtest\gtest.h(7341): note: 参见对正在编译的 类 模板 实例化 "caffe::NetTest_TestLossWeightMidNet_Test<T>" 的引用 14> with 14> [ 14> T=Type 14> ] (编译源文件 ..\..\src\caffe\test\test_net.cpp) 14>c:\users\kay chow\documents\caffe-master\src\gtest\gtest.h(7327): note: 编译 类 模板 成员函数 "bool testing::internal::TypeParameterizedTest<caffe::NetTest,testing::internal::TemplateSel<caffe::NetTest_TestLossWeightMidNet_Test>,caffe::gtest_type_params_NetTest_>::Register(const char *,const char *,const char *,int)" 时 (编译源文件 ..\..\src\caffe\test\test_net.cpp) 14>c:\users\kay chow\documents\caffe-master\src\caffe\test\test_net.cpp(992): note: 参见对正在编译的函数 模板 实例化“bool testing::internal::TypeParameterizedTest<caffe::NetTest,testing::internal::TemplateSel<caffe::NetTest_TestLossWeightMidNet_Test>,caffe::gtest_type_params_NetTest_>::Register(const char *,const char *,const char *,int)”的引用 14>c:\users\kay chow\documents\caffe-master\src\caffe\test\test_net.cpp(992): note: 参见对正在编译的 类 模板 实例化 "testing::internal::TypeParameterizedTest<caffe::NetTest,testing::internal::TemplateSel<caffe::NetTest_TestLossWeightMidNet_Test>,caffe::gtest_type_params_NetTest_>" 的引用 14>c:\users\kay chow\documents\caffe-master\src\caffe\test\test_net.cpp(1010): warning C4838: 从“double”转换到“Dtype”需要收缩转换 14>c:\users\kay chow\documents\caffe-master\src\caffe\test\test_net.cpp(961): warning C4838: 从“double”转换到“Dtype”需要收缩转换 14>c:\users\kay chow\documents\caffe-master\src\caffe\test\test_net.cpp(941): note: 编译 类 模板 成员函数 "void caffe::NetTest_TestLossWeight_Test<T>::TestBody(void)" 时 14> with 14> [ 14> T=Type 14> ] 14>c:\users\kay chow\documents\caffe-master\src\gtest\gtest.h(7341): note: 参见对正在编译的 类 模板 实例化 "caffe::NetTest_TestLossWeight_Test<T>" 的引用 14> with 14> [ 14> T=Type 14> ] (编译源文件 ..\..\src\caffe\test\test_net.cpp) 14>c:\users\kay chow\documents\caffe-master\src\gtest\gtest.h(7327): note: 编译 类 模板 成员函数 "bool testing::internal::TypeParameterizedTest<caffe::NetTest,testing::internal::TemplateSel<caffe::NetTest_TestLossWeight_Test>,caffe::gtest_type_params_NetTest_>::Register(const char *,const char *,const char *,int)" 时 (编译源文件 ..\..\src\caffe\test\test_net.cpp) 14>c:\users\kay chow\documents\caffe-master\src\caffe\test\test_net.cpp(941): note: 参见对正在编译的函数 模板 实例化“bool testing::internal::TypeParameterizedTest<caffe::NetTest,testing::internal::TemplateSel<caffe::NetTest_TestLossWeight_Test>,caffe::gtest_type_params_NetTest_>::Register(const char *,const char *,const char *,int)”的引用 14>c:\users\kay chow\documents\caffe-master\src\caffe\test\test_net.cpp(941): note: 参见对正在编译的 类 模板 实例化 "testing::internal::TypeParameterizedTest<caffe::NetTest,testing::internal::TemplateSel<caffe::NetTest_TestLossWeight_Test>,caffe::gtest_type_params_NetTest_>" 的引用 14>test_reshape_layer.cpp 14>Unknown compiler version - please run the configure tests and report the results 14>Unknown compiler version - please run the configure tests and report the results 14>Unknown compiler version - please run the configure tests and report the results 14>test_scale_layer.cpp 14>test_sigmoid_cross_entropy_loss_layer.cpp 14>test_slice_layer.cpp 14>test_softmax_layer.cpp 14>Unknown compiler version - please run the configure tests and report the results 14>Unknown compiler version - please run the configure tests and report the results 14>test_softmax_with_loss_layer.cpp 14>Unknown compiler version - please run the configure tests and report the results 14>Unknown compiler version - please run the configure tests and report the results 14>Unknown compiler version - please run the configure tests and report the results 14>test_solver.cpp 14>Unknown compiler version - please run the configure tests and report the results 14>test_solver_factory.cpp 14>test_split_layer.cpp 14>Unknown compiler version - please run the configure tests and report the results 14>test_spp_layer.cpp 14>Unknown compiler version - please run the configure tests and report the results 14>test_stochastic_pooling.cpp 14>test_syncedmem.cpp 14>test_tanh_layer.cpp 14>Unknown compiler version - please run the configure tests and report the results 14>test_threshold_layer.cpp 14>Unknown compiler version - please run the configure tests and report the results 14>Unknown compiler version - please run the configure tests and report the results 14>Unknown compiler version - please run the configure tests and report the results 14>Unknown compiler version - please run the configure tests and report the results 14>test_tile_layer.cpp 14>Unknown compiler version - please run the configure tests and report the results 14>test_upgrade_proto.cpp 14>test_util_blas.cpp 14>gtest-all.cpp 14>Unknown compiler version - please run the configure tests and report the results 14>已完成生成项目“test_all.vcxproj”的操作 - 失败。 ========== 全部重新生成: 成功 3 个,失败 13 个,跳过 0 个 ==========

SSD+caffe遇到double free or corruption问题

编译caffe能通过,不报错 make runtest 时会有double free orcorruption问题 生成lmdb文件时(./data/Voc0712/creat-list.sh)时也会出现double free的问题 *** Error in `/home/ysp/SSD1/caffe/data/VOC0712/../../build/tools/get_image_size': double free or corruption (out): 0x0000000001434160 ***

make mattest出现下面的错误有谁知道是什么原因吗?

编译matcaffe成功后,make mattest出现下面的错误,有谁知道是什么原因吗? ``` Invalid MEX-file '/home/caffe/matlab/+caffe/private/caffe_.mexa64': /usr/local/lib/libopencv_imgcodecs.so.3.4: undefined symbol: _ZN2cv6detail17check_failed_autoEmmRKNS0_12CheckContextE.   Error in caffe.set_mode_cpu (line 5) caffe_('set_mode_cpu');   Error in caffe.run_tests (line 6) caffe.set_mode_cpu(); ubuntu matlab:R2018b opencv:3.4.7 gcc/g++:5.5 ``` 向各位大佬求救啊啊啊,已经困于这个问题很久了

caffe安装过程中boost::未定义问题

各位大神,我在ubuntu16.04中安装caffe,进行到make all的时候报了如下错误: CXX/LD -o .build_release/test/test_all.testbin src/caffe/test/test_caffe_main.cpp .build_release/src/caffe/test/test_benchmark.o:在函数‘void boost::this_thread::sleep<boost::date_time::subsecond_duration<boost::posix_time::time_duration, 1000l> >(boost::date_time::subsecond_duration<boost::posix_time::time_duration, 1000l> const&)’中: test_benchmark.cpp:(.text._ZN5boost11this_thread5sleepINS_9date_time18subsecond_durationINS_10posix_time13time_durationELl1000EEEEEvRKT_[_ZN5boost11this_thread5sleepINS_9date_time18subsecond_durationINS_10posix_time13time_durationELl1000EEEEEvRKT_]+0x25a):对‘boost::this_thread::hidden::sleep_until(timespec const&)’未定义的引用 .build_release/lib/libcaffe.so:对‘boost::thread::start_thread_noexcept()’未定义的引用 .build_release/lib/libcaffe.so:对‘boost::thread::detach()’未定义的引用 .build_release/lib/libcaffe.so:对‘boost::detail::thread_data_base::~thread_data_base()’未定义的引用 .build_release/lib/libcaffe.so:对‘boost::thread::native_handle()’未定义的引用 .build_release/lib/libcaffe.so:对‘boost::thread::interrupt()’未定义的引用 .build_release/lib/libcaffe.so:对‘boost::this_thread::interruption_point()’未定义的引用 .build_release/lib/libcaffe.so:对‘boost::detail::set_tss_data(void const*, boost::shared_ptr<boost::detail::tss_cleanup_function>, void*, bool)’未定义的引用 .build_release/lib/libcaffe.so:对‘boost::thread::interruption_requested() const’未定义的引用 .build_release/lib/libcaffe.so:对‘vtable for boost::detail::thread_data_base’未定义的引用 .build_release/lib/libcaffe.so:对‘boost::detail::get_current_thread_data()’未定义的引用 .build_release/lib/libcaffe.so:对‘boost::thread::joinable() const’未定义的引用 .build_release/lib/libcaffe.so:对‘typeinfo for boost::detail::thread_data_base’未定义的引用 .build_release/lib/libcaffe.so:对‘boost::detail::get_tss_data(void const*)’未定义的引用 .build_release/lib/libcaffe.so:对‘boost::thread::join_noexcept()’未定义的引用 collect2: error: ld returned 1 exit status Makefile:603: recipe for target '.build_release/test/test_all.testbin' failed make: *** [.build_release/test/test_all.testbin] Error 1 一直没有找到有效的解决办法.麻烦遇到过的朋友指点迷津.定重谢!

ubantu在IDE中运行caffe-ssd报错, invalid pointer 但是使用终端可以运行

环境:ubantu 16.04 caffe-ssd cuda 8 cudnn 5.1 python 2.7 无论是在终端还是在IDE中都可以make 编译通过,运行时报错。笔者认为是程序的版本问题,所依赖的库不一样。google了多次终于在终端不报错了。原因是没有环境变量, 在在环境变量中添加上一句: export LD_PRELOAD="/usr/lib/libtcmalloc_minimal.so.4" 终端便可以运行 但是使用IDE是还是报一模一样的错误。。。求助!!!!!! 问题错误报告如下: *** Error in `/home/zsy/DeepLearning/caffe-ssd/cmake-build-debug/tools/caffe-d': free(): invalid pointer: 0x00000000012c32c0 *** ======= Backtrace: ========= /lib/x86_64-linux-gnu/libc.so.6(+0x777e5)[0x7fb47c36a7e5] /lib/x86_64-linux-gnu/libc.so.6(+0x8037a)[0x7fb47c37337a] /lib/x86_64-linux-gnu/libc.so.6(cfree+0x4c)[0x7fb47c37753c] /usr/lib/x86_64-linux-gnu/libprotobuf.so.9(_ZN6google8protobuf8internal28DestroyDefaultRepeatedFieldsEv+0x1f)[0x7fb47d6e38af] /usr/lib/x86_64-linux-gnu/libprotobuf.so.9(_ZN6google8protobuf23ShutdownProtobufLibraryEv+0x8b)[0x7fb47d6e2b3b] /usr/lib/x86_64-linux-gnu/libmirprotobuf.so.3(+0x233b9)[0x7fb457b6b3b9] /lib64/ld-linux-x86-64.so.2(+0x10de7)[0x7fb47eeb2de7] /lib/x86_64-linux-gnu/libc.so.6(+0x39ff8)[0x7fb47c32cff8] /lib/x86_64-linux-gnu/libc.so.6(+0x3a045)[0x7fb47c32d045] /lib/x86_64-linux-gnu/libc.so.6(__libc_start_main+0xf7)[0x7fb47c313837] /home/zsy/DeepLearning/caffe-ssd/cmake-build-debug/tools/caffe-d(_start+0x29)[0x435439] ======= Memory map: ======== 00400000-0045b000 r-xp 00000000 08:13 12717978 /home/zsy/DeepLearning/caffe-ssd/cmake-build-debug/tools/caffe-d 0065a000-0065b000 r--p 0005a000 08:13 12717978 /home/zsy/DeepLearning/caffe-ssd/cmake-build-debug/tools/caffe-d 0065b000-0065c000 rw-p 0005b000 08:13 12717978 /home/zsy/DeepLearning/caffe-ssd/cmake-build-debug/tools/caffe-d 012b1000-0149a000 rw-p 00000000 00:00 0 [heap] 7fb44c000000-7fb44c021000 rw-p 00000000 00:00 0 7fb44c021000-7fb450000000 ---p 00000000 00:00 0 7fb453368000-7fb453369000 ---p 00000000 00:00 0 7fb453369000-7fb453b69000 rwxp 00000000 00:00 0 7fb453b69000-7fb453b6c000 r-xp 00000000 08:12 267232 /lib/x86_64-linux-gnu/libkeyutils.so.1.5 7fb453b6c000-7fb453d6b000 ---p 00003000 08:12 267232 /lib/x86_64-linux-gnu/libkeyutils.so.1.5 7fb453d6b000-7fb453d6c000 r--p 00002000 08:12 267232 /lib/x86_64-linux-gnu/libkeyutils.so.1.5 7fb453d6c000-7fb453d6d000 rw-p 00003000 08:12 267232 /lib/x86_64-linux-gnu/libkeyutils.so.1.5 7fb453d6d000-7fb453d77000 r-xp 00000000 08:12 1058069 /usr/lib/x86_64-linux-gnu/libkrb5support.so.0.1 7fb453d77000-7fb453f76000 ---p 0000a000 08:12 1058069 /usr/lib/x86_64-linux-gnu/libkrb5support.so.0.1 7fb453f76000-7fb453f77000 r--p 00009000 08:12 1058069 /usr/lib/x86_64-linux-gnu/libkrb5support.so.0.1 7fb453f77000-7fb453f78000 rw-p 0000a000 08:12 1058069 /usr/lib/x86_64-linux-gnu/libkrb5support.so.0.1 7fb453f78000-7fb453f7b000 r-xp 00000000 08:12 267180 /lib/x86_64-linux-gnu/libcom_err.so.2.1 7fb453f7b000-7fb45417a000 ---p 00003000 08:12 267180 /lib/x86_64-linux-gnu/libcom_err.so.2.1 7fb45417a000-7fb45417b000 r--p 00002000 08:12 267180 /lib/x86_64-linux-gnu/libcom_err.so.2.1 7fb45417b000-7fb45417c000 rw-p 00003000 08:12 267180 /lib/x86_64-linux-gnu/libcom_err.so.2.1 7fb45417c000-7fb4541a8000 r-xp 00000000 08:12 1058059 /usr/lib/x86_64-linux-gnu/libk5crypto.so.3.1 7fb4541a8000-7fb4543a7000 ---p 0002c000 08:12 1058059 /usr/lib/x86_64-linux-gnu/libk5crypto.so.3.1 7fb4543a7000-7fb4543a9000 r--p 0002b000 08:12 1058059 /usr/lib/x86_64-linux86_64-linux-gnu/libgme.so.0.6.0 7fb459f8e000-7fb45a18e000 ---p 0004a000 08:12 1052793 /usr/lib/x86_64-linux-gnu/libgme.so.0.6.0 7fb45a18e000-7fb45a191000 r--p 0004a000 08:12 1052793 /usr/lib/x86_64-linux-gnu/libgme.so.0.6.0 7fb45a191000-7fb45a192000 rw-p 0004d000 08:12 1052793 /usr/lib/x86_64-linux-gnu/libgme.so.0.6.0 7fb45a192000-7fb45a1dc000 r-xp 00000000 08:12 1052795 /usr/lib/x86_64-linux-gnu/libmodplug.so.1.0.0 7fb45a1dc000-7fb45a3dc000 ---p 0004a000 08:12 1052795 /usr/lib/x86_64-linux-gnu/libmodplug.so.1.0.0 7fb45a3dc000-7fb45a3dd000 r--p 0004a000 08:12 1052795 /usr/lib/x86_64-linux-gnu/libmodplug.so.1.0.0 7fb45a3dd000-7fb45a3de000 rw-p 0004b000 08:12 1052795 /usr/lib/x86_64-linux-gnu/libmodplug.so.1.0.0 7fb45a3de000-7fb45a51d000 rw-p 00000000 00:00 0 7fb45a51d000-7fb45a538000 r-xp 00000000 08:12 1058384 /usr/lib/x86_64-linux-gnu/librtmp.so.1 7fb45a538000-7fb45a737000 ---p 0001b000 08:12 1058384 /usr/lib/x86_64-linux-gnu/librtmp.so.1 7fb45a737000-7fb45a738000 r--p 0001a000 08:12 1058384 /usr/lib/x86_64-linux-gnu/librtmp.so.1 7fb45a738000-7fb45a739000 rw-p 0001b000 08:12 1058384 /usr/lib/x86_64-linux-gnu/librtmp.so.1 7fb45a739000-7fb45a781000 r-xp 00000000 08:12 1052797 /usr/lib/x86_64-linux-gnu/libssh-gcrypt.so.4.4.1 7fb45a781000-7fb45a980000 ---p 00048000 08:12 1052797 /usr/lib/x86_64-linux-gnu/libssh-gcrypt.so.4.4.1 7fb45a980000-7fb45a981000 r--p 00047000 08:12 1052797 /usr/lib/x86_64-linux-gnu/libssh-gcrypt.so.4.4.1 7fb45a981000-7fb45a982000 rw-p 00048000 08:12 1052797 /usr/lib/x86_64-linux-gnu/libssh-gcrypt.so.4.4.1 7fb45a982000-7fb45a99c000 r-xp 00000000 08:12 1052753 /usr/lib/x86_64-linux-gnu/libcrystalhd.so.3.6 7fb45a99c000-7fb45ab9b000 ---p 0001a000 08:12 1052753 /usr/lib/x86_64-linux-gnu/libcrystalhd.so.3.6 7fb45ab9b000-7fb45ab9c000 r--p 00019000 08:12 1052753 /usr/lib/x86_64-linux-gnu/libcrystalhd.so.3.6 7fb45ab9c000-7fb45ab9d000 rw-p 0001a000 08:12 1052753 /usr/lib/x86_64-linux-gnu/libcrystalhd.so.3.6 7fb45ab9d000-7fb45abaa000 r-xp 00000000 08:12 1052755 /usr/lib/x86_64-linux-gnu/libgsm.so.1.0.12 7fb45abaa000-7fb45ada9000 ---p 0000d000 08:12 1052755 /usr/lib/x86_64-linux-gnu/libgsm.so.1.0.12 7fb45ada9000-7fb45adaa000 r--p 0000c000 08:12 1052755 /usr/lib/x86_64-linux-gnu/libgsm.so.1.0.12 7fb45adaa000-7fb45adab000 rw-p 0000d000 08:12 1052755 /usr/lib/x86_64-linux-gnu/libgsm.so.1.0.12 7fb45adab000-7fb45adf0000 r-xp 00000000 08:12 1052757 /usr/lib/x86_64-linux-gnu/libmp3lame.so.0.0.0 7fb45adf0000-7fb45aff0000 ---p 00045000 08:12 1052757 /usr/lib/x86_64-linux-gnu/libmp3lame.so.0.0.0 7fb45aff0000-7fb45aff1000 r--p 00045000 08:12 1052757 /usr/lib/x86_64-linux-gnu/libmp3lame.so.0.0.0 7fb45aff1000-7fb45aff2000 rw-p 00046000 08:12 1052757 /usr/lib/x86_64-linux-gnu/libmp3lame.so.0.0.0 7fb45aff2000-7fb45b020000 rw-p 00000000 00:00 0 7fb45b020000-7fb45b042000 r-xp 00000000 08:12 1052760 /usr/lib/x86_64-linux-gnu/libopenjpeg.so.1.5.2 7fb45b042000-7fb45b241000 ---p 00022000 08:12 1052760 /usr/lib/x86_64-linux-gnu/libopenjpeg.so.1.5.2 7fb45b241000-7fb45b242000 r--p 00021000 08:12 1052760 /usr/lib/x86_64-linux-gnu/libopenjpeg.so.1.5.2 7fb45b242000-7fb45b243000 rw-p 00022000 08:12 1052760 /usr/lib/x86_64-linux-gnu/libopenjpeg.so.1.5.2 7fb45b243000-7fb45b28c000 r-xp 00000000 08:12 1058240 /usr/lib/x86_64-linux-gnu/libopus.so.0.5.2 7fb45b28c000-7fb45b48b000 ---p 00049000 08:12 1058240 /usr/lib/x86_64-linux-gnu/libopus.so.0.5.2 7fb45b48b000-7fb45b48c000 r--p 00048000 08:12 1058240 /usr/lib/x86_64-linux-gnu/libopus.so.0.5.2 7fb45b48c000-7fb45b48d000 rw-p 00049000 08:12 1058240 /usr/lib/x86_64-linux-gnu/libopus.so.0.5.2 7fb45b48d000-7fb45b55e000 r-xp 00000000 08:12 1052763 /usr/lib/x86_64-linux-gnu/libschroedinger-1.0.so.0.11.0 7fb45b55e000-7fb45b75e000 ---p 000d1000 08:12 1052763 /usr/lib/x86_64-linux-gnu/libschroedinger-1.0.so.0.11.0 7fb45b75e000-7fb45b760000 r--p 000d1000 08:12 1052763 /usr/lib/x86_64-linux-gnu/libschroedinger-1.0.so.0.11.0 7fb45b760000-7fb45b761000 rw-p 000d3000 08:12 1052763 /usr/lib/x86_64-linux-gnu/libschroedinger-1.0.so.0.11.0 7fb45b761000-7fb45b762000 rw-p 00000000 00:00 0 7fb45b762000-7fb45b76e000 r-xp 00000000 08:12 1052767 /usr/lib/x86_64-linux-gnu/libshine.so.3.0.1 7fb45b76e000-7fb45b96d000 ---p 0000c000 08:12 1052767 /usr/lib/x86_64-linux-gnu/libshine.so.3.0.1 7fb45b96d000-7fb45b96e000 r--p 0000b000 08:12 1052767 /usr/lib/x86_64-linux-gnu/libshine.so.3.0.1 7fb45b96e000-7fb45b96f000 rw-p 0000c000 08:12 1052767 /usr/lib/x86_64-linux-gnu/libshine.so.3.0.1 7fb45b96f000-7fb45b986000 r-xp 00000000 08:12 1058458 /usr/lib/x86_64-linux-gnu/libspeex.so.1.5.0 7fb45b986000-7fb45bb86000 ---p 00017000 08:12 1058458 /usr/lib/x86_64-linux-gnu/libspeex.so.1.5.0 7fb45bb86000-7fb45bb87000 r--p 00017000 08:12 1058458 /usr/lib/x86_64-linux-gnu/libspeex.so.1.5.0 7fb45bb87000-7fb45bb88000 rw-p 00018000 08:12 1058458 /usr/lib/x86_64-linux-gnu/libspeex.so.1.5.0 7fb45bb88000-7fb45bba1000 r-xp 00000000 08:12 1058497 /usr/lib/x86_64-linux-gnu/libtheoradec.so.1.1.4 7fb45bba1000-7fb45bda0000 ---p 00019000 08:12 1058497 /usr/lib/x86_64-linux-gnu/libtheoradec.so.1.1.4 7fb45bda0000-7fb45bda1000 r--p 00018000 08:12 1058497 /usr/lib/x86_64-linux-gnu/libtheoradec.so.1.1.4 7fb45bda1000-7fb45bda2000 rw-p 00019000 08:12 1058497 /usr/lib/x86_64-linux-gnu/libtheoradec.so.1.1.4 7fb45bda2000-7fb45bde0000 r-xp 00000000 08:12 1058499 /usr/lib/x86_64-linux-gnu/libtheoraenc.so.1.1.2 7fb45bde0000-7fb45bfdf000 ---p 0003e000 08:12 1058499 /usr/lib/x86_64-linux-gnu/libtheoraenc.so.1.1.2 7fb45bfdf000-7fb45bfe0000 r--p 0003d000 08:12 1058499 /usr/lib/x86_64-linux-gnu/libtheoraenc.so.1.1.2 7fb45bfe0000-7fb45bfe1000 rw-p 0003e000 08:12 1058499 /usr/lib/x86_64-linux-gnu/libtheoraenc.so.1.1.2 7fb45bfe1000-7fb45bfff000 r-xp 00000000 08:12 1052775 /usr/lib/x86_64-linux-gnu/libtwolame.so.0.0.0 7fb45bfff000-7fb45c1fe000 ---p 0001e000 08:12 1052775 /usr/lib/x86_64-linux-gnu/libtwolame.so.0.0.0 7fb45c1fe000-7fb45c1ff000 r--p 0001d000 08:12 1052775 /usr/lib/x86_64-linux-gnu/libtwolame.so.0.0.0 7fb45c1ff000-7fb45c200000 rw-p 0001e000 08:12 1052775 /usr/lib/x86_64-linux-gnu/libtwolame.so.0.0.0 7fb45c200000-7fb45c204000 rw-p 00000000 00:00 0 7fb45c204000-7fb45c22e000 r-xp 00000000 08:12 1052328 /usr/lib/x86_64-linux-gnu/libvorbis.so.0.4.8 7fb45c22e000-7fb45c42d000 ---p 0002a000 08:12 1052328 /usr/lib/x86_64-linux-gnu/libvorbis.so.0.4.8 7fb45c42d000-7fb45c42e000 r--p 00029000 08:12 1052328 /usr/lib/x86_64-linux-gnu/libvorbis.so.0.4.8 7fb45c42e000-7fb45c42f000 rw-p 0002a000 08:12 1052328 /usr/lib/x86_64-linux-gnu/libvorbis.so.0.4.8 7fb45c42f000-7fb45c4bc000 r-xp 00000000 08:12 1052326 /usr/lib/x86_64-linux-gnu/libvorbisenc.so.2.0.11 7fb45c4bc000-7fb45c6bb000 ---p 0008d000 08:12 1052326 /usr/lib/x86_64-linux-gnu/libvorbisenc.so.2.0.11 7fb45c6bb000-7fb45c6d7000 r--p 0008c000 08:12 1052326 /usr/lib/x86_64-linux-gnu/libvorbisenc.so.2.0.11 7fb45c6d7000-7fb45c6d8000 rw-p 000a8000 08:12 1052326 /usr/lib/x86_64-linux-gnu/libvorbisenc.so.2.0.11 7fb45c6d8000-7fb45c8f7000 r-xp 00000000 08:12 1058603 /usr/lib/x86_64-linux-gnu/libvpx.so.3.0.0 7fb45c8f7000-7fb45caf6000 ---p 0021f000 08:12 1058603 /usr/lib/x86_64-linux-gnu/libvpx.so.3.0.0 7fb45caf6000-7fb45caf8000 r--p 0021e000 08:12 1058603 /usr/lib/x86_64-linux-gnu/libvpx.so.3.0.0 7fb45caf8000-7fb45caf9000 rw-p 00220000 08:12 1058603 /usr/lib/x86_64-linux-gnu/libvpx.so.3.0.0 7fb45caf9000-7fb45cafc000 rw-p 00000000 00:00 0 7fb45cafc000-7fb45cb24000 r-xp 00000000 08:12 1052330 /usr/lib/x86_64-linux-gnu/libwavpack.so.1.1.7 7fb45cb24000-7fb45cd23000 ---p 00028000 08:12 1052330 /usr/lib/x86_64-linux-gnu/libwavpack.so.1.1.7 7fb45cd23000-7fb45cd24000 r--p 00027000 08:12 1052330 /usr/lib/x86_64-linux-gnu/libwavpack.so.1.1.7 7fb45cd24000-7fb45cd25000 rw-p 00028000 08:12 1052330 /usr/lib/x86_64-linux-gnu/libwavpack.so.1.1.7 7fb45cd25000-7fb45cd7e000 r-xp 00000000 08:12 1058623 /usr/lib/x86_64-linux-gnu/libwebp.so.5.0.4 7fb45cd7e000-7fb45cf7e000 ---p 00059000 08:12 1058623 /usr/lib/x86_64-linux-gnu/libwebp.so.5.0.4 7fb45cf7e000-7fb45cf7f000 r--p 00059000 08:12 1058623 /usr/lib/x86_64-linux-gnu/libwebp.so.5.0.4 7fb45cf7f000-7fb45cf81000 rw-p 0005a000 08:12 1058623 /usr/lib/x86_64-linux-gnu/libwebp.so.5.0.4 7fb45cf81000-7fb45d0a9000 r-xp 00000000 08:12 1052781 /usr/lib/x86_64-linux-gnu/libx264.so.148 7fb45d0a9000-7fb45d2a8000 ---p 00128000 08:12 1052781 /usr/lib/x86_64-linux-gnu/libx264.so.148 7fb45d2a8000-7fb45d2a9000 r--p 00127000 08:12 1052781 /usr/lib/x86_64-linux-gnu/libx264.so.148 7fb45f9f5000-7fb45fa99000 r-xp 00000000 08:12 1057741 /usr/lib/x86_64-linux-gnu/libfreetype.so.6.12.1 7fb45fa99000-7fb45fc98000 ---p 000a4000 08:12 1057741 /usr/lib/x86_64-linux-gnu/libfreetype.so.6.12.1 7fb45fc98000-7fb45fc9e000 r--p 000a3000 08:12 1057741 /usr/lib/x86_64-linux-gnu/libfreetype.so.6.12.1 7fb45fc9e000-7fb45fc9f000 rw-p 000a9000 08:12 1057741 /usr/lib/x86_64-linux-gnu/libfreetype.so.6.12.1 7fb45fc9f000-7fb45fd3e000 r-xp 00000000 08:12 1058292 /usr/lib/x86_64-linux-gnu/libpixman-1.so.0.33.6 7fb45fd3e000-7fb45ff3e000 ---p 0009f000 08:12 1058292 /usr/lib/x86_64-linux-gnu/libpixman-1.so.0.33.6 7fb45ff3e000-7fb45ff46000 r--p 0009f000 08:12 1058292 /usr/lib/x86_64-linux-gnu/libpixman-1.so.0.33.6 7fb45ff46000-7fb45ff47000 rw-p 000a7000 08:12 1058292 /usr/lib/x86_64-linux-gnu/libpixman-1.so.0.33.6 7fb45ff47000-7fb45ff58000 r-xp 00000000 08:12 1057316 /usr/lib/x86_64-linux-gnu/libXext.so.6.4.0 7fb45ff58000-7fb460157000 ---p 00011000 08:12 1057316 /usr/lib/x86_64-linux-gnu/libXext.so.6.4.0 7fb460157000-7fb460158000 r--p 00010000 08:12 1057316 /usr/lib/x86_64-linux-gnu/libXext.so.6.4.0 7fb460158000-7fb460159000 rw-p 00011000 08:12 1057316 /usr/lib/x86_64-linux-gnu/libXext.so.6.4.0 7fb460159000-7fb4601f9000 r-xp 00000000 08:12 1057754 /usr/lib/x86_64-linux-gnu/libmirclient.so.9 7fb4601f9000-7fb4603f8000 ---p 000a0000 08:12 1057754 /usr/lib/x86_64-linux-gnu/libmirclient.so.9 7fb4603f8000-7fb4603fe000 r--p 0009f000 08:12 1057754 /usr/lib/x86_64-linux-gnu/libmirclient.so.9 7fb4603fe000-7fb460400000 rw-p 000a5000 08:12 1057754 /usr/lib/x86_64-linux-gnu/libmirclient.so.9 7fb460400000-7fb46040c000 r-xp 00000000 08:12 1072790 /usr/lib/x86_64-linux-gnu/libwayland-client.so.0.3.0 7fb46040c000-7fb46060c000 ---p 0000c000 08:12 1072790 /usr/lib/x86_64-linux-gnu/libwayland-client.so.0.3.0 7fb46060c000-7fb46060e000 r--p 0000c000 08:12 1072790 /usr/lib/x86_64-linux-gnu/libwayland-client.so.0.3.0 7fb46060e000-7fb46060f000 rw-p 0000e000 08:12 1072790 /usr/lib/x86_64-linux-gnu/libwayland-client.so.0.3.0 7fb46060f000-7fb460610000 r-xp 00000000 08:12 1072787 /usr/lib/x86_64-linux-gnu/libwayland-egl.so.1.0.0 7fb460610000-7fb46080f000 ---p 00001000 08:12 1072787 /usr/lib/x86_64-linux-gnu/libwayland-egl.so.1.0.0 7fb46080f000-7fb460810000 r--p 00000000 08:12 1072787 /usr/lib/x86_64-linux-gnu/libwayland-egl.so.1.0.0 7fb460810000-7fb460811000 rw-p 00001000 08:12 1072787 /usr/lib/x86_64-linux-gnu/libwayland-egl.so.1.0.0 7fb460811000-7fb460815000 r-xp 00000000 08:12 1072815 /usr/lib/x86_64-linux-gnu/libwayland-cursor.so.0.0.0 7fb460815000-7fb460a14000 ---p 00004000 08:12 1072815 /usr/lib/x86_64-linux-gnu/libwayland-cursor.so.0.0.0 7fb460a14000-7fb460a15000 r--p 00003000 08:12 1072815 /usr/lib/x86_64-linux-gnu/libwayland-cursor.so.0.0.0 7fb460a15000-7fb460a19000 rw-p 00004000 08:12 1072815 /usr/lib/x86_64-linux-gnu/libwayland-cursor.so.0.0.0 7fb460a19000-7fb460a56000 r-xp 00000000 08:12 1058725 /usr/lib/x86_64-linux-gnu/libxkbcommon.so.0.0.0 7fb460a56000-7fb460c55000 ---p 0003d000 08:12 1058725 /usr/lib/x86_64-linux-gnu/libxkbcommon.so.0.0.0 7fb460c55000-7fb460c57000 r--p 0003c000 08:12 1058725 /usr/lib/x86_64-linux-gnu/libxkbcommon.so.0.0.0 7fb460c57000-7fb460c58000 rw-p 0003e000 08:12 1058725 /usr/lib/x86_64-linux-gnu/libxkbcommon.so.0.0.0 7fb460c58000-7fb460c5a000 r-xp 00000000 08:12 1057312 /usr/lib/x86_64-linux-gnu/libXdamage.so.1.1.0 7fb460c5a000-7fb460e59000 ---p 00002000 08:12 1057312 /usr/lib/x86_64-linux-gnu/libXdamage.so.1.1.0 7fb460e59000-7fb460e5a000 r--p 00001000 08:12 1057312 /usr/lib/x86_64-linux-gnu/libXdamage.so.1.1.0 7fb460e5a000-7fb460e5b000 rw-p 00002000 08:12 1057312 /usr/lib/x86_64-linux-gnu/libXdamage.so.1.1.0 7fb460e5b000-7fb460e5d000 r-xp 00000000 08:12 1057308 /usr/lib/x86_64-linux-gnu/libXcomposite.so.1.0.0 7fb460e5d000-7fb46105c000 ---p 00002000 08:12 1057308 /usr/lib/x86_64-linux-gnu/libXcomposite.so.1.0.0 7fb46105c000-7fb46105d000 r--p 00001000 08:12 1057308 /usr/lib/x86_64-linux-gnu/libXcomposite.so.1.0.0 7fb46105d000-7fb46105e000 rw-p 00002000 08:12 1057308 /usr/lib/x86_64-linux-gnu/libXcomposite.so.1.0.0 7fb46105e000-7fb461067000 r-xp 00000000 08:12 1049155 /usr/lib/x86_64-linux-gnu/libXcursor.so.1.0.2 7fb461067000-7fb461266000 ---p 00009000 08:12 1049155 /usr/lib/x86_64-linux-gnu/libXcursor.so.1.0.2 7fb461266000-7fb461267000 r--p 00008000 08:12 1049155 /usr/lib/x86_64-linux-gnu/libXcursor.so.1.0.2 7fb461267000-7fb461268000 rw-p 00009000 08:12 1049155 /usr/lib/x86_64-linux-gnu/libXcursor.so.1.0.2 7fb461268000-7fb461272000 r-xp 00000000 08:12 1057336 /usr/lib/x86_64-linux-gnu/libXrandr.so.2.2.0 7fb461272000-7fb461471000 ---p 0000a000 08:12 1057336 /usr/lib/x86_64-linux-gnu/libXrandr.so.2.2.0 7fb461471000-7fb461472000 r--p 00009000 08:12 1057336 /usr/lib/x86_64-linux-gnu/libXrandr.so.2.2.0 7fb461472000-7fb461473000 rw-p 0000a000 08:12 1057336 /usr/lib/x86_64-linux-gnu/libXrandr.so.2.2.0 7fb461473000-7fb461475000 r-xp 00000000 08:12 1057328 /usr/lib/x86_64-linux-gnu/libXinerama.so.1.0.0 7fb461475000-7fb461674000 ---p 00002000 08:12 1057328 /usr/lib/x86_64-linux-gnu/libXinerama.so.1.0.0 7fb461674000-7fb461675000 r--p 00001000 08:12 1057328 /usr/lib/x86_64-linux-gnu/libXinerama.so.1.0.0 7fb461675000-7fb461676000 rw-p 00002000 08:12 1057328 /usr/lib/x86_64-linux-gnu/libXinerama.so.1.0.0 7fb461676000-7fb4617f6000 r-xp 00000000 08:12 1048814 /usr/lib/x86_64-linux-gnu/libgio-2.0.so.0.4800.2 7fb4617f6000-7fb4619f6000 ---p 00180000 08:12 1048814 /usr/lib/x86_64-linux-gnu/libgio-2.0.so.0.4800.2 7fb4619f6000-7fb4619fa000 r--p 00180000 08:12 1048814 /usr/lib/x86_64-linux-gnu/libgio-2.0.so.0.4800.2 7fb4619fa000-7fb4619fc000 rw-p 00184000 08:12 1048814 /usr/lib/x86_64-linux-gnu/libgio-2.0.so.0.4800.2 7fb4619fc000-7fb4619fe000 rw-p 00000000 00:00 0 7fb4619fe000-7fb461a3b000 r-xp 00000000 08:12 1057707 /usr/lib/x86_64-linux-gnu/libfontconfig.so.1.9.0 7fb461a3b000-7fb461c3a000 ---p 0003d000 08:12 1057707 /usr/lib/x86_64-linux-gnu/libfontconfig.so.1.9.0 7fb461c3a000-7fb461c3c000 r--p 0003c000 08:12 1057707 /usr/lib/x86_64-linux-gnu/libfontconfig.so.1.9.0 7fb461c3c000-7fb461c41000 rw-p 0003e000 08:12 1057707 /usr/lib/x86_64-linux-gnu/libfontconfig.so.1.9.0 7fb461c41000-7fb461c8a000 r-xp 00000000 08:12 1058262 /usr/lib/x86_64-linux-gnu/libpango-1.0.so.0.3800.1 7fb461c8a000-7fb461e8a000 ---p 00049000 08:12 1058262 /usr/lib/x86_64-linux-gnu/libpango-1.0.so.0.3800.1 7fb461e8a000-7fb461e8c000 r--p 00049000 08:12 1058262 /usr/lib/x86_64-linux-gnu/libpango-1.0.so.0.3800.1 7fb461e8c000-7fb461e8d000 rw-p 0004b000 08:12 1058262 /usr/lib/x86_64-linux-gnu/libpango-1.0.so.0.3800.1 7fb461e8d000-7fb461ea1000 r-xp 00000000 08:12 1058266 /usr/lib/x86_64-linux-gnu/libpangoft2-1.0.so.0.3800.1 7fb461ea1000-7fb4620a1000 ---p 00014000 08:12 1058266 /usr/lib/x86_64-linux-gnu/libpangoft2-1.0.so.0.3800.1 7fb4620a1000-7fb4620a2000 r--p 00014000 08:12 1058266 /usr/lib/x86_64-linux-gnu/libpangoft2-1.0.so.0.3800.1 7fb4620a2000-7fb4620a3000 rw-p 00015000 08:12 1058266 /usr/lib/x86_64-linux-gnu/libpangoft2-1.0.so.0.3800.1 7fb4620a3000-7fb46218a000 r-xp 00000000 08:12 1057657 /usr/lib/x86_64-linux-gnu/libepoxy.so.0.0.0 7fb46218a000-7fb46238a000 ---p 000e7000 08:12 1057657 /usr/lib/x86_64-linux-gnu/libepoxy.so.0.0.0 7fb46238a000-7fb462391000 r--p 000e7000 08:12 1057657 /usr/lib/x86_64-linux-gnu/libepoxy.so.0.0.0 7fb462391000-7fb462398000 rw-p 000ee000 08:12 1057657 /usr/lib/x86_64-linux-gnu/libepoxy.so.0.0.0 7fb462398000-7fb4623c5000 r-xp 00000000 08:12 1057411 /usr/lib/x86_64-linux-gnu/libatk-bridge-2.0.so.0.0.0 7fb4623c5000-7fb4625c4000 ---p 0002d000 08:12 1057411 /usr/lib/x86_64-linux-gnu/libatk-bridge-2.0.so.0.0.0 7fb4625c4000-7fb4625c5000 r--p 0002c000 08:12 1057411 /usr/lib/x86_64-linux-gnu/libatk-bridge-2.0.so.0.0.0 7fb4625c5000-7fb4625c7000 rw-p 0002d000 08:12 1057411 /usr/lib/x86_64-linux-gnu/libatk-bridge-2.0.so.0.0.0 7fb4625c7000-7fb4625e9000 r-xp 00000000 08:12 1057409 /usr/lib/x86_64-linux-gnu/libatk-1.0.so.0.21809.1 7fb4625e9000-7fb4627e8000 ---p 00022000 08:12 1057409 /usr/lib/x86_64-linux-gnu/libatk-1.0.so.0.21809.1 7fb4627e8000-7fb4627eb000 r--p 00021000 08:12 1057409 /usr/lib/x86_64-linux-gnu/libatk-1.0.so.0.21809.1 7fb4627eb000-7fb4627ec000 rw-p 00024000 08:12 1057409 /usr/lib/x86_64-linux-gnu/libatk-1.0.so.0.21809.1 7fb4627ec000-7fb4627f2000 r-xp 00000000 08:12 1057464 /usr/lib/x86_64-linux-gnu/libcairo-gobject.so.2.11400.6 7fb4627f2000-7fb4629f2000 ---p 00006000 08:12 1057464 /usr/lib/x86_64-linux-gnu/libcairo-gobject.so.2.11400.6 7fb4629f2000-7fb4629f4000 r--p 00006000 08:12 1057464 /usr/lib/x86_64-linux-gnu/libcairo-gobject.so.2.11400.6 7fb4629f4000-7fb4629f5000 rw-p 00008000 08:12 1057464 /usr/lib/x86_64-linux-gnu/libcairo-gobject.so.2.11400.6 7fb4629f5000-7fb4629fa000 r-xp 00000000 08:12 1057318 /usr/lib/x86_64-linux-gnu/libXfixes.so.3.1.0 7fb4629fa000-7fb462bf9000 ---p 00005000 08:12 1057318 /usr/lib/x86_64-linux-gnu/libXfixes.so.3.1.0 7fb462bf9000-7fb462bfa000 r--p 00004000 08:12 1057318 /usr/lib/x86_64-linux-gnu/libXfixes.so.3.1.0 7fb462bfa000-7fb462bfb000 rw-p 00005000 08:12 1057318 /usr/lib/x86_64-linux-gnu/libXfixes.so.3.1.0 7fb462bfb000-7fb462c0a000 r-xp 00000000 08:12 1057326 /usr/lib/x86_64-linux-gnu/libXi.so.6.1.0 7fb462c0a000-7fb462e09000 ---p 0000f000 08:12 1057326 /usr/lib/x86_64-linux-gnu/libXi.so.6.1.0 7fb462e09000-7fb462e0a000 r--p 0000e000 08:12 1057326 /usr/lib/x86_64-linux-gnu/libXi.so.6.1.0 7fb462e0a000-7fb462e0b000 rw-p 0000f000 08:12 1057326 /usr/lib/x86_64-linux-gnu/libXi.so.6.1.0 7fb462e0b000-7fb462f40000 r-xp 00000000 08:12 1049053 /usr/lib/x86_64-linux-gnu/libX11.so.6.3.0 7fb462f40000-7fb463140000 ---p 00135000 08:12 1049053 /usr/lib/x86_64-linux-gnu/libX11.so.6.3.0 7fb463140000-7fb463141000 r--p 00135000 08:12 1049053 /usr/lib/x86_64-linux-gnu/libX11.so.6.3.0 7fb463141000-7fb463145000 rw-p 00136000 08:12 1049053 /usr/lib/x86_64-linux-gnu/libX11.so.6.3.0 7fb463145000-7fb463151000 r-xp 00000000 08:12 1058264 /usr/lib/x86_64-linux-gnu/libpangocairo-1.0.so.0.3800.1 7fb463151000-7fb463350000 ---p 0000c000 08:12 1058264 /usr/lib/x86_64-linux-gnu/libpangocairo-1.0.so.0.3800.1 7fb463350000-7fb463351000 r--p 0000b000 08:12 1058264 /usr/lib/x86_64-linux-gnu/libpangocairo-1.0.so.0.3800.1 7fb463351000-7fb463352000 rw-p 0000c000 08:12 1058264 /usr/lib/x86_64-linux-gnu/libpangocairo-1.0.so.0.3800.1 7fb463352000-7fb463355000 r-xp 00000000 08:12 1048810 /usr/lib/x86_64-linux-gnu/libgmodule-2.0.so.0.4800.2 7fb463355000-7fb463554000 ---p 00003000 08:12 1048810 /usr/lib/x86_64-linux-gnu/libgmodule-2.0.so.0.4800.2 7fb463554000-7fb463555000 r--p 00002000 08:12 1048810 /usr/lib/x86_64-linux-gnu/libgmodule-2.0.so.0.4800.2 7fb463555000-7fb463556000 rw-p 00003000 08:12 1048810 /usr/lib/x86_64-linux-gnu/libgmodule-2.0.so.0.4800.2 7fb463556000-7fb46355d000 r-xp 00000000 08:12 1048903 /usr/lib/x86_64-linux-gnu/libaec.so.0.0.3 7fb46355d000-7fb46375c000 ---p 00007000 08:12 1048903 /usr/lib/x86_64-linux-gnu/libaec.so.0.0.3 7fb46375c000-7fb46375d000 r--p 00006000 08:12 1048903 /usr/lib/x86_64-linux-gnu/libaec.so.0.0.3 7fb46375d000-7fb46375e000 rw-p 00007000 08:12 1048903 /usr/lib/x86_64-linux-gnu/libaec.so.0.0.3 7fb46375e000-7fb465014000 r-xp 00000000 08:12 1046853 /usr/lib/x86_64-linux-gnu/libicudata.so.55.1 7fb465014000-7fb465213000 ---p 018b6000 08:12 1046853 /usr/lib/x86_64-linux-gnu/libicudata.so.55.1 7fb465213000-7fb465214000 r--p 018b5000 08:12 1046853 /usr/lib/x86_64-linux-gnu/libicudata.so.55.1 7fb465214000-7fb465215000 rw-p 018b6000 08:12 1046853 /usr/lib/x86_64-linux-gnu/libicudata.so.55.1 7fb465215000-7fb465236000 r-xp 00000000 08:12 267238 /lib/x86_64-linux-gnu/liblzma.so.5.0.0 7fb465236000-7fb465435000 ---p 00021000 08:12 267238 /lib/x86_64-linux-gnu/liblzma.so.5.0.0 7fb465435000-7fb465436000 r--p 00020000 08:12 267238 /lib/x86_64-linux-gnu/liblzma.so.5.0.0 7fb465436000-7fb465437000 rw-p 00021000 08:12 267238 /lib/x86_64-linux-gnu/liblzma.so.5.0.0 7fb465437000-7fb465479000 r-xp 00000000 08:12 1057163 /usr/lib/x86_64-linux-gnu/libHalf.so.12.0.0 7fb465479000-7fb465678000 ---p 00042000 08:12 1057163 /usr/lib/x86_64-linux-gnu/libHalf.so.12.0.0 7fb465678000-7fb465679000 r--p 00041000 08:12 1057163 /usr/lib/x86_64-linux-gnu/libHalf.so.12.0.0 7fb465679000-7fb46567a000 rw-p 00042000 08:12 1057163 /usr/lib/x86_64-linux-gnu/libHalf.so.12.0.0 7fb46567a000-7fb465844000 r-xp 00000000 08:12 1057173 /usr/lib/x86_64-linux-gnu/libIlmImf-2_2.so.22.0.0 7fb465844000-7fb465a43000 ---p 001ca000 08:12 1057173 /usr/lib/x86_64-linux-gnu/libIlmImf-2_2.so.22.0.0 7fb465a43000-7fb465a46000 r--p 001c9000 08:12 1057173 /usr/lib/x86_64-linux-gnu/libIlmImf-2_2.so.22.0.0 7fb465a46000-7fb465b47000 rw-p 001cc000 08:12 1057173 /usr/lib/x86_64-linux-gnu/libIlmImf-2_2.so.22.0.0 7fb465b47000-7fb465b48000 rw-p 00000000 00:00 0 7fb465b48000-7fb465b92000 r-xp 00000000 08:12 1049113 /usr/lib/x86_64-linux-gnu/libjasper.so.1.0.0 7fb465b92000-7fb465d91000 ---p 0004a000 08:12 1049113 /usr/lib/x86_64-linux-gnu/libjasper.so.1.0.0 7fb465d91000-7fb465d92000 r--p 00049000 08:12 1049113 /usr/lib/x86_64-linux-gnu/libjasper.so.1.0.0 7fb465d92000-7fb465d96000 rw-p 0004a000 08:12 1049113 /usr/lib/x86_64-linux-gnu/libjasper.so.1.0.0 7fb465d96000-7fb465d9d000 rw-p 00000000 00:00 0 7fb465d9d000-7fb465e0e000 r-xp 00000000 08:12 1048891 /usr/lib/x86_64-linux-gnu/libtiff.so.5.2.4 7fb465e0e000-7fb46600d000 ---p 00071000 08:12 1048891 /usr/lib/x86_64-linux-gnu/libtiff.so.5.2.4 7fb46600d000-7fb46600e000 r--p 00070000 08:12 1048891 /usr/lib/x86_64-linux-gnu/libtiff.so.5.2.4 7fb46600e000-7fb466011000 rw-p 00071000 08:12 1048891 /usr/lib/x86_64-linux-gnu/libtiff.so.5.2.4 7fb466011000-7fb466035000 r-xp 00000000 08:12 267512 /lib/x86_64-linux-gnu/libpng12.so.0.54.0 7fb466035000-7fb466234000 ---p 00024000 08:12 267512 /lib/x86_64-linux-gnu/libpng12.so.0.54.0 7fb466234000-7fb466235000 r--p 00023000 08:12 267512 /lib/x86_64-linux-gnu/libpng12.so.0.54.0 7fb466235000-7fb466236000 rw-p 00024000 08:12 267512 /lib/x86_64-linux-gnu/libpng12.so.0.54.0 7fb466236000-7fb46628d000 r-xp 00000000 08:12 1071801 /usr/lib/x86_64-linux-gnu/libjpeg.so.8.0.2 7fb46628d000-7fb46648d000 ---p 00057000 08:12 1071801 /usr/lib/x86_64-linux-gnu/libjpeg.so.8.0.2 7fb46648d000-7fb46648e000 r--p 00057000 08:12 1071801 /usr/lib/x86_64-linux-gnu/libjpeg.so.8.0.2 7fb46648e000-7fb46648f000 rw-p 00058000 08:12 1071801 /usr/lib/x86_64-linux-gnu/libjpeg.so.8.0.2 7fb46648f000-7fb4665b8000 r-xp 00000000 08:12 1049227 /usr/lib/x86_64-linux-gnu/libgfortran.so.3.0.0 7fb4665b8000-7fb4667b7000 ---p 00129000 08:12 1049227 /usr/lib/x86_64-linux-gnu/libgfortran.so.3.0.0 7fb4667b7000-7fb4667b8000 r--p 00128000 08:12 1049227 /usr/lib/x86_64-linux-gnu/libgfortran.so.3.0.0 7fb4667b8000-7fb4667ba000 rw-p 00129000 08:12 1049227 /usr/lib/x86_64-linux-gnu/libgfortran.so.3.0.0 7fb4667ba000-7fb466b51000 r-xp 00000000 08:12 1197428 /usr/lib/atlas-base/libatlas.so.3.0 7fb466b51000-7fb466d51000 ---p 00397000 08:12 1197428 /usr/lib/atlas-base/libatlas.so.3.0 7fb466d51000-7fb466d58000 rw-p 00397000 08:12 1197428 /usr/lib/atlas-base/libatlas.so.3.0 7fb466d58000-7fb466ddd000 r-xp 00000000 08:12 1048449 /usr/lib/x86_64-linux-gnu/libswscale-ffmpeg.so.3.1.101 7fb466ddd000-7fb466fdc000 ---p 00085000 08:12 1048449 /usr/lib/x86_64-linux-gnu/libswscale-ffmpeg.so.3.1.101 7fb466fdc000-7fb466fde000 r--p 00084000 08:12 1048449 /usr/lib/x86_64-linux-gnu/libswscale-ffmpeg.so.3.1.101 7fb466fde000-7fb466fdf000 rw-p 00086000 08:12 1048449 /usr/lib/x86_64-linux-gnu/libswscale-ffmpeg.so.3.1.101 7fb466fdf000-7fb466fe7000 rw-p 00000000 00:00 0 7fb466fe7000-7fb46703d000 r-xp 00000000 08:12 1048464 /usr/lib/x86_64-linux-gnu/libavutil-ffmpeg.so.54.31.100 7fb46703d000-7fb46723c000 ---p 00056000 08:12 1048464 /usr/lib/x86_64-linux-gnu/libavutil-ffmpeg.so.54.31.100 7fb46723c000-7fb467242000 r--p 00055000 08:12 1048464 /usr/lib/x86_64-linux-gnu/libavutil-ffmpeg.so.54.31.100 7fb467242000-7fb467243000 rw-p 0005b000 08:12 1048464 /usr/lib/x86_64-linux-gnu/libavutil-ffmpeg.so.54.31.100 7fb467243000-7fb467256000 rw-p 00000000 00:00 0 7fb467256000-7fb46742c000 r-xp 00000000 08:12 1048460 /usr/lib/x86_64-linux-gnu/libavformat-ffmpeg.so.56.40.101 7fb46742c000-7fb46762c000 ---p 001d6000 08:12 1048460 /usr/lib/x86_64-linux-gnu/libavformat-ffmpeg.so.56.40.101 7fb46762c000-7fb467640000 r--p 001d6000 08:12 1048460 /usr/lib/x86_64-linux-gnu/libavformat-ffmpeg.so.56.40.101 7fb467640000-7fb467655000 rw-p 001ea000 08:12 1048460 /usr/lib/x86_64-linux-gnu/libavformat-ffmpeg.so.56.40.101 7fb467655000-7fb468186000 r-xp 00000000 08:12 1048462 /usr/lib/x86_64-linux-gnu/libavcodec-ffmpeg.so.56.60.100 7fb468186000-7fb468385000 ---p 00b31000 08:12 1048462 /usr/lib/x86_64-linux-gnu/libavcodec-ffmpeg.so.56.60.100 7fb468385000-7fb4683b0000 r--p 00b30000 08:12 1048462 /usr/lib/x86_64-linux-gnu/libavcodec-ffmpeg.so.56.60.100 7fb4683b0000-7fb4683d3000 rw-p 00b5b000 08:12 1048462 /usr/lib/x86_64-linux-gnu/libavcodec-ffmpeg.so.56.60.100 7fb4683d3000-7fb468a86000 rw-p 00000000 00:00 0 7fb468a86000-7fb468abb000 r-xp 00000000 08:12 1052809 /usr/lib/x86_64-linux-gnu/libdc1394.so.22.1.11 7fb468abb000-7fb468cba000 ---p 00035000 08:12 1052809 /usr/lib/x86_64-linux-gnu/libdc1394.so.22.1.11 7fb468cba000-7fb468cbb000 r--p 00034000 08:12 1052809 /usr/lib/x86_64-linux-gnu/libdc1394.so.22.1.11 7fb468cbb000-7fb468cbc000 rw-p 00035000 08:12 1052809 /usr/lib/x86_64-linux-gnu/libdc1394.so.22.1.11 7fb468cbc000-7fb468cfc000 rw-p 00000000 00:00 0 7fb468cfc000-7fb468e0b000 r-xp 00000000 08:12 261914 /lib/x86_64-linux-gnu/libglib-2.0.so.0.4800.2 7fb468e0b000-7fb46900a000 ---p 0010f000 08:12 261914 /lib/x86_64-linux-gnu/libglib-2.0.so.0.4800.2 7fb46900a000-7fb46900b000 r--p 0010e000 08:12 261914 /lib/x86_64-linux-gnu/libglib-2.0.so.0.4800.2 7fb46900b000-7fb46900c000 rw-p 0010f000 08:12 261914 /lib/x86_64-linux-gnu/libglib-2.0.so.0.4800.2 7fb46900c000-7fb46900d000 rw-p 00000000 00:00 0 7fb46900d000-7fb46905f000 r-xp 00000000 08:12 1048812 /usr/lib/x86_64-linux-gnu/libgobject-2.0.so.0.4800.2 7fb46905f000-7fb46925e000 ---p 00052000 08:12 1048812 /usr/lib/x86_64-linux-gnu/libgobject-2.0.so.0.4800.2 7fb46925e000-7fb46925f000 r--p 00051000 08:12 1048812 /usr/lib/x86_64-linux-gnu/libgobject-2.0.so.0.4800.2 7fb46925f000-7fb469260000 rw-p 00052000 08:12 1048812 /usr/lib/x86_64-linux-gnu/libgobject-2.0.so.0.4800.2 7fb469260000-7fb469281000 r-xp 00000000 08:12 1048894 /usr/lib/x86_64-linux-gnu/libgdk_pixbuf-2.0.so.0.3200.2 7fb469281000-7fb469480000 ---p 00021000 08:12 1048894 /usr/lib/x86_64-linux-gnu/libgdk_pixbuf-2.0.so.0.3200.2 7fb469480000-7fb469481000 r--p 00020000 08:12 1048894 /usr/lib/x86_64-linux-gnu/libgdk_pixbuf-2.0.so.0.3200.2 7fb469481000-7fb469482000 rw-p 00021000 08:12 1048894 /usr/lib/x86_64-linux-gnu/libgdk_pixbuf-2.0.so.0.3200.2 7fb469482000-7fb469590000 r-xp 00000000 08:12 1057466 /usr/lib/x86_64-linux-gnu/libcairo.so.2.11400.6 7fb469590000-7fb469790000 ---p 0010e000 08:12 1057466 /usr/lib/x86_64-linux-gnu/libcairo.so.2.11400.6 7fb469790000-7fb469793000 r--p 0010e000 08:12 1057466 /usr/lib/x86_64-linux-gnu/libcairo.so.2.11400.6 7fb469793000-7fb469794000 rw-p 00111000 08:12 1057466 /usr/lib/x86_64-linux-gnu/libcairo.so.2.11400.6 7fb469794000-7fb469796000 rw-p 00000000 00:00 0 7fb469796000-7fb46986a000 r-xp 00000000 08:12 1057778 /usr/lib/x86_64-linux-gnu/libgdk-3.so.0.1800.9 7fb46986a000-7fb469a69000 ---p 000d4000 08:12 1057778 /usr/lib/x86_64-linux-gnu/libgdk-3.so.0.1800.9 7fb469a69000-7fb469a6e000 r--p 000d3000 08:12 1057778 /usr/lib/x86_64-linux-gnu/libgdk-3.so.0.1800.9 7fb469a6e000-7fb469a71000 rw-p 000d8000 08:12 1057778 /usr/lib/x86_64-linux-gnu/libgdk-3.so.0.1800.9 7fb469a71000-7fb46a18b000 r-xp 00000000 08:12 1057923 /usr/lib/x86_64-linux-gnu/libgtk-3.so.0.1800.9 7fb46a18b000-7fb46a38b000 ---p 0071a000 08:12 1057923 /usr/lib/x86_64-linux-gnu/libgtk-3.so.0.1800.9 7fb46a38b000-7fb46a395000 r--p 0071a000 08:12 1057923 /usr/lib/x86_64-linux-gnu/libgtk-3.so.0.1800.9 7fb46a395000-7fb46a39b000 rw-p 00724000 08:12 1057923 /usr/lib/x86_64-linux-gnu/libgtk-3.so.0.1800.9 7fb46a39b000-7fb46a3a0000 rw-p 00000000 00:00 0 7fb46a3a0000-7fb46a3a7000 r-xp 00000000 08:12 1052769 /usr/lib/x86_64-linux-gnu/libsnappy.so.1.3.0 7fb46a3a7000-7fb46a5a6000 ---p 00007000 08:12 1052769 /usr/lib/x86_64-linux-gnu/libsnappy.so.1.3.0 7fb46a5a6000-7fb46a5a7000 r--p 00006000 08:12 1052769 /usr/lib/x86_64-linux-gnu/libsnappy.so.1.3.0 7fb46a5a7000-7fb46a5a8000 rw-p 00007000 08:12 1052769 /usr/lib/x86_64-linux-gnu/libsnappy.so.1.3.0 7fb46a5a8000-7fb46a5aa000 r-xp 00000000 08:12 1049229 /usr/lib/x86_64-linux-gnu/libsz.so.2.0.1 7fb46a5aa000-7fb46a7a9000 ---p 00002000 08:12 1049229 /usr/lib/x86_64-linux-gnu/libsz.so.2.0.1 7fb46a7a9000-7fb46a7aa000 r--p 00001000 08:12 1049229 /usr/lib/x86_64-linux-gnu/libsz.so.2.0.1 7fb46a7aa000-7fb46a7ab000 rw-p 00002000 08:12 1049229 /usr/lib/x86_64-linux-gnu/libsz.so.2.0.1 7fb46a7ab000-7fb46a92a000 r-xp 00000000 08:12 1055831 /usr/lib/x86_64-linux-gnu/libicuuc.so.55.1 7fb46a92a000-7fb46ab2a000 ---p 0017f000 08:12 1055831 /usr/lib/x86_64-linux-gnu/libicuuc.so.55.1 7fb46ab2a000-7fb46ab3a000 r--p 0017f000 08:12 1055831 /usr/lib/x86_64-linux-gnu/libicuuc.so.55.1 7fb46ab3a000-7fb46ab3b000 rw-p 0018f000 08:12 1055831 /usr/lib/x86_64-linux-gnu/libicuuc.so.55.1 7fb46ab3b000-7fb46ab3f000 rw-p 00000000 00:00 0 7fb46ab3f000-7fb46ad91000 r-xp 00000000 08:12 1047604 /usr/lib/x86_64-linux-gnu/libicui18n.so.55.1 7fb46ad91000-7fb46af91000 ---p 00252000 08:12 1047604 /usr/lib/x86_64-linux-gnu/libicui18n.so.55.1 7fb46af91000-7fb46afa0000 r--p 00252000 08:12 1047604 /usr/lib/x86_64-linux-gnu/libicui18n.so.55.1 7fb46afa0000-7fb46afa1000 rw-p 00261000 08:12 1047604 /usr/lib/x86_64-linux-gnu/libicui18n.so.55.1 7fb46afa1000-7fb46afa3000 r-xp 00000000 08:12 273865 /lib/x86_64-linux-gnu/libutil-2.23.so 7fb46afa3000-7fb46b1a2000 ---p 00002000 08:12 273865 /lib/x86_64-linux-gnu/libutil-2.23.so 7fb46b1a2000-7fb46b1a3000 r--p 00001000 08:12 273865 /lib/x86_64-linux-gnu/libutil-2.23.so 7fb46b1a3000-7fb46b1a4000 rw-p 00002000 08:12 273865 /lib/x86_64-linux-gnu/libutil-2.23.so 7fb46b1a4000-7fb46b1ab000 r-xp 00000000 08:12 273876 /lib/x86_64-linux-gnu/librt-2.23.so 7fb46b1ab000-7fb46b3aa000 ---p 00007000 08:12 273876 /lib/x86_64-linux-gnu/librt-2.23.so 7fb46b3aa000-7fb46b3ab000 r--p 00006000 08:12 273876 /lib/x86_64-linux-gnu/librt-2.23.so 7fb46b3ab000-7fb46b3ac000 rw-p 00007000 08:12 273876 /lib/x86_64-linux-gnu/librt-2.23.so 7fb46b3ac000-7fb46b3af000 r-xp 00000000 08:12 273860 /lib/x86_64-linux-gnu/libdl-2.23.so 7fb46b3af000-7fb46b5ae000 ---p 00003000 08:12 273860 /lib/x86_64-linux-gnu/libdl-2.23.so 7fb46b5ae000-7fb46b5af000 r--p 00002000 08:12 273860 /lib/x86_64-linux-gnu/libdl-2.23.so 7fb46b5af000-7fb46b5b0000 rw-p 00003000 08:12 273860 /lib/x86_64-linux-gnu/libdl-2.23.so 7fb46b5b0000-7fb46b5c9000 r-xp 00000000 08:12 267362 /lib/x86_64-linux-gnu/libz.so.1.2.8 7fb46b5c9000-7fb46b7c8000 ---p 00019000 08:12 267362 /lib/x86_64-linux-gnu/libz.so.1.2.8 7fb46b7c8000-7fb46b7c9000 r--p 00018000 08:12 267362 /lib/x86_64-linux-gnu/libz.so.1.2.8 7fb46b7c9000-7fb46b7ca000 rw-p 00019000 08:12 267362 /lib/x86_64-linux-gnu/libz.so.1.2.8 7fb46b7ca000-7fb46b7d6000 r-xp 00000000 08:12 1058568 /usr/lib/x86_64-linux-gnu/libunwind.so.8.0.1 7fb46b7d6000-7fb46b9d5000 ---p 0000c000 08:12 1058568 /usr/lib/x86_64-linux-gnu/libunwind.so.8.0.1 7fb46b9d5000-7fb46b9d6000 r--p 0000b000 08:12 1058568 /usr/lib/x86_64-linux-gnu/libunwind.so.8.0.1 7fb46b9d6000-7fb46b9d7000 rw-p 0000c000 08:12 1058568 /usr/lib/x86_64-linux-gnu/libunwind.so.8.0.1 7fb46b9d7000-7fb46b9e5000 rw-p 00000000 00:00 0 7fb46b9e5000-7fb46c837000 r-xp 00000000 08:13 9178264 /home/zsy/opencv-3.1.0/build/lib/libopencv_core.so.3.1.0 7fb46c837000-7fb46ca37000 ---p 00e52000 08:13 9178264 /home/zsy/opencv-3.1.0/build/lib/libopencv_core.so.3.1.0 7fb46ca37000-7fb46ca40000 r--p 00e52000 08:13 9178264 /home/zsy/opencv-3.1.0/build/lib/libopencv_core.so.3.1.0 7fb46ca40000-7fb46ca6d000 rw-p 00e5b000 08:13 9178264 /home/zsy/opencv-3.1.0/build/lib/libopencv_core.so.3.1.0 7fb46ca6d000-7fb46ca7c000 rw-p 00000000 00:00 0 7fb46ca7c000-7fb46e1ff000 r-xp 00000000 08:13 9178273 /home/zsy/opencv-3.1.0/build/lib/libopencv_imgproc.so.3.1.0 7fb46e1ff000-7fb46e3ff000 ---p 01783000 08:13 9178273 /home/zsy/opencv-3.1.0/build/lib/libopencv_imgproc.so.3.1.0 7fb46e3ff000-7fb46e407000 r--p 01783000 08:13 9178273 /home/zsy/opencv-3.1.0/build/lib/libopencv_imgproc.so.3.1.0 7fb46e407000-7fb46e429000 rw-p 0178b000 08:13 9178273 /home/zsy/opencv-3.1.0/build/lib/libopencv_imgproc.so.3.1.0 7fb46e429000-7fb46e4bf000 rw-p 00000000 00:00 0 7fb46e4bf000-7fb46e675000 r-xp 00000000 08:13 9178276 /home/zsy/opencv-3.1.0/build/lib/libopencv_imgcodecs.so.3.1.0 7fb46e675000-7fb46e875000 ---p 001b6000 08:13 9178276 /home/zsy/opencv-3.1.0/build/lib/libopencv_imgcodecs.so.3.1.0 7fb46e875000-7fb46e877000 r--p 001b6000 08:13 9178276 /home/zsy/opencv-3.1.0/build/lib/libopencv_imgcodecs.so.3.1.0 7fb46e877000-7fb46e87a000 rw-p 001b8000 08:13 9178276 /home/zsy/opencv-3.1.0/build/lib/libopencv_imgcodecs.so.3.1.0 7fb46e87a000-7fb46e87d000 rw-p 00000000 00:00 0 7fb46e87d000-7fb46e985000 r-xp 00000000 08:12 267213 /lib/x86_64-linux-gnu/libm-2.23.so 7fb46e985000-7fb46eb84000 ---p 00108000 08:12 267213 /lib/x86_64-linux-gnu/libm-2.23.so 7fb46eb84000-7fb46eb85000 r--p 00107000 08:12 267213 /lib/x86_64-linux-gnu/libm-2.23.so 7fb46eb85000-7fb46eb86000 rw-p 00108000 08:12 267213 /lib/x86_64-linux-gnu/libm-2.23.so 7fb46eb86000-7fb46eba7000 r-xp 00000000 08:12 1197429 /usr/lib/atlas-base/libcblas.so.3.0 7fb46eba7000-7fb46eda7000 ---p 00021000 08:12 1197429 /usr/lib/atlas-base/libcblas.so.3.0 7fb46eda7000-7fb46eda8000 rw-p 00021000 08:12 1197429 /usr/lib/atlas-base/libcblas.so.3.0 7fb46eda8000-7fb46edd4000 r-xp 00000000 08:13 9178282 /home/zsy/opencv-3.1.0/build/lib/libopencv_videoio.so.3.1.0 7fb46edd4000-7fb46efd4000 ---p 0002c000 08:13 9178282 /home/zsy/opencv-3.1.0/build/lib/libopencv_videoio.so.3.1.0 7fb46efd4000-7fb46efd5000 r--p 0002c000 08:13 9178282 /home/zsy/opencv-3.1.0/build/lib/libopencv_videoio.so.3.1.0 7fb46efd5000-7fb46efd6000 rw-p 0002d000 08:13 9178282 /home/zsy/opencv-3.1.0/build/lib/libopencv_videoio.so.3.1.0 7fb46efd6000-7fb46efd9000 rw-p 00000000 00:00 0 7fb46efd9000-7fb46efe5000 r-xp 00000000 08:13 9178288 /home/zsy/opencv-3.1.0/build/lib/libopencv_highgui.so.3.1.0 7fb46efe5000-7fb46f1e4000 ---p 0000c000 08:13 9178288 /home/zsy/opencv-3.1.0/build/lib/libopencv_highgui.so.3.1.0 7fb46f1e4000-7fb46f1e5000 r--p 0000b000 08:13 9178288 /home/zsy/opencv-3.1.0/build/lib/libopencv_highgui.so.3.1.0 7fb46f1e5000-7fb46f1e6000 rw-p 0000c000 08:13 9178288 /home/zsy/opencv-3.1.0/build/lib/libopencv_highgui.so.3.1.0 7fb46f1e6000-7fb474208000 r-xp 00000000 08:12 1071699 /usr/local/cuda-8.0/lib64/libcudnn.so.5.1.10 7fb474208000-7fb474408000 ---p 05022000 08:12 1071699 /usr/local/cuda-8.0/lib64/libcudnn.so.5.1.10 7fb474408000-7fb47442a000 rw-p 05022000 08:12 1071699 /usr/local/cuda-8.0/lib64/libcudnn.so.5.1.10 7fb47442a000-7fb474455000 rw-p 00000000 00:00 0 7fb474455000-7fb476cc1000 r-xp 00000000 08:12 1068246 /usr/local/cuda-8.0/lib64/libcublas.so.8.0.61 7fb476cc1000-7fb476ec1000 ---p 0286c000 08:12 1068246 /usr/local/cuda-8.0/lib64/libcublas.so.8.0.61 7fb476ec1000-7fb476ede000 rw-p 0286c000 08:12 1068246 /usr/local/cuda-8.0/lib64/libcublas.so.8.0.61 7fb476ede000-7fb476eed000 rw-p 00000000 00:00 0 7fb476eed000-7fb479388000 r-xp 00000000 08:12 1068328 /usr/local/cuda-8.0/lib64/libcurand.so.8.0.61 7fb479388000-7fb479588000 ---p 0249b000 08:12 1068328 /usr/local/cuda-8.0/lib64/libcurand.so.8.0.61 7fb479588000-7fb47a959000 rw-p 0249b000 08:12 1068328 /usr/local/cuda-8.0/lib64/libcurand.so.8.0.61 7fb47a959000-7fb47ae63000 rw-p 00000000 00:00 0 7fb47ae63000-7fb47aebb000 r-xp 00000000 08:12 1049262 /usr/lib/x86_64-linux-gnu/libleveldb.so.1.18 7fb47aebb000-7fb47b0ba000 ---p 00058000 08:12 1049262 /usr/lib/x86_64-linux-gnu/libleveldb.so.1.18 7fb47b0ba000-7fb47b0bc000 r--p 00057000 08:12 1049262 /usr/lib/x86_64-linux-gnu/libleveldb.so.1.18 7fb47b0bc000-7fb47b0bd000 rw-p 00059000 08:12 1049262 /usr/lib/x86_64-linux-gnu/libleveldb.so.1.18 7fb47b0bd000-7fb47b0d1000 r-xp 00000000 08:12 1072741 /usr/lib/x86_64-linux-gnu/liblmdb.so.0.0.0 7fb47b0d1000-7fb47b2d0000 ---p 00014000 08:12 1072741 /usr/lib/x86_64-linux-gnu/liblmdb.so.0.0.0 7fb47b2d0000-7fb47b2d1000 r--p 00013000 08:12 1072741 /usr/lib/x86_64-linux-gnu/liblmdb.so.0.0.0 7fb47b2d1000-7fb47b2d2000 rw-p 00014000 08:12 1072741 /usr/lib/x86_64-linux-gnu/liblmdb.so.0.0.0 7fb47b2d2000-7fb47b2f0000 r-xp 00000000 08:12 1049242 /usr/lib/x86_64-linux-gnu/libhdf5_serial_hl.so.10.0.2 7fb47b2f0000-7fb47b4ef000 ---p 0001e000 08:12 1049242 /usr/lib/x86_64-linux-gnu/libhdf5_serial_hl.so.10.0.2 7fb47b4ef000-7fb47b4f0000 r--p 0001d000 08:12 1049242 /usr/lib/x86_64-linux-gnu/libhdf5_serial_hl.so.10.0.2 7fb47b4f0000-7fb47b4f1000 rw-p 0001e000 08:12 1049242 /usr/lib/x86_64-linux-gnu/libhdf5_serial_hl.so.10.0.2 7fb47b4f1000-7fb47b4f2000 rw-p 00000000 00:00 0 7fb47b4f2000-7fb47b786000 r-xp 00000000 08:12 1049240 /usr/lib/x86_64-linux-gnu/libhdf5_serial.so.10.1.0 7fb47b786000-7fb47b985000 ---p 00294000 08:12 1049240 /usr/lib/x86_64-linux-gnu/libhdf5_serial.so.10.1.0 7fb47b985000-7fb47b98a000 r--p 00293000 08:12 1049240 /usr/lib/x86_64-linux-gnu/libhdf5_serial.so.10.1.0 7fb47b98a000-7fb47b98f000 rw-p 00298000 08:12 1049240 /usr/lib/x86_64-linux-gnu/libhdf5_serial.so.10.1.0 7fb47b98f000-7fb47b990000 rw-p 00000000 00:00 0 7fb47b990000-7fb47b9a8000 r-xp 00000000 08:12 273857 /lib/x86_64-linux-gnu/libpthread-2.23.so 7fb47b9a8000-7fb47bba7000 ---p 00018000 08:12 273857 /lib/x86_64-linux-gnu/libpthread-2.23.so 7fb47bba7000-7fb47bba8000 r--p 00017000 08:12 273857 /lib/x86_64-linux-gnu/libpthread-2.23.so 7fb47bba8000-7fb47bba9000 rw-p 00018000 08:12 273857 /lib/x86_64-linux-gnu/libpthread-2.23.so 7fb47bba9000-7fb47bbad000 rw-p 00000000 00:00 0 7fb47bbad000-7fb47bcb0000 r-xp 00000000 08:12 1055893 /usr/lib/x86_64-linux-gnu/libboost_regex.so.1.58.0 7fb47bcb0000-7fb47beb0000 ---p 00103000 08:12 1055893 /usr/lib/x86_64-linux-gnu/libboost_regex.so.1.58.0 7fb47beb0000-7fb47beb4000 r--p 00103000 08:12 1055893 /usr/lib/x86_64-linux-gnu/libboost_regex.so.1.58.0 7fb47beb4000-7fb47beb5000 rw-p 00107000 08:12 1055893 /usr/lib/x86_64-linux-gnu/libboost_regex.so.1.58.0 7fb47beb5000-7fb47becc000 r-xp 00000000 08:12 1057453 /usr/lib/x86_64-linux-gnu/libboost_filesystem.so.1.58.0 7fb47becc000-7fb47c0cb000 ---p 00017000 08:12 1057453 /usr/lib/x86_64-linux-gnu/libboost_filesystem.so.1.58.0 7fb47c0cb000-7fb47c0cc000 r--p 00016000 08:12 1057453 /usr/lib/x86_64-linux-gnu/libboost_filesystem.so.1.58.0 7fb47c0cc000-7fb47c0cd000 rw-p 00017000 08:12 1057453 /usr/lib/x86_64-linux-gnu/libboost_filesystem.so.1.58.0 7fb47c0cd000-7fb47c0f1000 r-xp 00000000 08:12 1055873 /usr/lib/x86_64-linux-gnu/libboost_thread.so.1.58.0 7fb47c0f1000-7fb47c2f0000 ---p 00024000 08:12 1055873 /usr/lib/x86_64-linux-gnu/libboost_thread.so.1.58.0 7fb47c2f0000-7fb47c2f2000 r--p 00023000 08:12 1055873 /usr/lib/x86_64-linux-gnu/libboost_thread.so.1.58.0 7fb47c2f2000-7fb47c2f3000 rw-p 00025000 08:12 1055873 /usr/lib/x86_64-linux-gnu/libboost_thread.so.1.58.0 7fb47c2f3000-7fb47c4b3000 r-xp 00000000 08:12 273858 /lib/x86_64-linux-gnu/libc-2.23.so 7fb47c4b3000-7fb47c6b3000 ---p 001c0000 08:12 273858 /lib/x86_64-linux-gnu/libc-2.23.so 7fb47c6b3000-7fb47c6b7000 r--p 001c0000 08:12 273858 /lib/x86_64-linux-gnu/libc-2.23.so 7fb47c6b7000-7fb47c6b9000 rw-p 001c4000 08:12 273858 /lib/x86_64-linux-gnu/libc-2.23.so 7fb47c6b9000-7fb47c6bd000 rw-p 00000000 00:00 0 7fb47c6bd000-7fb47c6d3000 r-xp 00000000 08:12 267209 /lib/x86_64-linux-gnu/libgcc_s.so.1 7fb47c6d3000-7fb47c8d2000 ---p 00016000 08:12 267209 /lib/x86_64-linux-gnu/libgcc_s.so.1 7fb47c8d2000-7fb47c8d3000 rw-p 00015000 08:12 267209 /lib/x86_64-linux-gnu/libgcc_s.so.1 7fb47c8d3000-7fb47ca45000 r-xp 00000000 08:12 1048800 /usr/lib/x86_64-linux-gnu/libstdc++.so.6.0.21 7fb47ca45000-7fb47cc45000 ---p 00172000 08:12 1048800 /usr/lib/x86_64-linux-gnu/libstdc++.so.6.0.21 7fb47cc45000-7fb47cc4f000 r--p 00172000 08:12 1048800 /usr/lib/x86_64-linux-gnu/libstdc++.so.6.0.21 7fb47cc4f000-7fb47cc51000 rw-p 0017c000 08:12 1048800 /usr/lib/x86_64-linux-gnu/libstdc++.so.6.0.21 7fb47cc51000-7fb47cc55000 rw-p 00000000 00:00 0 7fb47cc55000-7fb47cc9e000 r-xp 00000000 08:12 1061092 /usr/lib/x86_64-linux-gnu/libboost_python-py27.so.1.58.0 7fb47cc9e000-7fb47ce9e000 ---p 00049000 08:12 1061092 /usr/lib/x86_64-linux-gnu/libboost_python-py27.so.1.58.0 7fb47ce9e000-7fb47ce9f000 r--p 00049000 08:12 1061092 /usr/lib/x86_64-linux-gnu/libboost_python-py27.so.1.58.0 7fb47ce9f000-7fb47cea1000 rw-p 0004a000 08:12 1061092 /usr/lib/x86_64-linux-gnu/libboost_python-py27.so.1.58.0 7fb47cea1000-7fb47d193000 r-xp 00000000 08:12 1046632 /usr/lib/x86_64-linux-gnu/libpython2.7.so.1.0 7fb47d193000-7fb47d393000 ---p 002f2000 08:12 1046632 /usr/lib/x86_64-linux-gnu/libpython2.7.so.1.0 7fb47d393000-7fb47d395000 r--p 002f2000 08:12 1046632 /usr/lib/x86_64-linux-gnu/libpython2.7.so.1.0 7fb47d395000-7fb47d40c000 rw-p 002f4000 08:12 1046632 /usr/lib/x86_64-linux-gnu/libpython2.7.so.1.0 7fb47d40c000-7fb47d42f000 rw-p 00000000 00:00 0 7fb47d42f000-7fb47d491000 r-xp 00000000 08:12 1068334 /usr/local/cuda-8.0/lib64/libcudart.so.8.0.61 7fb47d491000-7fb47d691000 ---p 00062000 08:12 1068334 /usr/local/cuda-8.0/lib64/libcudart.so.8.0.61 7fb47d691000-7fb47d694000 rw-p 00062000 08:12 1068334 /usr/local/cuda-8.0/lib64/libcudart.so.8.0.61 7fb47d694000-7fb47d695000 rw-p 00000000 00:00 0 7fb47d695000-7fb47d7af000 r-xp 00000000 08:12 1058315 /usr/lib/x86_64-linux-gnu/libprotobuf.so.9.0.1 7fb47d7af000-7fb47d9ae000 ---p 0011a000 08:12 1058315 /usr/lib/x86_64-linux-gnu/libprotobuf.so.9.0.1 7fb47d9ae000-7fb47d9b2000 r--p 00119000 08:12 1058315 /usr/lib/x86_64-linux-gnu/libprotobuf.so.9.0.1 7fb47d9b2000-7fb47d9b3000 rw-p 0011d000 08:12 1058315 /usr/lib/x86_64-linux-gnu/libprotobuf.so.9.0.1 7fb47d9b3000-7fb47d9d3000 r-xp 00000000 08:12 1072746 /usr/lib/x86_64-linux-gnu/libgflags.so.2.1.2 7fb47d9d3000-7fb47dbd2000 ---p 00020000 08:12 1072746 /usr/lib/x86_64-linux-gnu/libgflags.so.2.1.2 7fb47dbd2000-7fb47dbd3000 r--p 0001f000 08:12 1072746 /usr/lib/x86_64-linux-gnu/libgflags.so.2.1.2 7fb47dbd3000-7fb47dbd4000 rw-p 00020000 08:12 1072746 /usr/lib/x86_64-linux-gnu/libgflags.so.2.1.2 7fb47dbd4000-7fb47dbf2000 r-xp 00000000 08:12 1072754 /usr/lib/x86_64-linux-gnu/libglog.so.0.0.0 7fb47dbf2000-7fb47ddf1000 ---p 0001e000 08:12 1072754 /usr/lib/x86_64-linux-gnu/libglog.so.0.0.0 7fb47ddf1000-7fb47ddf2000 r--p 0001d000 08:12 1072754 /usr/lib/x86_64-linux-gnu/libglog.so.0.0.0 7fb47ddf2000-7fb47ddf3000 rw-p 0001e000 08:12 1072754 /usr/lib/x86_64-linux-gnu/libglog.so.0.0.0 7fb47ddf3000-7fb47de03000 rw-p 00000000 00:00 0 7fb47de03000-7fb47de06000 r-xp 00000000 08:12 1057455 /usr/lib/x86_64-linux-gnu/libboost_system.so.1.58.0 7fb47de06000-7fb47e005000 ---p 00003000 08:12 1057455 /usr/lib/x86_64-linux-gnu/libboost_system.so.1.58.0 7fb47e005000-7fb47e006000 r--p 00002000 08:12 1057455 /usr/lib/x86_64-linux-gnu/libboost_system.so.1.58.0 7fb47e006000-7fb47e007000 rw-p 00003000 08:12 1057455 /usr/lib/x86_64-linux-gnu/libboost_system.so.1.58.0 7fb47e007000-7fb47ec5d000 r-xp 00000000 08:13 12717974 /home/zsy/DeepLearning/caffe-ssd/cmake-build-debug/lib/libcaffe-d.so.1.0.0-rc3 7fb47ec5d000-7fb47ee5d000 ---p 00c56000 08:13 12717974 /home/zsy/DeepLearning/caffe-ssd/cmake-build-debug/lib/libcaffe-d.so.1.0.0-rc3 7fb47ee5d000-7fb47ee76000 r--p 00c56000 08:13 12717974 /home/zsy/DeepLearning/caffe-ssd/cmake-build-debug/lib/libcaffe-d.so.1.0.0-rc3 7fb47ee76000-7fb47eea0000 rw-p 00c6f000 08:13 12717974 /home/zsy/DeepLearning/caffe-ssd/cmake-build-debug/lib/libcaffe-d.so.1.0.0-rc3 7fb47eea0000-7fb47eea2000 rw-p 00000000 00:00 0 7fb47eea2000-7fb47eec8000 r-xp 00000000 08:12 273854 /lib/x86_64-linux-gnu/ld-2.23.so 7fb47efa9000-7fb47efc4000 rw-p 00000000 00:00 0 7fb47efc4000-7fb47f044000 r-xp 00000000 08:12 267144 /lib/x86_64-linux-gnu/libsystemd.so.0.14.0 7fb47f044000-7fb47f047000 r--p 0007f000 08:12 267144 /lib/x86_64-linux-gnu/libsystemd.so.0.14.0 7fb47f047000-7fb47f048000 rw-p 00082000 08:12 267144 /lib/x86_64-linux-gnu/libsystemd.so.0.14.0 7fb47f048000-7fb47f04f000 rw-p 00000000 00:00 0 7fb47f04f000-7fb47f06d000 r-xp 00000000 08:12 266771 /lib/x86_64-linux-gnu/libudev.so.1.6.4 7fb47f06d000-7fb47f06e000 r--p 0001d000 08:12 266771 /lib/x86_64-linux-gnu/libudev.so.1.6.4 7fb47f06e000-7fb47f06f000 rw-p 0001e000 08:12 266771 /lib/x86_64-linux-gnu/libudev.so.1.6.4 7fb47f06f000-7fb47f0a2000 rw-p 00000000 00:00 0 7fb47f0c5000-7fb47f0c7000 rw-p 00000000 00:00 0 7fb47f0c7000-7fb47f0c8000 r--p 00025000 08:12 273854 /lib/x86_64-linux-gnu/ld-2.23.so 7fb47f0c8000-7fb47f0c9000 rw-p 00026000 08:12 273854 /lib/x86_64-linux-gnu/ld-2.23.so 7fb47f0c9000-7fb47f0ca000 rw-p 00000000 00:00 0 7ffd3aaac000-7ffd3aacb000 rwxp 00000000 00:00 0 [stack] 7ffd3aacb000-7ffd3aacd000 rw-p 00000000 00:00 0 7ffd3abb3000-7ffd3abb5000 r--p 00000000 00:00 0 [vvar] 7ffd3abb5000-7ffd3abb7000 r-xp 00000000 00:00 0 [vdso] ffffffffff600000-ffffffffff601000 r-xp 00000000 00:00 0 [vsyscall] *** Aborted at 1537413282 (unix time) try "date -d @1537413282" if you are using GNU date *** PC: @ 0x7fb47c328428 gsignal *** SIGABRT (@0x3e800007a97) received by PID 31383 (TID 0x7fb47efb1b00) from PID 31383; stack trace: *** @ 0x7fb47c3284b0 (unknown) @ 0x7fb47c328428 gsignal @ 0x7fb47c32a02a abort @ 0x7fb47c36a7ea (unknown) @ 0x7fb47c37337a (unknown) @ 0x7fb47c37753c cfree @ 0x7fb47d6e38af google::protobuf::internal::DestroyDefaultRepeatedFields() @ 0x7fb47d6e2b3b google::protobuf::ShutdownProtobufLibrary() @ 0x7fb457b6b3b9 (unknown) @ 0x7fb47eeb2de7 (unknown) @ 0x7fb47c32cff8 (unknown) @ 0x7fb47c32d045 exit @ 0x7fb47c313837 __libc_start_main @ 0x435439 _start @ 0x0 (unknown)

编译Caffe://usr/lib/x86_64-linux-gnu/libboost_system.so.1.65.1: 无法添加符号

/usr/bin/ld: .build_release/tools/upgrade_solver_proto_text.o: undefined reference to symbol '_ZN5boost6system15system_categoryEv' //usr/lib/x86_64-linux-gnu/libboost_system.so.1.65.1: 无法添加符号: DSO missing from command line ![图片说明](https://img-ask.csdn.net/upload/201911/29/1574991646_52138.png) 求大神帮忙!

导入cython生成的c共享库以与cgo一起使用

<div class="post-text" itemprop="text"> <p>I wanna import a c-shared-library to go that generated by Cython in python 3.7, try do it by cgo.</p> <p>in this case:</p> <blockquote> <p>go version go1.12.7 linux/amd64</p> <p>Python 3.7.3</p> <p>Cython version 0.29.12</p> <p>os: Manjaro 18.0.4</p> <p>Kernel: x86_64 Linux 5.1.19-1</p> </blockquote> <p>I will continue: make a python file <code>vim pylib.pyx</code>:</p> <pre><code>#!python cdef public void hello(): print("hello world!") </code></pre> <p>and run <code>python -m cython pylib.pyx</code> for generate the c-shared-library, I have two files, <code>pylib.c</code> and <code>pylib.h</code>. now, try import these to golang, so make a go file <code>vim test.go</code>:</p> <pre><code>package main /* #include &lt;/usr/include/python3.7m/Python.h&gt; #include "pylib.h" */ import "C" import "fmt" func main() { C.hello() fmt.Println("done") } </code></pre> <p>finaly, I run <code>go run test.go</code>: I have the following output:</p> <blockquote> <pre><code># command-line-arguments /usr/bin/ld: $WORK/b001/_x002.o: in function `_cgo_51159acd5c8e_Cfunc_hello': /tmp/go-build/cgo-gcc-prolog:48: undefined reference to `hello' collect2: error: ld returned 1 exit status </code></pre> </blockquote> <p>I try import it to c too but I encountered a similar output like this:</p> <blockquote> <pre><code>undefined reference to `hello' ld returned 1 exit status </code></pre> </blockquote> <p>I don't know what to do, help me, please. :(</p> </div>

学Python后到底能干什么?网友:我太难了

感觉全世界营销文都在推Python,但是找不到工作的话,又有哪个机构会站出来给我推荐工作? 笔者冷静分析多方数据,想跟大家说:关于超越老牌霸主Java,过去几年间Python一直都被寄予厚望。但是事实是虽然上升趋势,但是国内环境下,一时间是无法马上就超越Java的,也可以换句话说:超越Java只是时间问题罢。 太嚣张了会Python的人!找工作拿高薪这么简单? https://edu....

在中国程序员是青春饭吗?

今年,我也32了 ,为了不给大家误导,咨询了猎头、圈内好友,以及年过35岁的几位老程序员……舍了老脸去揭人家伤疤……希望能给大家以帮助,记得帮我点赞哦。 目录: 你以为的人生 一次又一次的伤害 猎头界的真相 如何应对互联网行业的「中年危机」 一、你以为的人生 刚入行时,拿着傲人的工资,想着好好干,以为我们的人生是这样的: 等真到了那一天,你会发现,你的人生很可能是这样的: ...

为什么程序猿都不愿意去外包?

分享外包的组织架构,盈利模式,亲身经历,以及根据一些外包朋友的反馈,写了这篇文章 ,希望对正在找工作的老铁有所帮助

Java校招入职华为,半年后我跑路了

何来 我,一个双非本科弟弟,有幸在 19 届的秋招中得到前东家华为(以下简称 hw)的赏识,当时秋招签订就业协议,说是入了某 java bg,之后一系列组织架构调整原因等等让人无法理解的神操作,最终毕业前夕,被通知调往其他 bg 做嵌入式开发(纯 C 语言)。 由于已至于校招末尾,之前拿到的其他 offer 又无法再收回,一时感到无力回天,只得默默接受。 毕业后,直接入职开始了嵌入式苦旅,由于从未...

Java基础知识面试题(2020最新版)

文章目录Java概述何为编程什么是Javajdk1.5之后的三大版本JVM、JRE和JDK的关系什么是跨平台性?原理是什么Java语言有哪些特点什么是字节码?采用字节码的最大好处是什么什么是Java程序的主类?应用程序和小程序的主类有何不同?Java应用程序与小程序之间有那些差别?Java和C++的区别Oracle JDK 和 OpenJDK 的对比基础语法数据类型Java有哪些数据类型switc...

@程序员:GitHub这个项目快薅羊毛

今天下午在朋友圈看到很多人都在发github的羊毛,一时没明白是怎么回事。 后来上百度搜索了一下,原来真有这回事,毕竟资源主义的羊毛不少啊,1000刀刷爆了朋友圈!不知道你们的朋友圈有没有看到类似的消息。 这到底是啥情况? 微软开发者平台GitHub 的一个区块链项目 Handshake ,搞了一个招募新会员的活动,面向GitHub 上前 25万名开发者派送 4,246.99 HNS币,大约价...

用python打开电脑摄像头,并把图像传回qq邮箱【Pyinstaller打包】

前言: 如何悄悄的打开朋友的摄像头,看看她最近过的怎么样,嘿嘿!这次让我带你们来实现这个功能。 注: 这个程序仅限在朋友之间开玩笑,别去搞什么违法的事情哦。 代码 发送邮件 使用python内置的email模块即可完成。导入相应的代码封装为一个send函数,顺便导入需要导入的包 注: 下面的代码有三处要修改的地方,两处写的qq邮箱地址,还有一处写的qq邮箱授权码,不知道qq邮箱授权码的可以去百度一...

做了5年运维,靠着这份监控知识体系,我从3K变成了40K

从来没讲过运维,因为我觉得运维这种东西不需要太多的知识面,然后我一个做了运维朋友告诉我大错特错,他就是从3K的运维一步步到40K的,甚至笑着说:我现在感觉自己什么都能做。 既然讲,就讲最重要的吧。 监控是整个运维乃至整个产品生命周期中最重要的一环,事前及时预警发现故障,事后提供详实的数据用于追查定位问题。目前业界有很多不错的开源产品可供选择。选择一款开源的监控系统,是一个省时省力、效率最高的方...

C++(继承):19---虚基类与虚继承(virtual)

一、菱形继承 在介绍虚继承之前介绍一下菱形继承 概念:A作为基类,B和C都继承与A。最后一个类D又继承于B和C,这样形式的继承称为菱形继承 菱形继承的缺点: 数据冗余:在D中会保存两份A的内容 访问不明确(二义性):因为D不知道是以B为中介去访问A还是以C为中介去访问A,因此在访问某些成员的时候会发生二义性 缺点的解决: 数据冗余:通过下面“虚继承”技术来解决(见下) 访问...

再不跳槽,应届毕业生拿的都比我多了!

跳槽几乎是每个人职业生涯的一部分,很多HR说“三年两跳”已经是一个跳槽频繁与否的阈值了,可为什么市面上有很多程序员不到一年就跳槽呢?他们不担心影响履历吗? PayScale之前发布的**《员工最短任期公司排行榜》中,两家码农大厂Amazon和Google**,以1年和1.1年的员工任期中位数分列第二、第四名。 PayScale:员工最短任期公司排行榜 意外的是,任期中位数极小的这两家公司,薪资...

我以为我学懂了数据结构,直到看了这个导图才发现,我错了

数据结构与算法思维导图

技术大佬:我去,你写的 switch 语句也太老土了吧

昨天早上通过远程的方式 review 了两名新来同事的代码,大部分代码都写得很漂亮,严谨的同时注释也很到位,这令我非常满意。但当我看到他们当中有一个人写的 switch 语句时,还是忍不住破口大骂:“我擦,小王,你丫写的 switch 语句也太老土了吧!” 来看看小王写的代码吧,看完不要骂我装逼啊。 private static String createPlayer(PlayerTypes p...

华为初面+综合面试(Java技术面)附上面试题

华为面试整体流程大致分为笔试,性格测试,面试,综合面试,回学校等结果。笔试来说,华为的难度较中等,选择题难度和网易腾讯差不多。最后的代码题,相比下来就简单很多,一共3道题目,前2题很容易就AC,题目已经记不太清楚,不过难度确实不大。最后一题最后提交的代码过了75%的样例,一直没有发现剩下的25%可能存在什么坑。 笔试部分太久远,我就不怎么回忆了。直接将面试。 面试 如果说腾讯的面试是挥金如土...

和黑客斗争的 6 天!

互联网公司工作,很难避免不和黑客们打交道,我呆过的两家互联网公司,几乎每月每天每分钟都有黑客在公司网站上扫描。有的是寻找 Sql 注入的缺口,有的是寻找线上服务器可能存在的漏洞,大部分都...

讲一个程序员如何副业月赚三万的真实故事

loonggg读完需要3分钟速读仅需 1 分钟大家好,我是你们的校长。我之前讲过,这年头,只要肯动脑,肯行动,程序员凭借自己的技术,赚钱的方式还是有很多种的。仅仅靠在公司出卖自己的劳动时...

win10暴力查看wifi密码

刚才邻居打了个电话说:喂小灰,你家wifi的密码是多少,我怎么连不上了。 我。。。 我也忘了哎,就找到了一个好办法,分享给大家: 第一种情况:已经连接上的wifi,怎么知道密码? 打开:控制面板\网络和 Internet\网络连接 然后右击wifi连接的无线网卡,选择状态 然后像下图一样: 第二种情况:前提是我不知道啊,但是我以前知道密码。 此时可以利用dos命令了 1、利用netsh wlan...

上班一个月,后悔当初着急入职的选择了

最近有个老铁,告诉我说,上班一个月,后悔当初着急入职现在公司了。他之前在美图做手机研发,今年美图那边今年也有一波组织优化调整,他是其中一个,在协商离职后,当时捉急找工作上班,因为有房贷供着,不能没有收入来源。所以匆忙选了一家公司,实际上是一个大型外包公司,主要派遣给其他手机厂商做外包项目。**当时承诺待遇还不错,所以就立马入职去上班了。但是后面入职后,发现薪酬待遇这块并不是HR所说那样,那个HR自...

女程序员,为什么比男程序员少???

昨天看到一档综艺节目,讨论了两个话题:(1)中国学生的数学成绩,平均下来看,会比国外好?为什么?(2)男生的数学成绩,平均下来看,会比女生好?为什么?同时,我又联想到了一个技术圈经常讨...

总结了 150 余个神奇网站,你不来瞅瞅吗?

原博客再更新,可能就没了,之后将持续更新本篇博客。

副业收入是我做程序媛的3倍,工作外的B面人生是怎样的?

提到“程序员”,多数人脑海里首先想到的大约是:为人木讷、薪水超高、工作枯燥…… 然而,当离开工作岗位,撕去层层标签,脱下“程序员”这身外套,有的人生动又有趣,马上展现出了完全不同的A/B面人生! 不论是简单的爱好,还是正经的副业,他们都干得同样出色。偶尔,还能和程序员的特质结合,产生奇妙的“化学反应”。 @Charlotte:平日素颜示人,周末美妆博主 大家都以为程序媛也个个不修边幅,但我们也许...

MySQL数据库面试题(2020最新版)

文章目录数据库基础知识为什么要使用数据库什么是SQL?什么是MySQL?数据库三大范式是什么mysql有关权限的表都有哪几个MySQL的binlog有有几种录入格式?分别有什么区别?数据类型mysql有哪些数据类型引擎MySQL存储引擎MyISAM与InnoDB区别MyISAM索引与InnoDB索引的区别?InnoDB引擎的4大特性存储引擎选择索引什么是索引?索引有哪些优缺点?索引使用场景(重点)...

女朋友过生日,我花了20分钟给她写了一个代理服务器

女朋友说:“看你最近挺辛苦的,我送你一个礼物吧。你看看想要什么,我来准备。” 我想了半天,从书到鞋子到电子产品最后到生活用品,感觉自己什么都不缺,然后和她说:“你省省钱吧,我什么都不需要。” 她坚持要送:“不行,你一定要说一个礼物,我想送你东西了。” 于是,我认真了起来,拿起手机,上淘宝逛了几分钟,但还是没能想出来缺点什么,最后实在没办法了:“这样吧,如果你实在想送东西,那你就写一个代理服务器吧”...

记一次腾讯面试,我挂在了最熟悉不过的队列上……

腾讯后台面试,面试官问:如何自己实现队列?

如果你是老板,你会不会踢了这样的员工?

有个好朋友ZS,是技术总监,昨天问我:“有一个老下属,跟了我很多年,做事勤勤恳恳,主动性也很好。但随着公司的发展,他的进步速度,跟不上团队的步伐了,有点...

我入职阿里后,才知道原来简历这么写

私下里,有不少读者问我:“二哥,如何才能写出一份专业的技术简历呢?我总感觉自己写的简历太烂了,所以投了无数份,都石沉大海了。”说实话,我自己好多年没有写过简历了,但我认识的一个同行,他在阿里,给我说了一些他当年写简历的方法论,我感觉太牛逼了,实在是忍不住,就分享了出来,希望能够帮助到你。 01、简历的本质 作为简历的撰写者,你必须要搞清楚一点,简历的本质是什么,它就是为了来销售你的价值主张的。往深...

程序员写出这样的代码,能不挨骂吗?

当你换槽填坑时,面对一个新的环境。能够快速熟练,上手实现业务需求是关键。但是,哪些因素会影响你快速上手呢?是原有代码写的不够好?还是注释写的不够好?昨夜...

带了6个月的徒弟当了面试官,而身为高级工程师的我天天修Bug......

即将毕业的应届毕业生一枚,现在只拿到了两家offer,但最近听到一些消息,其中一个offer,我这个组据说客户很少,很有可能整组被裁掉。 想问大家: 如果我刚入职这个组就被裁了怎么办呢? 大家都是什么时候知道自己要被裁了的? 面试软技能指导: BQ/Project/Resume 试听内容: 除了刷题,还有哪些技能是拿到offer不可或缺的要素 如何提升面试软实力:简历, 行为面试,沟通能...

!大部分程序员只会写3年代码

如果世界上都是这种不思进取的软件公司,那别说大部分程序员只会写 3 年代码,恐怕就没有程序员这种职业。

离职半年了,老东家又发 offer,回不回?

有小伙伴问松哥这个问题,他在上海某公司,在离职了几个月后,前公司的领导联系到他,希望他能够返聘回去,他很纠结要不要回去? 俗话说好马不吃回头草,但是这个小伙伴既然感到纠结了,我觉得至少说明了两个问题:1.曾经的公司还不错;2.现在的日子也不是很如意。否则应该就不会纠结了。 老实说,松哥之前也有过类似的经历,今天就来和小伙伴们聊聊回头草到底吃不吃。 首先一个基本观点,就是离职了也没必要和老东家弄的苦...

2020阿里全球数学大赛:3万名高手、4道题、2天2夜未交卷

阿里巴巴全球数学竞赛( Alibaba Global Mathematics Competition)由马云发起,由中国科学技术协会、阿里巴巴基金会、阿里巴巴达摩院共同举办。大赛不设报名门槛,全世界爱好数学的人都可参与,不论是否出身数学专业、是否投身数学研究。 2020年阿里巴巴达摩院邀请北京大学、剑桥大学、浙江大学等高校的顶尖数学教师组建了出题组。中科院院士、美国艺术与科学院院士、北京国际数学...

HTTP与HTTPS的区别

面试官问HTTP与HTTPS的区别,我这样回答让他竖起大拇指!

男生更看重女生的身材脸蛋,还是思想?

往往,我们看不进去大段大段的逻辑。深刻的哲理,往往短而精悍,一阵见血。问:产品经理挺漂亮的,有点心动,但不知道合不合得来。男生更看重女生的身材脸蛋,还是...

程序员为什么千万不要瞎努力?

本文作者用对比非常鲜明的两个开发团队的故事,讲解了敏捷开发之道 —— 如果你的团队缺乏统一标准的环境,那么即使勤劳努力,不仅会极其耗时而且成果甚微,使用...

为什么程序员做外包会被瞧不起?

二哥,有个事想询问下您的意见,您觉得应届生值得去外包吗?公司虽然挺大的,中xx,但待遇感觉挺低,马上要报到,挺纠结的。

当HR压你价,说你只值7K,你该怎么回答?

当HR压你价,说你只值7K时,你可以流畅地回答,记住,是流畅,不能犹豫。 礼貌地说:“7K是吗?了解了。嗯~其实我对贵司的面试官印象很好。只不过,现在我的手头上已经有一份11K的offer。来面试,主要也是自己对贵司挺有兴趣的,所以过来看看……”(未完) 这段话主要是陪HR互诈的同时,从公司兴趣,公司职员印象上,都给予对方正面的肯定,既能提升HR的好感度,又能让谈判气氛融洽,为后面的发挥留足空间。...

面试:第十六章:Java中级开发(16k)

HashMap底层实现原理,红黑树,B+树,B树的结构原理 Spring的AOP和IOC是什么?它们常见的使用场景有哪些?Spring事务,事务的属性,传播行为,数据库隔离级别 Spring和SpringMVC,MyBatis以及SpringBoot的注解分别有哪些?SpringMVC的工作原理,SpringBoot框架的优点,MyBatis框架的优点 SpringCould组件有哪些,他们...

立即提问
相关内容推荐