ubuntu18.04安装Opencv3.10的问题?

ubuntu18.04安装Opencv时,需要安装一些依赖项,但是在安装libjasper-dev时,提示
无法定位软件包。
系统提示如下:
图片说明
有人知道这是什么原因吗?如何解决的?

2个回答

我之前也遇到这个问题,
stack overflow上有人解决这个问题: https://stackoverflow.com/questions/44468081/unable-to-locate-package-libjasper-dev
方法一:
echo "deb http://us.archive.ubuntu.com/ubuntu/ yakkety universe" | sudo tee -a /etc/apt/sources.list
sudo apt-get update
sudo apt-get install libjasper-dev
方法二:
sudo add-apt-repository "deb http://security.ubuntu.com/ubuntu xenial-security main"
sudo apt update
sudo apt install libjasper1 libjasper-dev

qq_40641575
江上雨 C币你们领了吗?没有的话怎么发给你们?
一年多之前 回复
qq_40641575
江上雨 非常感谢你的解答哈哈 哈哈哈 笑哈哈 哈哈哈 ,已经解决。强 厉害 赞 真棒强 厉害 赞 真棒
一年多之前 回复

从jasper官网下载源码后自己编译安装
http://www.ece.uvic.ca/~frodo/jasper/#download

qq_40641575
江上雨 C币你们领了吗?没有的话怎么发给你们?
一年多之前 回复
qq_40641575
江上雨 感谢你的解答大笑 高兴 笑脸 嗨皮大笑 高兴 笑脸 嗨皮
一年多之前 回复
Csdn user default icon
上传中...
上传图片
插入图片
抄袭、复制答案,以达到刷声望分或其他目的的行为,在CSDN问答是严格禁止的,一经发现立刻封号。是时候展现真正的技术了!
其他相关推荐
Ubuntu18.04配置OPENCV3.3.1时make报错
在给Ubuntu18.04下载编译openCV3.3.1时, 参照https://blog.csdn.net/zhaoxr233/article/details/90036824 在做到make那一步时,报了以下error,在网上查询无果,不知如何解决,烦请各位大佬指点 ``` Linking CXX executable ../../bin/opencv_visualisation ../../lib/libopencv_core.a(hal_internal.cpp.o):在函数‘lapack_gemm32f(float const*, unsigned long, float const*, unsigned long, float, float const*, unsigned long, float, float*, unsigned long, int, int, int, int)’中: hal_internal.cpp:(.text._Z14lapack_gemm32fPKfmS0_mfS0_mfPfmiiii+0x3d2):对‘cblas_sgemm(CBLAS_ORDER, CBLAS_TRANSPOSE, CBLAS_TRANSPOSE, int, int, int, float, float const*, int, float const*, int, float, float*, int)’未定义的引用 ............ ../../lib/libopencv_core.a(hal_internal.cpp.o):在函数‘lapack_gemm64fc(double const*, unsigned long, double const*, unsigned long, double, double const*, unsigned long, double, double*, unsigned long, int, int, int, int)’中: hal_internal.cpp:(.text._Z15lapack_gemm64fcPKdmS0_mdS0_mdPdmiiii+0x29e):对‘cblas_zgemm(CBLAS_ORDER, CBLAS_TRANSPOSE, CBLAS_TRANSPOSE, int, int, int, void const*, void const*, int, void const*, int, void const*, void*, int)’未定义的引用 hal_internal.cpp:(.text._Z15lapack_gemm64fcPKdmS0_mdS0_mdPdmiiii+0x2f5):对‘cblas_cgemm(CBLAS_ORDER, CBLAS_TRANSPOSE, CBLAS_TRANSPOSE, int, int, int, void const*, void const*, int, void const*, int, void const*, void*, int)’未定义的引用 collect2: error: ld returned 1 exit status apps/annotation/CMakeFiles/opencv_annotation.dir/build.make:119: recipe for target 'bin/opencv_annotation' failed make[2]: *** [bin/opencv_annotation] Error 1 CMakeFiles/Makefile2:4522: recipe for target 'apps/annotation/CMakeFiles/opencv_annotation.dir/all' failed make[1]: *** [apps/annotation/CMakeFiles/opencv_annotation.dir/all] Error 2 ```
求助帖!!!ubuntu18.04 安装opencv4.0.0源码无限次出现如下问题
./src/image_opencv.cpp: In function ‘IplImage* image_to_ipl(image)’: ./src/image_opencv.cpp:16:5: error: ‘IPlImage’ was not declared in this scope IPlImage *disp = cvCreateImage(cvSize(im.w,im.h), IPL_DEPTH_8U, im.c); ^~~~~~~~ compilation terminated due to -Wfatal-errors. Makefile:86: recipe for target 'obj/image_opencv.o' failed make: *** [obj/image_opencv.o] Error 1 make: *** Waiting for unfinished jobs.... 但我在src文件夹中的image_opencv.cpp中也引入了#include "opencv2/imgproc/imgproc_c.h" 求助实在不知道怎么办了
ubuntu16.04安装opencv时,make不通过该怎么办?
cmake已经完成,情况如下: ``` cmake .. -- Detected version of GNU GCC: 54 (504) -- Found ZLIB: /usr/lib/x86_64-linux-gnu/libz.so (found suitable version "1.2.8", minimum required is "1.2.3") -- Found ZLIB: /usr/lib/x86_64-linux-gnu/libz.so (found version "1.2.8") -- Checking for module 'gstreamer-base-1.0' -- No package 'gstreamer-base-1.0' found -- Checking for module 'gstreamer-video-1.0' -- No package 'gstreamer-video-1.0' found -- Checking for module 'gstreamer-app-1.0' -- No package 'gstreamer-app-1.0' found -- Checking for module 'gstreamer-riff-1.0' -- No package 'gstreamer-riff-1.0' found -- Checking for module 'gstreamer-pbutils-1.0' -- No package 'gstreamer-pbutils-1.0' found -- Checking for module 'gstreamer-base-0.10' -- No package 'gstreamer-base-0.10' found -- Checking for module 'gstreamer-video-0.10' -- No package 'gstreamer-video-0.10' found -- Checking for module 'gstreamer-app-0.10' -- No package 'gstreamer-app-0.10' found -- Checking for module 'gstreamer-riff-0.10' -- No package 'gstreamer-riff-0.10' found -- Checking for module 'gstreamer-pbutils-0.10' -- No package 'gstreamer-pbutils-0.10' found -- Looking for linux/videodev.h -- Looking for linux/videodev.h - not found -- Looking for linux/videodev2.h -- Looking for linux/videodev2.h - found -- Looking for sys/videoio.h -- Looking for sys/videoio.h - not found -- Checking for module 'libavresample' -- No package 'libavresample' found -- Looking for libavformat/avformat.h -- Looking for libavformat/avformat.h - found -- Looking for ffmpeg/avformat.h -- Looking for ffmpeg/avformat.h - not found -- Checking for module 'libgphoto2' -- No package 'libgphoto2' found -- found IPP (ICV version): 9.0.1 [9.0.1] -- at: /home/quxutao/opencv-3.1.0/3rdparty/ippicv/unpack/ippicv_lnx -- CUDA detected: 7.5 -- CUDA NVCC target flags: -gencode;arch=compute_20,code=sm_20;-gencode;arch=compute_20,code=sm_21;-gencode;arch=compute_30,code=sm_30;-gencode;arch=compute_35,code=sm_35;-gencode;arch=compute_30,code=compute_30 -- Could NOT find Doxygen (missing: DOXYGEN_EXECUTABLE) -- To enable PlantUML support, set PLANTUML_JAR environment variable or pass -DPLANTUML_JAR=<filepath> option to cmake -- Could NOT find PythonInterp: Found unsuitable version "1.4", but required is at least "2.7" (found /home/quxutao/.virtualenvs/cv/bin/python) -- Could NOT find PythonInterp: Found unsuitable version "1.4", but required is at least "2.6" (found /home/quxutao/.virtualenvs/cv/bin/python) -- Could NOT find PythonInterp: Found unsuitable version "1.4", but required is at least "3.4" (found /home/quxutao/.virtualenvs/cv/bin/python) -- Could NOT find PythonInterp: Found unsuitable version "1.4", but required is at least "3.2" (found /home/quxutao/.virtualenvs/cv/bin/python) -- Could NOT find JNI (missing: JAVA_INCLUDE_PATH JAVA_INCLUDE_PATH2 JAVA_AWT_INCLUDE_PATH) -- Could NOT find Matlab (missing: MATLAB_MEX_SCRIPT MATLAB_INCLUDE_DIRS MATLAB_ROOT_DIR MATLAB_LIBRARIES MATLAB_LIBRARY_DIRS MATLAB_MEXEXT MATLAB_ARCH MATLAB_BIN) -- VTK is not found. Please set -DVTK_DIR in CMake to VTK build directory, or to VTK install subdirectory with VTKConfig.cmake file -- Caffe: NO -- Protobuf: YES -- Glog: NO -- HDF5: YES -- Module opencv_sfm disabled because the following dependencies are not found: Eigen Glog/Gflags -- Tesseract: NO -- HDF5: YES -- Build libprotobuf from sources: -- The protocol buffer compiler not found -- Tesseract: NO -- -- General configuration for OpenCV 3.1.0 ===================================== -- Version control: unknown -- -- Platform: -- Host: Linux 4.15.0-47-generic x86_64 -- CMake: 3.5.1 -- CMake generator: Unix Makefiles -- CMake build tool: /usr/bin/make -- Configuration: RELEASE -- -- C/C++: -- Built as dynamic libs?: YES -- C++ Compiler: /usr/bin/c++ (ver 5.4.0) -- C++ flags (Release): -fsigned-char -W -Wall -Werror=return-type -Werror=non-virtual-dtor -Werror=address -Werror=sequence-point -Wformat -Werror=format-security -Wmissing-declarations -Wundef -Winit-self -Wpointer-arith -Wshadow -Wsign-promo -Wno-narrowing -Wno-delete-non-virtual-dtor -fdiagnostics-show-option -Wno-long-long -pthread -fomit-frame-pointer -msse -msse2 -mno-avx -msse3 -mno-ssse3 -mno-sse4.1 -mno-sse4.2 -ffunction-sections -fvisibility=hidden -fvisibility-inlines-hidden -O3 -DNDEBUG -DNDEBUG -- C++ flags (Debug): -fsigned-char -W -Wall -Werror=return-type -Werror=non-virtual-dtor -Werror=address -Werror=sequence-point -Wformat -Werror=format-security -Wmissing-declarations -Wundef -Winit-self -Wpointer-arith -Wshadow -Wsign-promo -Wno-narrowing -Wno-delete-non-virtual-dtor -fdiagnostics-show-option -Wno-long-long -pthread -fomit-frame-pointer -msse -msse2 -mno-avx -msse3 -mno-ssse3 -mno-sse4.1 -mno-sse4.2 -ffunction-sections -fvisibility=hidden -fvisibility-inlines-hidden -g -O0 -DDEBUG -D_DEBUG -- C Compiler: /usr/bin/cc -- C flags (Release): -fsigned-char -W -Wall -Werror=return-type -Werror=non-virtual-dtor -Werror=address -Werror=sequence-point -Wformat -Werror=format-security -Wmissing-declarations -Wmissing-prototypes -Wstrict-prototypes -Wundef -Winit-self -Wpointer-arith -Wshadow -Wno-narrowing -fdiagnostics-show-option -Wno-long-long -pthread -fomit-frame-pointer -msse -msse2 -mno-avx -msse3 -mno-ssse3 -mno-sse4.1 -mno-sse4.2 -ffunction-sections -fvisibility=hidden -O3 -DNDEBUG -DNDEBUG -- C flags (Debug): -fsigned-char -W -Wall -Werror=return-type -Werror=non-virtual-dtor -Werror=address -Werror=sequence-point -Wformat -Werror=format-security -Wmissing-declarations -Wmissing-prototypes -Wstrict-prototypes -Wundef -Winit-self -Wpointer-arith -Wshadow -Wno-narrowing -fdiagnostics-show-option -Wno-long-long -pthread -fomit-frame-pointer -msse -msse2 -mno-avx -msse3 -mno-ssse3 -mno-sse4.1 -mno-sse4.2 -ffunction-sections -fvisibility=hidden -g -O0 -DDEBUG -D_DEBUG -- Linker flags (Release): -- Linker flags (Debug): -- Precompiled headers: YES -- Extra dependencies: /usr/lib/x86_64-linux-gnu/libpng.so /usr/lib/x86_64-linux-gnu/libtiff.so /usr/lib/x86_64-linux-gnu/libjasper.so /usr/lib/x86_64-linux-gnu/libjpeg.so gtk-3 gdk-3 pangocairo-1.0 pango-1.0 atk-1.0 cairo-gobject cairo gdk_pixbuf-2.0 gio-2.0 gobject-2.0 gthread-2.0 glib-2.0 dc1394 v4l1 v4l2 avcodec-ffmpeg avformat-ffmpeg avutil-ffmpeg swscale-ffmpeg /usr/lib/x86_64-linux-gnu/libbz2.so /usr/lib/x86_64-linux-gnu/hdf5/openmpi/lib/libhdf5.so /usr/lib/x86_64-linux-gnu/libsz.so /usr/lib/x86_64-linux-gnu/libz.so /usr/lib/x86_64-linux-gnu/libdl.so /usr/lib/x86_64-linux-gnu/libm.so dl m pthread rt cudart nppc nppi npps cufft -L/usr/lib/x86_64-linux-gnu -- 3rdparty dependencies: libwebp IlmImf libprotobuf -- -- OpenCV modules: -- To be built: cudev core cudaarithm flann hdf imgproc ml reg surface_matching video cudabgsegm cudafilters cudaimgproc cudawarping dnn fuzzy imgcodecs photo shape videoio cudacodec highgui objdetect plot ts xobjdetect xphoto bgsegm bioinspired dpm face features2d line_descriptor saliency text calib3d ccalib cudafeatures2d cudalegacy cudaobjdetect cudaoptflow cudastereo datasets rgbd stereo structured_light superres tracking videostab xfeatures2d ximgproc aruco optflow stitching -- Disabled: world contrib_world -- Disabled by dependency: - -- Unavailable: java python2 python3 viz cvv matlab sfm -- -- GUI: -- QT: NO -- GTK+ 3.x: YES (ver 3.18.9) -- GThread : YES (ver 2.48.2) -- GtkGlExt: NO -- OpenGL support: NO -- VTK support: NO -- -- Media I/O: -- ZLib: /usr/lib/x86_64-linux-gnu/libz.so (ver 1.2.8) -- JPEG: /usr/lib/x86_64-linux-gnu/libjpeg.so (ver ) -- WEBP: build (ver 0.3.1) -- PNG: /usr/lib/x86_64-linux-gnu/libpng.so (ver 1.2.54) -- TIFF: /usr/lib/x86_64-linux-gnu/libtiff.so (ver 42 - 4.0.6) -- JPEG 2000: /usr/lib/x86_64-linux-gnu/libjasper.so (ver 1.900.1) -- OpenEXR: build (ver 1.7.1) -- GDAL: NO -- -- Video I/O: -- DC1394 1.x: NO -- DC1394 2.x: YES (ver 2.2.4) -- FFMPEG: YES -- codec: YES (ver 56.60.100) -- format: YES (ver 56.40.101) -- util: YES (ver 54.31.100) -- swscale: YES (ver 3.1.101) -- resample: NO -- gentoo-style: YES -- GStreamer: NO -- OpenNI: NO -- OpenNI PrimeSensor Modules: NO -- OpenNI2: NO -- PvAPI: NO -- GigEVisionSDK: NO -- UniCap: NO -- UniCap ucil: NO -- V4L/V4L2: Using libv4l1 (ver 1.10.0) / libv4l2 (ver 1.10.0) -- XIMEA: NO -- Xine: NO -- gPhoto2: NO -- -- Parallel framework: pthreads -- -- Other third-party libraries: -- Use IPP: 9.0.1 [9.0.1] -- at: /home/quxutao/opencv-3.1.0/3rdparty/ippicv/unpack/ippicv_lnx -- Use IPP Async: NO -- Use VA: NO -- Use Intel VA-API/OpenCL: NO -- Use Eigen: NO -- Use Cuda: YES (ver 7.5) -- Use OpenCL: YES -- Use custom HAL: NO -- -- NVIDIA CUDA -- Use CUFFT: YES -- Use CUBLAS: NO -- USE NVCUVID: NO -- NVIDIA GPU arch: 20 21 30 35 -- NVIDIA PTX archs: 30 -- Use fast math: NO -- -- OpenCL: -- Version: dynamic -- Include path: /home/quxutao/opencv-3.1.0/3rdparty/include/opencl/1.2 -- Use AMDFFT: NO -- Use AMDBLAS: NO -- -- Python 2: -- Interpreter: NO -- -- Python 3: -- Interpreter: NO -- -- Python (for build): NO -- -- Java: -- ant: NO -- JNI: NO -- Java wrappers: NO -- Java tests: NO -- -- Matlab: Matlab not found or implicitly disabled -- -- Documentation: -- Doxygen: NO -- PlantUML: NO -- -- Tests and samples: -- Tests: YES -- Performance tests: YES -- C/C++ Examples: YES -- -- Install path: /usr/local -- -- cvconfig.h is in: /home/quxutao/opencv-3.1.0/build -- ----------------------------------------------------------------- -- -- Configuring done -- Generating done -- Build files have been written to: /home/quxutao/opencv-3.1.0/build ``` 但是make的时候,就报错: ``` make [ 4%] Built target libwebp [ 4%] Built target IlmImf [ 4%] Built target opencv_cudev [ 4%] Built target opencv_core_pch_dephelp [ 4%] Built target pch_Generate_opencv_core [ 4%] Building NVCC (Device) object modules/core/CMakeFiles/cuda_compile.dir/src/cuda/cuda_compile_generated_gpu_mat.cu.o /usr/include/string.h: In function ‘void* __mempcpy_inline(void*, const void*, size_t)’: /usr/include/string.h:652:42: error: ‘memcpy’ was not declared in this scope return (char *) memcpy (__dest, __src, __n) + __n; ^ CMake Error at cuda_compile_generated_gpu_mat.cu.o.cmake:266 (message): Error generating file /home/quxutao/opencv-3.1.0/build/modules/core/CMakeFiles/cuda_compile.dir/src/cuda/./cuda_compile_generated_gpu_mat.cu.o modules/core/CMakeFiles/opencv_core.dir/build.make:399: recipe for target 'modules/core/CMakeFiles/cuda_compile.dir/src/cuda/cuda_compile_generated_gpu_mat.cu.o' failed make[2]: *** [modules/core/CMakeFiles/cuda_compile.dir/src/cuda/cuda_compile_generated_gpu_mat.cu.o] Error 1 CMakeFiles/Makefile2:2307: recipe for target 'modules/core/CMakeFiles/opencv_core.dir/all' failed make[1]: *** [modules/core/CMakeFiles/opencv_core.dir/all] Error 2 Makefile:160: recipe for target 'all' failed make: *** [all] Error 2 ``` 弄了一下午了,没有找到相关的解决办法。我的cuda是7.5,其实不用GPU也可以的,我只是想用KAZE滤波。。。跪求大神帮忙。。。
opencv3.4.3配置 opencv contrib后,无法读取opencv_aruco343d.dll,怎么解决?
我需要opencv的sift算法,opencv3.4.3要用的话,需要配置opencv contrib。 我根据网上教程配置完以后,运行一段代码出现“无法读取opencv_aruco343d.dll” 的问题,我重新编译,生成过这个dll文件。但还是不行,不知道问题出哪里了。
ubuntu12.04下 opencv库交叉编译后 动态库找不到
ubuntu上我装了pc 和arm 两个版本的opencv2.4.9 目录分别是/usr/local/opencv2.4.9 和/opt/opencv2.4.9-for-arm pc版本的库文件都在/usr/local/lib下 arm版本库文件在/opt/opencv2.4.9-for-arm/lib下 whereis libopencv___core 的时候,只列出的/usr/local/lib/libopencv_core.so 交叉编译器在/opt/Embedsky/gcc-4.6.2-glibc-2.13-linaro-multilib-2011.12/tq-linaro-toolchain/bin下 我写一个opencv测试程序test.cpp 交叉编译出现警告 ``` # arm-linux-g++ -o test test.cpp -I /opt/opencv2.4.9-for-arm/lib/include -L /opt/opencv2.4.9-for-arm/lib -lopencv_core -lopencv_highgui -lpthread -lrt In file included from /opt/opencv2.4.9-for-arm/lib/include/opencv2/flann/kmeans_index.h:50:0, from /opt/opencv2.4.9-for-arm/lib/include/opencv2/flann/all_indices.h:38, from /opt/opencv2.4.9-for-arm/lib/include/opencv2/flann/flann_base.hpp:44, from /opt/opencv2.4.9-for-arm/lib/include/opencv2/flann/flann.hpp:50, from /opt/opencv2.4.9-for-arm/lib/include/opencv/cv.h:69, from test.cpp:2: /opt/opencv2.4.9-for-arm/lib/include/opencv2/flann/logger.h:73:9: note: the mangling of 'va_list' has changed in GCC 4.4 /opt/Embedsky/gcc-4.6.2-glibc-2.13-linaro-multilib-2011.12/tq-linaro-toolchain/bin/../lib/gcc/arm-fsl-linux-gnueabi/4.6.2/../../../../arm-fsl-linux-gnueabi/bin/ld: warning: ../../lib/libopencv_core.so, needed by /opt/opencv2.4.9-for-arm/lib/libopencv_highgui.so, not found (try using -rpath or -rpath-link) /opt/Embedsky/gcc-4.6.2-glibc-2.13-linaro-multilib-2011.12/tq-linaro-toolchain/bin/../lib/gcc/arm-fsl-linux-gnueabi/4.6.2/../../../../arm-fsl-linux-gnueabi/bin/ld: warning: ../../lib/libopencv_imgproc.so, needed by /opt/opencv2.4.9-for-arm/lib/libopencv_highgui.so, not found (try using -rpath or -rpath-link) root@tsie-All-Series:/home/tsie/nfs/test/opencv_test# whereis libopencv_core libopencv_core: /usr/local/lib/libopencv_core.so ``` 这里面好像用到交叉编译器的ld,找opencv的.so文件看提示是跑到交叉编译器所在文件夹里面的lib去找?? 我也吧opencv的交叉库放到这个文件夹里面,再编译还是同样的问题 然后我尝试加上运行时库路径参数 -Wl,-rpath,/opt/opencv2.4.9-for-arm/lib,再编译,弹出来一样的信息。 然后,就没有然后了。我晕 这究竟谁什么问题啊 求各路大神给点思路
为什么vs2019配置opencv包含目录的路径..\opencv\build\include还要再配置..\opencv\build\include\opencv2
在使用vs2019开发opencv应用的过程中发现,配置项目属性中包含目录和库目录时,需要增加..\opencv\build\include和..\opencv\build\include\opencv2这两个路径,opencv2包含在include下面,那么为什么不能只用\opencv\build\include这一个路径(会找不到头文件)
ubuntu13.04中编译opencv时出现以下错误
在ubuntu12.04中编译可以通过,而升级到13.04后,编译opencv时出现/usr/lib/i386-linux-gnu/libstdc++.so.6: could not read symbols: Invalid operation /usr/bin/ld: /tmp/ccVGeZGe.o: undefined reference to symbol '_ZNSt8ios_base4InitC1Ev@@GLIBCXX_3.4' 请问是什么情况
opencv3.2与opencv 2.8 切换的问题
我的ubuntu系统原来安装了opencv2.8,现在由于实际需要,安装了opencv3.2。但是,opencv2.8还得继续保留。利用pkg-config --modversion opencv 查看opencv的版本,显示是3.2.0。原来(opencv2.8下),CMakeList文件是这样写的。 project(test) find_package(OpenCV REQUIRED) add_executable(test src/test.cpp) target_link_libraries(test ${OpenCV_LIBS}) cmake_minimum_required(VERSION 2.8) 我使用opencv3.2编译的时候,按照要求,我把路径给加上了。 project(test) find_package(OpenCV REQUIRED) set(OpenCV_DIR "/usr/local/opencv320/share/OpenCV") INCLUDE_DIRECTORIES(${OpenCV_INCLUDE_DIRS}) add_executable(test src/test.cpp) target_link_libraries(test ${OpenCV_LIBS}) cmake_minimum_required(VERSION 3.2) 但是显示错误:要求的opencv版本太高,当前运行版本为2.8。但是我用 pkg-config --modversion opencv 查看版本,显示的是3.2.0
ubuntu16.04安装caffe时编译遇到的问题
![图片说明](https://img-ask.csdn.net/upload/201801/15/1516010855_935381.jpg) 第一次在安装caffe的时候,make all -j16报这个错,cuda、cudnn、nccl、opencv都装成功了 ,依赖包也都装了,实在是不知道哪里的问题,大神帮忙出来看一下吧!!!
配置QtCreator5.5.1与opencv3.3.1,执行mingw32-make出错。
windows7配置QtCreator5.5.1与opencv3.3.1,执行mingw32-make出错。 求大神解答!!!
请问如何解决ubunt14.04配置opencv报错(虚拟机)(gedit:11818)
按配置教程是要: 安装完成后需要对系统相关环境变量进行配置: sudo gedit /etc/ld.so.conf.d/opencv.conf 将以下内容添加到最后: /usr/local/lib 报错如下,输入sudo gedit /etc/ld.so.conf.d/opencv.conf后打开了一个文件,在里面我输入了/usr/local/lib,出现报错: (gedit:11818): IBUS-WARNING **: The owner of /home/aa/.config/ibus/bus is not root!  (gedit:11818): Gtk-WARNING **: Calling Inhibit failed: GDBus.Error:org.freedesktop.DBus.Error.ServiceUnknown: The name org.gnome.SessionManager was not provided by any .service files 谢谢
如何在ubuntu16.04下配置ratslam算法?
如何在ubuntu16.04 + ROSkinetic + Opencv3.4 配置ratslam算法?? 我自己编译了一下OpenRatSLAM,失败了,截图如下: ![图片说明](https://img-ask.csdn.net/upload/201902/23/1550911963_325002.png)
vc6.0使用opencv 配置好了但是下一次打开时又没有了
vc6.0使用opencv 配置好include了但是下一次打开时又没有了,这是怎么回事
在Qt5.3.1中opencv2.4.9配置的问题
(这是mainwindow.h里的内容,中间四个include包含的文件总是找不到) #ifndef MAINWINDOW_H #define MAINWINDOW_H //#include <QtGui/QMainWindow> #include <QtWidgets/QMainWindow> #include <opencv2/opencv.hpp> #include <opencv2/core/core.hpp> #include <opencv2/imgproc/imgproc.hpp> #include <opencv2/highgui/highgui.hpp> //#include "cv.h" //#include "cxcore.h" //#include "highgui.h" #include<QImage> #include<QPixmap> #include<iostream> using namespace std; using namespace cv; class MainWindow : public QMainWindow { ……(后面不打了) (这是pro文件里opencv的配置,我的opencv文件是放在c:\opencv文件夹里的,系统的环境变量自己也配了) INCLUDEPATH+=c:\opencv\opencv\build\include\opencv\ c:\opencv\opencv\build\include\opencv2\ c:\opencv\opencv\build\include\ LIBS+=c:\opencv\opencv\MinGW\lib\libopencv_calib3d249.dll.a\ c:\opencv\opencv\MinGW\lib\libopencv_contrib249.dll.a\ c:\opencv\opencv\MinGW\lib\libopencv_core249.dll.a\ c:\opencv\opencv\MinGW\lib\libopencv_features2d249.dll.a\ c:\opencv\opencv\MinGW\lib\libopencv_flann249.dll.a\ c:\opencv\opencv\MinGW\lib\libopencv_gpu249.dll.a\ c:\opencv\opencv\MinGW\lib\libopencv_highgui249.dll.a\ c:\opencv\opencv\MinGW\lib\libopencv_imgproc249.dll.a\ c:\opencv\opencv\MinGW\lib\libopencv_legacy249.dll.a\ c:\opencv\opencv\MinGW\lib\libopencv_ml249.dll.a\ c:\opencv\opencv\MinGW\lib\libopencv_objdetect249.dll.a\ c:\opencv\opencv\MinGW\lib\libopencv_video249.dll.a
cv2.error:Opencv(3.4.3)
s = robot.get_camera_data() plt.imshow(s) plt.show() s_ = robot.get_camera_data() print (s_.shape) plt.imshow(s_) plt.show() flow = cv2.calcOpticalFlowFarneback(s, s_, None, 0.5, 3, 15, 3, 5, 1.2, 0) ``` s与s_分别为在仿真环境中采集到的3通道图片数据,但是 运行代码报错,在网上也没有找到相关问题,谢谢大家。 ``` cv2.error: OpenCV(3.4.3) C:\projects\opencv-python\opencv\modules\video\src\optflowgf.cpp:1114: error: (-215:Assertion failed) prev0.size() == next0.size() && prev0.channels() == next0.channels() && prev0.channels() == 1 && pyrScale_ < 1 in function 'cv::`anonymous-namespace'::FarnebackOpticalFlowImpl::calc' 此处为代码运行错误。
Ubuntu 16.04 安装pcl时 编译总是出错
小白,显示在电脑中安装了ros 、opencv,然后准备安装pcl 跟着网上主流的教程一步一步做,从github上下了包,然后cmake 然后 make -j4 但是在make时总是报错: 求大神帮忙这是为什么 怎么解决?
用Ubuntu16.04编译iDT算法(c++)时报错:/usr/lib/gcc/x86_64-linux-gnu/5/../../../x86_64-linux-gnu/crt1.o: In function `_start':(.text+0x20): undefined reference to `main'
最近在学习iDT算法,刚刚接触Ubuntu也刚刚接触c++,很多东西不是很懂,请教各位: 我在编译iDT算法的时候,需要依赖opencv和ffmpeg两个库,我安装成功并且确保这两个库能用之后,去编译iDT算法,'make'之后报错: ![图片说明](https://img-ask.csdn.net/upload/202001/10/1578648835_846854.png) 查过资料,有的人说是缺少main函数,但是我确保.cpp文件里是有main函数的。 也有帖子说是crt1.o文件的问题,也有帖子说是动态库的问题,现在很迷茫,不知道问题出在哪里,希望各位能够帮助我,万分感谢。 同时为了方便各位帮我找到问题,我上一下我的makefile文件以及Opencv和ffmpeg的安装信息。 Makefile文件 ``` # set the binaries that have to be built TARGETS := DenseTrack Video # set the build configuration set BUILD := release #BUILD := debug # set bin and build dirs BUILDDIR := .build_$(BUILD) BINDIR := $(BUILD) # libraries LDLIBS = $(addprefix -l, $(LIBS) $(LIBS_$(notdir $*))) LIBS := \ opencv_core opencv_highgui opencv_video opencv_imgproc \ avformat avdevice avutil avcodec swscale # set some flags and compiler/linker specific commands CXXFLAGS = -pipe -D __STDC_CONSTANT_MACROS -D STD=std -Wall $(CXXFLAGS_$(BUILD)) -I. -I/opt/include CXXFLAGS_debug := -ggdb CXXFLAGS_release := -O3 -DNDEBUG -ggdb LDFLAGS = -L/opt/lib -pipe -Wall $(LDFLAGS_$(BUILD)) LDFLAGS_debug := -ggdb LDFLAGS_release := -O3 -ggdb include make/generic.mk ``` 下面是opencv和ffmpeg的安装信息: ffmpeg: ![图片说明](https://img-ask.csdn.net/upload/202001/10/1578649174_591798.png) opencv: ![图片说明](https://img-ask.csdn.net/upload/202001/10/1578649330_643110.png) 恳请各位帮忙!!(小弟没有金币,没办法给悬赏,还请各位见谅!)
编译caffe时出现这个问题~求解系统ubuntu15.04
![图片说明](https://img-ask.csdn.net/upload/201602/25/1456393797_222555.png)请问能帮忙解决吗?新手练习。opencv3.0,不行的话能请教怎么卸载opencv3.0吗?用的SH文件装的。linux新手见谅。
终于明白阿里百度这样的大公司,为什么面试经常拿ThreadLocal考验求职者了
点击上面↑「爱开发」关注我们每晚10点,捕获技术思考和创业资源洞察什么是ThreadLocalThreadLocal是一个本地线程副本变量工具类,各个线程都拥有一份线程私有的数
程序员必须掌握的核心算法有哪些?
由于我之前一直强调数据结构以及算法学习的重要性,所以就有一些读者经常问我,数据结构与算法应该要学习到哪个程度呢?,说实话,这个问题我不知道要怎么回答你,主要取决于你想学习到哪些程度,不过针对这个问题,我稍微总结一下我学过的算法知识点,以及我觉得值得学习的算法。这些算法与数据结构的学习大多数是零散的,并没有一本把他们全部覆盖的书籍。下面是我觉得值得学习的一些算法以及数据结构,当然,我也会整理一些看过
Linux(服务器编程):15---两种高效的事件处理模式(reactor模式、proactor模式)
前言 同步I/O模型通常用于实现Reactor模式 异步I/O模型则用于实现Proactor模式 最后我们会使用同步I/O方式模拟出Proactor模式 一、Reactor模式 Reactor模式特点 它要求主线程(I/O处理单元)只负责监听文件描述符上是否有事件发生,有的话就立即将时间通知工作线程(逻辑单元)。除此之外,主线程不做任何其他实质性的工作 读写数据,接受新的连接,以及处...
阿里面试官问我:如何设计秒杀系统?我的回答让他比起大拇指
你知道的越多,你不知道的越多 点赞再看,养成习惯 GitHub上已经开源 https://github.com/JavaFamily 有一线大厂面试点脑图和个人联系方式,欢迎Star和指教 前言 Redis在互联网技术存储方面使用如此广泛,几乎所有的后端技术面试官都要在Redis的使用和原理方面对小伙伴们进行360°的刁难。 作为一个在互联网公司面一次拿一次Offer的面霸,打败了...
五年程序员记流水账式的自白。
不知觉已中码龄已突破五年,一路走来从起初铁憨憨到现在的十九线程序员,一路成长,虽然不能成为高工,但是也能挡下一面,从15年很火的android开始入坑,走过java、.Net、QT,目前仍处于android和.net交替开发中。 毕业到现在一共就职过两家公司,目前是第二家,公司算是半个创业公司,所以基本上都会身兼多职。比如不光要写代码,还要写软著、软著评测、线上线下客户对接需求收集...
C语言魔塔游戏
很早就很想写这个,今天终于写完了。 游戏截图: 编译环境: VS2017 游戏需要一些图片,如果有想要的或者对游戏有什么看法的可以加我的QQ 2985486630 讨论,如果暂时没有回应,可以在博客下方留言,到时候我会看到。 下面我来介绍一下游戏的主要功能和实现方式 首先是玩家的定义,使用结构体,这个名字是可以自己改变的 struct gamerole { char n
一文详尽系列之模型评估指标
点击上方“Datawhale”,选择“星标”公众号第一时间获取价值内容在机器学习领域通常会根据实际的业务场景拟定相应的不同的业务指标,针对不同机器学习问题如回归、分类、排...
究竟你适不适合买Mac?
我清晰的记得,刚买的macbook pro回到家,开机后第一件事情,就是上了淘宝网,花了500元钱,找了一个上门维修电脑的师傅,上门给我装了一个windows系统。。。。。。 表砍我。。。 当时买mac的初衷,只是想要个固态硬盘的笔记本,用来运行一些复杂的扑克软件。而看了当时所有的SSD笔记本后,最终决定,还是买个好(xiong)看(da)的。 已经有好几个朋友问我mba怎么样了,所以今天尽量客观
程序员一般通过什么途径接私活?
二哥,你好,我想知道一般程序猿都如何接私活,我也想接,能告诉我一些方法吗? 上面是一个读者“烦不烦”问我的一个问题。其实不止是“烦不烦”,还有很多读者问过我类似这样的问题。 我接的私活不算多,挣到的钱也没有多少,加起来不到 20W。说实话,这个数目说出来我是有点心虚的,毕竟太少了,大家轻喷。但我想,恰好配得上“一般程序员”这个称号啊。毕竟苍蝇再小也是肉,我也算是有经验的人了。 唾弃接私活、做外...
压测学习总结(1)——高并发性能指标:QPS、TPS、RT、吞吐量详解
一、QPS,每秒查询 QPS:Queries Per Second意思是“每秒查询率”,是一台服务器每秒能够相应的查询次数,是对一个特定的查询服务器在规定时间内所处理流量多少的衡量标准。互联网中,作为域名系统服务器的机器的性能经常用每秒查询率来衡量。 二、TPS,每秒事务 TPS:是TransactionsPerSecond的缩写,也就是事务数/秒。它是软件测试结果的测量单位。一个事务是指一...
Python爬虫爬取淘宝,京东商品信息
小编是一个理科生,不善长说一些废话。简单介绍下原理然后直接上代码。 使用的工具(Python+pycharm2019.3+selenium+xpath+chromedriver)其中要使用pycharm也可以私聊我selenium是一个框架可以通过pip下载 pip install selenium -i https://pypi.tuna.tsinghua.edu.cn/simple/ 
阿里程序员写了一个新手都写不出的低级bug,被骂惨了。
这种新手都不会范的错,居然被一个工作好几年的小伙子写出来,差点被当场开除了。
Java工作4年来应聘要16K最后没要,细节如下。。。
前奏: 今天2B哥和大家分享一位前几天面试的一位应聘者,工作4年26岁,统招本科。 以下就是他的简历和面试情况。 基本情况: 专业技能: 1、&nbsp;熟悉Sping了解SpringMVC、SpringBoot、Mybatis等框架、了解SpringCloud微服务 2、&nbsp;熟悉常用项目管理工具:SVN、GIT、MAVEN、Jenkins 3、&nbsp;熟悉Nginx、tomca
2020年,冯唐49岁:我给20、30岁IT职场年轻人的建议
点击“技术领导力”关注∆  每天早上8:30推送 作者| Mr.K   编辑| Emma 来源| 技术领导力(ID:jishulingdaoli) 前天的推文《冯唐:职场人35岁以后,方法论比经验重要》,收到了不少读者的反馈,觉得挺受启发。其实,冯唐写了不少关于职场方面的文章,都挺不错的。可惜大家只记住了“春风十里不如你”、“如何避免成为油腻腻的中年人”等不那么正经的文章。 本文整理了冯
程序员该看的几部电影
##1、骇客帝国(1999) 概念:在线/离线,递归,循环,矩阵等 剧情简介: 不久的将来,网络黑客尼奥对这个看似正常的现实世界产生了怀疑。 他结识了黑客崔妮蒂,并见到了黑客组织的首领墨菲斯。 墨菲斯告诉他,现实世界其实是由一个名叫“母体”的计算机人工智能系统控制,人们就像他们饲养的动物,没有自由和思想,而尼奥就是能够拯救人类的救世主。 可是,救赎之路从来都不会一帆风顺,到底哪里才是真实的世界?
Python绘图,圣诞树,花,爱心 | Turtle篇
每周每日,分享Python实战代码,入门资料,进阶资料,基础语法,爬虫,数据分析,web网站,机器学习,深度学习等等。 公众号回复【进群】沟通交流吧,QQ扫码进群学习吧 微信群 QQ群 1.画圣诞树 import turtle screen = turtle.Screen() screen.setup(800,600) circle = turtle.Turtle()...
作为一个程序员,CPU的这些硬核知识你必须会!
CPU对每个程序员来说,是个既熟悉又陌生的东西? 如果你只知道CPU是中央处理器的话,那可能对你并没有什么用,那么作为程序员的我们,必须要搞懂的就是CPU这家伙是如何运行的,尤其要搞懂它里面的寄存器是怎么一回事,因为这将让你从底层明白程序的运行机制。 随我一起,来好好认识下CPU这货吧 把CPU掰开来看 对于CPU来说,我们首先就要搞明白它是怎么回事,也就是它的内部构造,当然,CPU那么牛的一个东
还记得那个提速8倍的IDEA插件吗?VS Code版本也发布啦!!
去年,阿里云发布了本地 IDE 插件 Cloud Toolkit,仅 IntelliJ IDEA 一个平台,就有 15 万以上的开发者进行了下载,体验了一键部署带来的开发便利。时隔一年的今天,阿里云正式发布了 Visual Studio Code 版本,全面覆盖前端开发者,帮助前端实现一键打包部署,让开发提速 8 倍。 VSCode 版本的插件,目前能做到什么? 安装插件之后,开发者可以立即体验...
破14亿,Python分析我国存在哪些人口危机!
2020年1月17日,国家统计局发布了2019年国民经济报告,报告中指出我国人口突破14亿。 猪哥的朋友圈被14亿人口刷屏,但是很多人并没有看到我国复杂的人口问题:老龄化、男女比例失衡、生育率下降、人口红利下降等。 今天我们就来分析一下我们国家的人口数据吧! 一、背景 1.人口突破14亿 2020年1月17日,国家统计局发布了 2019年国民经济报告 ,报告中指出:年末中国大陆总人口(包括31个
2019年除夕夜的有感而发
天气:小雨(加小雪) 温度:3摄氏度 空气:严重污染(399) 风向:北风 风力:微风 现在是除夕夜晚上十点钟,再有两个小时就要新的一年了; 首先要说的是我没患病,至少现在是没有患病;但是心情确像患了病一样沉重; 现在这个时刻应该大部分家庭都在看春晚吧,或许一家人团团圆圆的坐在一起,或许因为某些特殊原因而不能团圆;但不管是身在何处,身处什么境地,我都想对每一个人说一句:新年快乐! 不知道csdn这...
听说想当黑客的都玩过这个Monyer游戏(1~14攻略)
第零关 进入传送门开始第0关(游戏链接) 请点击链接进入第1关: 连接在左边→ ←连接在右边 看不到啊。。。。(只能看到一堆大佬做完的留名,也能看到菜鸡的我,在后面~~) 直接fn+f12吧 &lt;span&gt;连接在左边→&lt;/span&gt; &lt;a href="first.php"&gt;&lt;/a&gt; &lt;span&gt;←连接在右边&lt;/span&gt; o...
在家远程办公效率低?那你一定要收好这个「在家办公」神器!
相信大家都已经收到国务院延长春节假期的消息,接下来,在家远程办公可能将会持续一段时间。 但是问题来了。远程办公不是人在电脑前就当坐班了,相反,对于沟通效率,文件协作,以及信息安全都有着极高的要求。有着非常多的挑战,比如: 1在异地互相不见面的会议上,如何提高沟通效率? 2文件之间的来往反馈如何做到及时性?如何保证信息安全? 3如何规划安排每天工作,以及如何进行成果验收? ......
作为一个程序员,内存和磁盘的这些事情,你不得不知道啊!!!
截止目前,我已经分享了如下几篇文章: 一个程序在计算机中是如何运行的?超级干货!!! 作为一个程序员,CPU的这些硬核知识你必须会! 作为一个程序员,内存的这些硬核知识你必须懂! 这些知识可以说是我们之前都不太重视的基础知识,可能大家在上大学的时候都学习过了,但是嘞,当时由于老师讲解的没那么有趣,又加上这些知识本身就比较枯燥,所以嘞,大家当初几乎等于没学。 再说啦,学习这些,也看不出来有什么用啊!
2020年的1月,我辞掉了我的第一份工作
其实,这篇文章,我应该早点写的,毕竟现在已经2月份了。不过一些其它原因,或者是我的惰性、还有一些迷茫的念头,让自己迟迟没有试着写一点东西,记录下,或者说是总结下自己前3年的工作上的经历、学习的过程。 我自己知道的,在写自己的博客方面,我的文笔很一般,非技术类的文章不想去写;另外我又是一个还比较热衷于技术的人,而平常复杂一点的东西,如果想写文章写的清楚点,是需要足够...
别低估自己的直觉,也别高估自己的智商
所有群全部吵翻天,朋友圈全部沦陷,公众号疯狂转发。这两周没怎么发原创,只发新闻,可能有人注意到了。我不是懒,是文章写了却没发,因为大家的关注力始终在这次的疫情上面,发了也没人看。当然,我...
这个世界上人真的分三六九等,你信吗?
偶然间,在知乎上看到一个问题 一时间,勾起了我深深的回忆。 以前在厂里打过两次工,做过家教,干过辅导班,做过中介。零下几度的晚上,贴过广告,满脸、满手地长冻疮。 再回首那段岁月,虽然苦,但让我学会了坚持和忍耐。让我明白了,在这个世界上,无论环境多么的恶劣,只要心存希望,星星之火,亦可燎原。 下文是原回答,希望能对你能有所启发。 如果我说,这个世界上人真的分三六九等,...
节后首个工作日,企业们集体开晨会让钉钉挂了
By 超神经场景描述:昨天 2 月 3 日,是大部分城市号召远程工作的第一天,全国有接近 2 亿人在家开始远程办公,钉钉上也有超过 1000 万家企业活跃起来。关键词:十一出行 人脸...
Java基础知识点梳理
Java基础知识点梳理 摘要: 虽然已经在实际工作中经常与java打交道,但是一直没系统地对java这门语言进行梳理和总结,掌握的知识也比较零散。恰好利用这段时间重新认识下java,并对一些常见的语法和知识点做个总结与回顾,一方面为了加深印象,方便后面查阅,一方面为了学好java打下基础。 Java简介 java语言于1995年正式推出,最开始被命名为Oak语言,由James Gosling(詹姆
2020年全新Java学习路线图,含配套视频,学完即为中级Java程序员!!
新的一年来临,突如其来的疫情打破了平静的生活! 在家的你是否很无聊,如果无聊就来学习吧! 世上只有一种投资只赚不赔,那就是学习!!! 传智播客于2020年升级了Java学习线路图,硬核升级,免费放送! 学完你就是中级程序员,能更快一步找到工作! 一、Java基础 JavaSE基础是Java中级程序员的起点,是帮助你从小白到懂得编程的必经之路。 在Java基础板块中有6个子模块的学
B 站上有哪些很好的学习资源?
哇说起B站,在小九眼里就是宝藏般的存在,放年假宅在家时一天刷6、7个小时不在话下,更别提今年的跨年晚会,我简直是跪着看完的!! 最早大家聚在在B站是为了追番,再后来我在上面刷欧美新歌和漂亮小姐姐的舞蹈视频,最近两年我和周围的朋友们已经把B站当作学习教室了,而且学习成本还免费,真是个励志的好平台ヽ(.◕ฺˇд ˇ◕ฺ;)ノ 下面我们就来盘点一下B站上优质的学习资源: 综合类 Oeasy: 综合
如何优雅地打印一个Java对象?
你好呀,我是沉默王二,一个和黄家驹一样身高,和刘德华一样颜值的程序员。虽然已经写了十多年的 Java 代码,但仍然觉得自己是个菜鸟(请允许我惭愧一下)。 在一个月黑风高的夜晚,我思前想后,觉得再也不能这么蹉跎下去了。于是痛下决心,准备通过输出的方式倒逼输入,以此来修炼自己的内功,从而进阶成为一名真正意义上的大神。与此同时,希望这些文章能够帮助到更多的读者,让大家在学习的路上不再寂寞、空虚和冷。 ...
相关热词 c#如何定义数组列表 c#倒序读取txt文件 java代码生成c# c# tcp发送数据 c#解决时间格式带星期 c#类似hashmap c#设置istbox的值 c#获取多线程返回值 c# 包含数字 枚举 c# timespan
立即提问