于此等妳--《--{@ 2019-12-02 04:14 采纳率: 50%
浏览 1101
已采纳

Ubuntu18.04配置OPENCV3.3.1时make报错

在给Ubuntu18.04下载编译openCV3.3.1时,
参照https://blog.csdn.net/zhaoxr233/article/details/90036824
在做到make那一步时,报了以下error,在网上查询无果,不知如何解决,烦请各位大佬指点

 Linking CXX executable ../../bin/opencv_visualisation
../../lib/libopencv_core.a(hal_internal.cpp.o):在函数‘lapack_gemm32f(float const*, unsigned long, float const*, unsigned long, float, float const*, unsigned long, float, float*, unsigned long, int, int, int, int)’中:
hal_internal.cpp:(.text._Z14lapack_gemm32fPKfmS0_mfS0_mfPfmiiii+0x3d2):对‘cblas_sgemm(CBLAS_ORDER, CBLAS_TRANSPOSE, CBLAS_TRANSPOSE, int, int, int, float, float const*, int, float const*, int, float, float*, int)’未定义的引用
............
../../lib/libopencv_core.a(hal_internal.cpp.o):在函数‘lapack_gemm64fc(double const*, unsigned long, double const*, unsigned long, double, double const*, unsigned long, double, double*, unsigned long, int, int, int, int)’中:
hal_internal.cpp:(.text._Z15lapack_gemm64fcPKdmS0_mdS0_mdPdmiiii+0x29e):对‘cblas_zgemm(CBLAS_ORDER, CBLAS_TRANSPOSE, CBLAS_TRANSPOSE, int, int, int, void const*, void const*, int, void const*, int, void const*, void*, int)’未定义的引用
hal_internal.cpp:(.text._Z15lapack_gemm64fcPKdmS0_mdS0_mdPdmiiii+0x2f5):对‘cblas_cgemm(CBLAS_ORDER, CBLAS_TRANSPOSE, CBLAS_TRANSPOSE, int, int, int, void const*, void const*, int, void const*, int, void const*, void*, int)’未定义的引用
collect2: error: ld returned 1 exit status
apps/annotation/CMakeFiles/opencv_annotation.dir/build.make:119: recipe for target 'bin/opencv_annotation' failed
make[2]: *** [bin/opencv_annotation] Error 1
CMakeFiles/Makefile2:4522: recipe for target 'apps/annotation/CMakeFiles/opencv_annotation.dir/all' failed
make[1]: *** [apps/annotation/CMakeFiles/opencv_annotation.dir/all] Error 2
  • 写回答

2条回答 默认 最新

  • qq_28485527 2019-12-02 10:20
    关注
    本回答被题主选为最佳回答 , 对您是否有帮助呢?
    评论
查看更多回答(1条)

报告相同问题?

问题事件

  • 已采纳回答 2月16日

悬赏问题

  • ¥15 手机应用的时间可以修改吗
  • ¥15 docker 运行OPEN-webui异常
  • ¥15 麒麟系统如何删除光盘刻录痕迹
  • ¥15 recipe通过gem协议传的是什么
  • ¥15 TS2307: Cannot find module 'cc'.
  • ¥15 100小时学会sap 书上pp章节5.22,标准成本计算逻辑?
  • ¥50 达梦数据库误删日志文件重做DAMENG01.log启动仍然-712错误
  • ¥15 cellranger化学处理类型报错
  • ¥15 用texstudio插入图片出现下面情况,怎么办
  • ¥15 ubantu 用samba挂载windows的共享文件夹,无法挂载二级目录和修改文件